module soccer-api

go 1.15

require (
	github.com/Shopify/sarama v1.28.0
	github.com/ThreeDotsLabs/watermill v1.1.1
	github.com/ThreeDotsLabs/watermill-kafka/v2 v2.2.1
	github.com/go-sql-driver/mysql v1.5.0
	github.com/gofiber/fiber/v2 v2.3.3
	github.com/golang-migrate/migrate/v4 v4.14.1
	github.com/golang/mock v1.4.4
	github.com/huandu/go-sqlbuilder v1.10.0
	github.com/juju/errors v0.0.0-20200330140219-3fe23663418f
	github.com/juju/testing v0.0.0-20200706033705-4c23f9c453cd // indirect
	github.com/sirupsen/logrus v1.7.0
	github.com/smartystreets/goconvey v1.6.4
	github.com/stretchr/testify v1.7.0
)
