2019-01-01, 00:00-01:00 Количество ошибок: 15
2019-01-01, 01:00-02:00 Количество ошибок: 3
2019-01-01, 02:00-03:00 Количество ошибок: 7
2019-01-01, 03:00-04:00 Количество ошибок: 7
2019-01-01, 04:00-05:00 Количество ошибок: 7
2019-01-01, 05:00-06:00 Количество ошибок: 3
2019-01-02, 00:00-01:00 Количество ошибок: 11
2019-01-02, 02:00-03:00 Количество ошибок: 3
2019-01-03, 00:00-01:00 Количество ошибок: 3
2019-01-03, 01:00-02:00 Количество ошибок: 7
2019-01-03, 03:00-04:00 Количество ошибок: 3
2019-01-03, 04:00-05:00 Количество ошибок: 3
