ISIN,Code,CompanyName
GB0003753778,GOG,The Go-Ahead Group PLC
JE00BQT3MP04,MYSA,MYSALE GROUP PLC
US86764M3043,SUPA,SUNPLUS TECHNOLOGY CO LD
US86764M4033,SUPD,SUNPLUS TECHNOLOGY CO LD
CA8936621066,TGL,TRANSGLOBE ENERGY CORPORATION
