%YAML 1.1
%TAG !u! tag:unity3d.com,2011:
--- !u!1 &1010650481332573
GameObject:
  m_ObjectHideFlags: 0
  m_CorrespondingSourceObject: {fileID: 0}
  m_PrefabInstance: {fileID: 0}
  m_PrefabAsset: {fileID: 0}
  serializedVersion: 6
  m_Component:
  - component: {fileID: 7414981940853966246}
  m_Layer: 8
  m_Name: mixamorig:Head
  m_TagString: Untagged
  m_Icon: {fileID: 0}
  m_NavMeshLayer: 0
  m_StaticEditorFlags: 0
  m_IsActive: 1
--- !u!4 &7414981940853966246
Transform:
  m_ObjectHideFlags: 0
  m_CorrespondingSourceObject: {fileID: 0}
  m_PrefabInstance: {fileID: 0}
  m_PrefabAsset: {fileID: 0}
  m_GameObject: {fileID: 1010650481332573}
  m_LocalRotation: {x: 0.010387483, y: -0.022363372, z: -0.0043519093, w: 0.9996865}
  m_LocalPosition: {x: -4.132349e-10, y: 0.033849414, z: 0.003832914}
  m_LocalScale: {x: 1, y: 1, z: 1}
  m_ConstrainProportionsScale: 0
  m_Children:
  - {fileID: 3032136253794704266}
  m_Father: {fileID: 7646340945738995588}
  m_RootOrder: 0
  m_LocalEulerAnglesHint: {x: 0, y: 0, z: 0}
--- !u!1 &102925174890661788
GameObject:
  m_ObjectHideFlags: 0
  m_CorrespondingSourceObject: {fileID: 0}
  m_PrefabInstance: {fileID: 0}
  m_PrefabAsset: {fileID: 0}
  serializedVersion: 6
  m_Component:
  - component: {fileID: 3865585581088588255}
  m_Layer: 8
  m_Name: mixamorig:LeftForeArm
  m_TagString: Untagged
  m_Icon: {fileID: 0}
  m_NavMeshLayer: 0
  m_StaticEditorFlags: 0
  m_IsActive: 1
--- !u!4 &3865585581088588255
Transform:
  m_ObjectHideFlags: 0
  m_CorrespondingSourceObject: {fileID: 0}
  m_PrefabInstance: {fileID: 0}
  m_PrefabAsset: {fileID: 0}
  m_GameObject: {fileID: 102925174890661788}
  m_LocalRotation: {x: -0.07117705, y: -0.023716766, z: 0.95256627, w: -0.2949387}
  m_LocalPosition: {x: -0.0000000026586424, y: 0.080285326, z: 0.00000006942619}
  m_LocalScale: {x: 1, y: 1, z: 1}
  m_ConstrainProportionsScale: 0
  m_Children:
  - {fileID: 6447678092783633753}
  m_Father: {fileID: 7420950138441477934}
  m_RootOrder: 0
  m_LocalEulerAnglesHint: {x: 0, y: 0, z: 0}
--- !u!1 &327332322067954419
GameObject:
  m_ObjectHideFlags: 0
  m_CorrespondingSourceObject: {fileID: 0}
  m_PrefabInstance: {fileID: 0}
  m_PrefabAsset: {fileID: 0}
  serializedVersion: 6
  m_Component:
  - component: {fileID: 3800967940243391778}
  m_Layer: 8
  m_Name: mixamorig:RightShoulder
  m_TagString: Untagged
  m_Icon: {fileID: 0}
  m_NavMeshLayer: 0
  m_StaticEditorFlags: 0
  m_IsActive: 1
--- !u!4 &3800967940243391778
Transform:
  m_ObjectHideFlags: 0
  m_CorrespondingSourceObject: {fileID: 0}
  m_PrefabInstance: {fileID: 0}
  m_PrefabAsset: {fileID: 0}
  m_GameObject: {fileID: 327332322067954419}
  m_LocalRotation: {x: 0.623629, y: 0.33436915, z: -0.521017, w: 0.47731066}
  m_LocalPosition: {x: 0.022235364, y: 0.043900028, z: -0.00024179094}
  m_LocalScale: {x: 1, y: 1, z: 1}
  m_ConstrainProportionsScale: 0
  m_Children:
  - {fileID: 4931944513654695646}
  m_Father: {fileID: 3208170703727525598}
  m_RootOrder: 2
  m_LocalEulerAnglesHint: {x: 0, y: 0, z: 0}
--- !u!1 &630610149977817967
GameObject:
  m_ObjectHideFlags: 0
  m_CorrespondingSourceObject: {fileID: 0}
  m_PrefabInstance: {fileID: 0}
  m_PrefabAsset: {fileID: 0}
  serializedVersion: 6
  m_Component:
  - component: {fileID: 5789497461648916830}
  - component: {fileID: 2182593383388764272}
  - component: {fileID: 4257496716420809272}
  - component: {fileID: 1611563776673867293}
  m_Layer: 8
  m_Name: Sniper
  m_TagString: Untagged
  m_Icon: {fileID: 0}
  m_NavMeshLayer: 0
  m_StaticEditorFlags: 0
  m_IsActive: 1
--- !u!4 &5789497461648916830
Transform:
  m_ObjectHideFlags: 0
  m_CorrespondingSourceObject: {fileID: 0}
  m_PrefabInstance: {fileID: 0}
  m_PrefabAsset: {fileID: 0}
  m_GameObject: {fileID: 630610149977817967}
  m_LocalRotation: {x: -0, y: -0, z: -0, w: 1}
  m_LocalPosition: {x: 0, y: 0, z: 0}
  m_LocalScale: {x: 1.55, y: 1.55, z: 1.55}
  m_ConstrainProportionsScale: 0
  m_Children:
  - {fileID: 7138360146091616790}
  - {fileID: 7718513998093824044}
  m_Father: {fileID: 0}
  m_RootOrder: 0
  m_LocalEulerAnglesHint: {x: 0, y: 0, z: 0}
--- !u!65 &2182593383388764272
BoxCollider:
  m_ObjectHideFlags: 0
  m_CorrespondingSourceObject: {fileID: 0}
  m_PrefabInstance: {fileID: 0}
  m_PrefabAsset: {fileID: 0}
  m_GameObject: {fileID: 630610149977817967}
  m_Material: {fileID: 0}
  m_IsTrigger: 1
  m_Enabled: 1
  serializedVersion: 2
  m_Size: {x: 0.8, y: 2, z: 0.8}
  m_Center: {x: 0, y: 1, z: 0}
--- !u!114 &4257496716420809272
MonoBehaviour:
  m_ObjectHideFlags: 0
  m_CorrespondingSourceObject: {fileID: 0}
  m_PrefabInstance: {fileID: 0}
  m_PrefabAsset: {fileID: 0}
  m_GameObject: {fileID: 630610149977817967}
  m_Enabled: 1
  m_EditorHideFlags: 0
  m_Script: {fileID: 11500000, guid: f106856823f42fc4ebee584045cccc25, type: 3}
  m_Name: 
  m_EditorClassIdentifier: 
  Weapon: {fileID: 7007823911646588014}
  Animator: {fileID: 8922303574578864297}
  ReloadAnimationLength: 1
  _rightPalm: {fileID: 4632178714803785565}
--- !u!114 &1611563776673867293
MonoBehaviour:
  m_ObjectHideFlags: 0
  m_CorrespondingSourceObject: {fileID: 0}
  m_PrefabInstance: {fileID: 0}
  m_PrefabAsset: {fileID: 0}
  m_GameObject: {fileID: 630610149977817967}
  m_Enabled: 1
  m_EditorHideFlags: 0
  m_Script: {fileID: 11500000, guid: aedd16e9549f447c8deb44059966bf79, type: 3}
  m_Name: 
  m_EditorClassIdentifier: 
  _accuracy: 0.95
  _dexterity: 0.15
  _maxHealth: 100
  _maxArmor: 100
  _aimTime: 3.5
  Accuracy: 0.95
  Dexterity: 0.15
  MaxHealth: 100
  MaxArmor: 100
  AimTime: 3.5
--- !u!1 &869198241244872633
GameObject:
  m_ObjectHideFlags: 0
  m_CorrespondingSourceObject: {fileID: 0}
  m_PrefabInstance: {fileID: 0}
  m_PrefabAsset: {fileID: 0}
  serializedVersion: 6
  m_Component:
  - component: {fileID: 4632178714803785565}
  m_Layer: 8
  m_Name: mixamorig:RightHand
  m_TagString: Untagged
  m_Icon: {fileID: 0}
  m_NavMeshLayer: 0
  m_StaticEditorFlags: 0
  m_IsActive: 1
--- !u!4 &4632178714803785565
Transform:
  m_ObjectHideFlags: 0
  m_CorrespondingSourceObject: {fileID: 0}
  m_PrefabInstance: {fileID: 0}
  m_PrefabAsset: {fileID: 0}
  m_GameObject: {fileID: 869198241244872633}
  m_LocalRotation: {x: 0.057986505, y: 0.03459412, z: 0.40561822, w: 0.9115452}
  m_LocalPosition: {x: -0.00000006782252, y: 0.08757095, z: -0.00000005469567}
  m_LocalScale: {x: 1, y: 1, z: 1}
  m_ConstrainProportionsScale: 0
  m_Children: []
  m_Father: {fileID: 8235217063382213384}
  m_RootOrder: 0
  m_LocalEulerAnglesHint: {x: 0, y: 0, z: 0}
--- !u!1 &1162821600135367102
GameObject:
  m_ObjectHideFlags: 0
  m_CorrespondingSourceObject: {fileID: 0}
  m_PrefabInstance: {fileID: 0}
  m_PrefabAsset: {fileID: 0}
  serializedVersion: 6
  m_Component:
  - component: {fileID: 7138360146091616790}
  - component: {fileID: 8922303574578864297}
  m_Layer: 8
  m_Name: mesh
  m_TagString: Untagged
  m_Icon: {fileID: 0}
  m_NavMeshLayer: 0
  m_StaticEditorFlags: 0
  m_IsActive: 1
--- !u!4 &7138360146091616790
Transform:
  m_ObjectHideFlags: 0
  m_CorrespondingSourceObject: {fileID: 0}
  m_PrefabInstance: {fileID: 0}
  m_PrefabAsset: {fileID: 0}
  m_GameObject: {fileID: 1162821600135367102}
  m_LocalRotation: {x: -0, y: -0, z: -0, w: 1}
  m_LocalPosition: {x: 0, y: 0, z: 0}
  m_LocalScale: {x: 1, y: 1, z: 1}
  m_ConstrainProportionsScale: 0
  m_Children:
  - {fileID: 2031490864201418986}
  - {fileID: 1815052153395450765}
  m_Father: {fileID: 5789497461648916830}
  m_RootOrder: 0
  m_LocalEulerAnglesHint: {x: 0, y: 0, z: 0}
--- !u!95 &8922303574578864297
Animator:
  serializedVersion: 4
  m_ObjectHideFlags: 0
  m_CorrespondingSourceObject: {fileID: 0}
  m_PrefabInstance: {fileID: 0}
  m_PrefabAsset: {fileID: 0}
  m_GameObject: {fileID: 1162821600135367102}
  m_Enabled: 1
  m_Avatar: {fileID: 9000000, guid: 8a271f2fe75a5c3408ff4761d2b39f49, type: 3}
  m_Controller: {fileID: 22100000, guid: 039dfdfe15bef9c41b980c26475ecfe5, type: 2}
  m_CullingMode: 1
  m_UpdateMode: 0
  m_ApplyRootMotion: 0
  m_LinearVelocityBlending: 0
  m_StabilizeFeet: 0
  m_WarningMessage: 
  m_HasTransformHierarchy: 1
  m_AllowConstantClipSamplingOptimization: 1
  m_KeepAnimatorControllerStateOnDisable: 0
--- !u!1 &1210294408821421437
GameObject:
  m_ObjectHideFlags: 0
  m_CorrespondingSourceObject: {fileID: 0}
  m_PrefabInstance: {fileID: 0}
  m_PrefabAsset: {fileID: 0}
  serializedVersion: 6
  m_Component:
  - component: {fileID: 1975977039200094728}
  m_Layer: 8
  m_Name: mixamorig:LeftFoot
  m_TagString: Untagged
  m_Icon: {fileID: 0}
  m_NavMeshLayer: 0
  m_StaticEditorFlags: 0
  m_IsActive: 1
--- !u!4 &1975977039200094728
Transform:
  m_ObjectHideFlags: 0
  m_CorrespondingSourceObject: {fileID: 0}
  m_PrefabInstance: {fileID: 0}
  m_PrefabAsset: {fileID: 0}
  m_GameObject: {fileID: 1210294408821421437}
  m_LocalRotation: {x: 0.51297504, y: 0.113074414, z: 0.025226748, w: 0.8505495}
  m_LocalPosition: {x: 0.0000000057817564, y: 0.13324939, z: -0.00000003095793}
  m_LocalScale: {x: 1, y: 1, z: 1}
  m_ConstrainProportionsScale: 0
  m_Children:
  - {fileID: 7685426405631082511}
  m_Father: {fileID: 577752268839539330}
  m_RootOrder: 0
  m_LocalEulerAnglesHint: {x: 0, y: 0, z: 0}
--- !u!1 &2081261012628433590
GameObject:
  m_ObjectHideFlags: 0
  m_CorrespondingSourceObject: {fileID: 0}
  m_PrefabInstance: {fileID: 0}
  m_PrefabAsset: {fileID: 0}
  serializedVersion: 6
  m_Component:
  - component: {fileID: 2481374826026894577}
  m_Layer: 8
  m_Name: mixamorig:RightToeBase
  m_TagString: Untagged
  m_Icon: {fileID: 0}
  m_NavMeshLayer: 0
  m_StaticEditorFlags: 0
  m_IsActive: 1
--- !u!4 &2481374826026894577
Transform:
  m_ObjectHideFlags: 0
  m_CorrespondingSourceObject: {fileID: 0}
  m_PrefabInstance: {fileID: 0}
  m_PrefabAsset: {fileID: 0}
  m_GameObject: {fileID: 2081261012628433590}
  m_LocalRotation: {x: 0.3301501, y: -0.043175824, z: 0.015119019, w: 0.9428193}
  m_LocalPosition: {x: 0.000000016121044, y: 0.07444087, z: -0.000000009986968}
  m_LocalScale: {x: 1, y: 1, z: 1}
  m_ConstrainProportionsScale: 0
  m_Children:
  - {fileID: 3241441321489119575}
  m_Father: {fileID: 7803637691532827936}
  m_RootOrder: 0
  m_LocalEulerAnglesHint: {x: 0, y: 0, z: 0}
--- !u!1 &2118632006652555714
GameObject:
  m_ObjectHideFlags: 0
  m_CorrespondingSourceObject: {fileID: 0}
  m_PrefabInstance: {fileID: 0}
  m_PrefabAsset: {fileID: 0}
  serializedVersion: 6
  m_Component:
  - component: {fileID: 6447678092783633753}
  m_Layer: 8
  m_Name: mixamorig:LeftHand
  m_TagString: Untagged
  m_Icon: {fileID: 0}
  m_NavMeshLayer: 0
  m_StaticEditorFlags: 0
  m_IsActive: 1
--- !u!4 &6447678092783633753
Transform:
  m_ObjectHideFlags: 0
  m_CorrespondingSourceObject: {fileID: 0}
  m_PrefabInstance: {fileID: 0}
  m_PrefabAsset: {fileID: 0}
  m_GameObject: {fileID: 2118632006652555714}
  m_LocalRotation: {x: -0.32997137, y: 0.4829178, z: 0.15610184, w: 0.7959532}
  m_LocalPosition: {x: 0.000000032663053, y: 0.08762787, z: 0.00000010163052}
  m_LocalScale: {x: 1, y: 1, z: 1}
  m_ConstrainProportionsScale: 0
  m_Children: []
  m_Father: {fileID: 3865585581088588255}
  m_RootOrder: 0
  m_LocalEulerAnglesHint: {x: 0, y: 0, z: 0}
--- !u!1 &2210614241511703240
GameObject:
  m_ObjectHideFlags: 0
  m_CorrespondingSourceObject: {fileID: 0}
  m_PrefabInstance: {fileID: 0}
  m_PrefabAsset: {fileID: 0}
  serializedVersion: 6
  m_Component:
  - component: {fileID: 8235217063382213384}
  m_Layer: 8
  m_Name: mixamorig:RightForeArm
  m_TagString: Untagged
  m_Icon: {fileID: 0}
  m_NavMeshLayer: 0
  m_StaticEditorFlags: 0
  m_IsActive: 1
--- !u!4 &8235217063382213384
Transform:
  m_ObjectHideFlags: 0
  m_CorrespondingSourceObject: {fileID: 0}
  m_PrefabInstance: {fileID: 0}
  m_PrefabAsset: {fileID: 0}
  m_GameObject: {fileID: 2210614241511703240}
  m_LocalRotation: {x: 0.046253614, y: -0.061544877, z: 0.63358015, w: 0.769837}
  m_LocalPosition: {x: -0.00000004621809, y: 0.080148496, z: 0.00000018488322}
  m_LocalScale: {x: 1.0000006, y: 1, z: 1}
  m_ConstrainProportionsScale: 0
  m_Children:
  - {fileID: 4632178714803785565}
  m_Father: {fileID: 4931944513654695646}
  m_RootOrder: 0
  m_LocalEulerAnglesHint: {x: 0, y: 0, z: 0}
--- !u!1 &2265853841530705845
GameObject:
  m_ObjectHideFlags: 0
  m_CorrespondingSourceObject: {fileID: 0}
  m_PrefabInstance: {fileID: 0}
  m_PrefabAsset: {fileID: 0}
  serializedVersion: 6
  m_Component:
  - component: {fileID: 8327963711767311514}
  m_Layer: 8
  m_Name: mixamorig:LeftToe_End
  m_TagString: Untagged
  m_Icon: {fileID: 0}
  m_NavMeshLayer: 0
  m_StaticEditorFlags: 0
  m_IsActive: 1
--- !u!4 &8327963711767311514
Transform:
  m_ObjectHideFlags: 0
  m_CorrespondingSourceObject: {fileID: 0}
  m_PrefabInstance: {fileID: 0}
  m_PrefabAsset: {fileID: 0}
  m_GameObject: {fileID: 2265853841530705845}
  m_LocalRotation: {x: 0, y: -0, z: -0, w: 1}
  m_LocalPosition: {x: -0.0000000047683715, y: 0.03067995, z: 3.7252902e-11}
  m_LocalScale: {x: 1, y: 1, z: 1}
  m_ConstrainProportionsScale: 0
  m_Children: []
  m_Father: {fileID: 7685426405631082511}
  m_RootOrder: 0
  m_LocalEulerAnglesHint: {x: 0, y: 0, z: 0}
--- !u!1 &2871782287022120151
GameObject:
  m_ObjectHideFlags: 0
  m_CorrespondingSourceObject: {fileID: 0}
  m_PrefabInstance: {fileID: 0}
  m_PrefabAsset: {fileID: 0}
  serializedVersion: 6
  m_Component:
  - component: {fileID: 2446476478086041357}
  m_Layer: 8
  m_Name: mixamorig:Spine
  m_TagString: Untagged
  m_Icon: {fileID: 0}
  m_NavMeshLayer: 0
  m_StaticEditorFlags: 0
  m_IsActive: 1
--- !u!4 &2446476478086041357
Transform:
  m_ObjectHideFlags: 0
  m_CorrespondingSourceObject: {fileID: 0}
  m_PrefabInstance: {fileID: 0}
  m_PrefabAsset: {fileID: 0}
  m_GameObject: {fileID: 2871782287022120151}
  m_LocalRotation: {x: -0.030208526, y: 0.02300331, z: -0.003502177, w: 0.99927276}
  m_LocalPosition: {x: -3.7315012e-11, y: 0.036616925, z: -0.0012369844}
  m_LocalScale: {x: 1, y: 1, z: 1}
  m_ConstrainProportionsScale: 0
  m_Children:
  - {fileID: 4359790968847099123}
  m_Father: {fileID: 2031490864201418986}
  m_RootOrder: 2
  m_LocalEulerAnglesHint: {x: 0, y: 0, z: 0}
--- !u!1 &3311195078372851264
GameObject:
  m_ObjectHideFlags: 0
  m_CorrespondingSourceObject: {fileID: 0}
  m_PrefabInstance: {fileID: 0}
  m_PrefabAsset: {fileID: 0}
  serializedVersion: 6
  m_Component:
  - component: {fileID: 577752268839539330}
  m_Layer: 8
  m_Name: mixamorig:LeftLeg
  m_TagString: Untagged
  m_Icon: {fileID: 0}
  m_NavMeshLayer: 0
  m_StaticEditorFlags: 0
  m_IsActive: 1
--- !u!4 &577752268839539330
Transform:
  m_ObjectHideFlags: 0
  m_CorrespondingSourceObject: {fileID: 0}
  m_PrefabInstance: {fileID: 0}
  m_PrefabAsset: {fileID: 0}
  m_GameObject: {fileID: 3311195078372851264}
  m_LocalRotation: {x: -0.27828413, y: 0.05593927, z: -0.005783131, w: 0.95885104}
  m_LocalPosition: {x: 0.00000014126125, y: 0.15032236, z: -0.0000009117482}
  m_LocalScale: {x: 1, y: 1, z: 1}
  m_ConstrainProportionsScale: 0
  m_Children:
  - {fileID: 1975977039200094728}
  m_Father: {fileID: 2458635754405077632}
  m_RootOrder: 0
  m_LocalEulerAnglesHint: {x: 0, y: 0, z: 0}
--- !u!1 &3458478009732491570
GameObject:
  m_ObjectHideFlags: 0
  m_CorrespondingSourceObject: {fileID: 0}
  m_PrefabInstance: {fileID: 0}
  m_PrefabAsset: {fileID: 0}
  serializedVersion: 6
  m_Component:
  - component: {fileID: 7685426405631082511}
  m_Layer: 8
  m_Name: mixamorig:LeftToeBase
  m_TagString: Untagged
  m_Icon: {fileID: 0}
  m_NavMeshLayer: 0
  m_StaticEditorFlags: 0
  m_IsActive: 1
--- !u!4 &7685426405631082511
Transform:
  m_ObjectHideFlags: 0
  m_CorrespondingSourceObject: {fileID: 0}
  m_PrefabInstance: {fileID: 0}
  m_PrefabAsset: {fileID: 0}
  m_GameObject: {fileID: 3458478009732491570}
  m_LocalRotation: {x: 0.33058628, y: 0.04386315, z: -0.015383075, w: 0.94263047}
  m_LocalPosition: {x: 0.0000000015010233, y: 0.07435285, z: -0.000000018194358}
  m_LocalScale: {x: 1, y: 1, z: 1}
  m_ConstrainProportionsScale: 0
  m_Children:
  - {fileID: 8327963711767311514}
  m_Father: {fileID: 1975977039200094728}
  m_RootOrder: 0
  m_LocalEulerAnglesHint: {x: 0, y: 0, z: 0}
--- !u!1 &3697781909565660358
GameObject:
  m_ObjectHideFlags: 0
  m_CorrespondingSourceObject: {fileID: 0}
  m_PrefabInstance: {fileID: 0}
  m_PrefabAsset: {fileID: 0}
  serializedVersion: 6
  m_Component:
  - component: {fileID: 3208170703727525598}
  m_Layer: 8
  m_Name: mixamorig:Spine2
  m_TagString: Untagged
  m_Icon: {fileID: 0}
  m_NavMeshLayer: 0
  m_StaticEditorFlags: 0
  m_IsActive: 1
--- !u!4 &3208170703727525598
Transform:
  m_ObjectHideFlags: 0
  m_CorrespondingSourceObject: {fileID: 0}
  m_PrefabInstance: {fileID: 0}
  m_PrefabAsset: {fileID: 0}
  m_GameObject: {fileID: 3697781909565660358}
  m_LocalRotation: {x: 0, y: -0, z: -0, w: 1}
  m_LocalPosition: {x: -1.8698851e-11, y: 0.048850562, z: -0.0000000037421826}
  m_LocalScale: {x: 1, y: 1, z: 1}
  m_ConstrainProportionsScale: 0
  m_Children:
  - {fileID: 8297075662313241198}
  - {fileID: 7646340945738995588}
  - {fileID: 3800967940243391778}
  m_Father: {fileID: 4359790968847099123}
  m_RootOrder: 0
  m_LocalEulerAnglesHint: {x: 0, y: 0, z: 0}
--- !u!1 &4018498960821065815
GameObject:
  m_ObjectHideFlags: 0
  m_CorrespondingSourceObject: {fileID: 0}
  m_PrefabInstance: {fileID: 0}
  m_PrefabAsset: {fileID: 0}
  serializedVersion: 6
  m_Component:
  - component: {fileID: 7803637691532827936}
  m_Layer: 8
  m_Name: mixamorig:RightFoot
  m_TagString: Untagged
  m_Icon: {fileID: 0}
  m_NavMeshLayer: 0
  m_StaticEditorFlags: 0
  m_IsActive: 1
--- !u!4 &7803637691532827936
Transform:
  m_ObjectHideFlags: 0
  m_CorrespondingSourceObject: {fileID: 0}
  m_PrefabInstance: {fileID: 0}
  m_PrefabAsset: {fileID: 0}
  m_GameObject: {fileID: 4018498960821065815}
  m_LocalRotation: {x: 0.5571132, y: -0.16041347, z: -0.0027562808, w: 0.81479126}
  m_LocalPosition: {x: -0.000000023119014, y: 0.13320592, z: -0.000000057067975}
  m_LocalScale: {x: 1, y: 1, z: 1}
  m_ConstrainProportionsScale: 0
  m_Children:
  - {fileID: 2481374826026894577}
  m_Father: {fileID: 3200471221637255498}
  m_RootOrder: 0
  m_LocalEulerAnglesHint: {x: 0, y: 0, z: 0}
--- !u!1 &4324823327896063337
GameObject:
  m_ObjectHideFlags: 0
  m_CorrespondingSourceObject: {fileID: 0}
  m_PrefabInstance: {fileID: 0}
  m_PrefabAsset: {fileID: 0}
  serializedVersion: 6
  m_Component:
  - component: {fileID: 1815052153395450765}
  - component: {fileID: 4157015932207581101}
  m_Layer: 8
  m_Name: spy_tst_v2
  m_TagString: Untagged
  m_Icon: {fileID: 0}
  m_NavMeshLayer: 0
  m_StaticEditorFlags: 0
  m_IsActive: 1
--- !u!4 &1815052153395450765
Transform:
  m_ObjectHideFlags: 0
  m_CorrespondingSourceObject: {fileID: 0}
  m_PrefabInstance: {fileID: 0}
  m_PrefabAsset: {fileID: 0}
  m_GameObject: {fileID: 4324823327896063337}
  m_LocalRotation: {x: 0, y: -0, z: -0, w: 1}
  m_LocalPosition: {x: -0, y: 0, z: 0}
  m_LocalScale: {x: 2.440945, y: 2.440945, z: 2.440945}
  m_ConstrainProportionsScale: 0
  m_Children: []
  m_Father: {fileID: 7138360146091616790}
  m_RootOrder: 1
  m_LocalEulerAnglesHint: {x: 0, y: 0, z: 0}
--- !u!137 &4157015932207581101
SkinnedMeshRenderer:
  m_ObjectHideFlags: 0
  m_CorrespondingSourceObject: {fileID: 0}
  m_PrefabInstance: {fileID: 0}
  m_PrefabAsset: {fileID: 0}
  m_GameObject: {fileID: 4324823327896063337}
  m_Enabled: 1
  m_CastShadows: 1
  m_ReceiveShadows: 1
  m_DynamicOccludee: 1
  m_StaticShadowCaster: 0
  m_MotionVectors: 1
  m_LightProbeUsage: 1
  m_ReflectionProbeUsage: 1
  m_RayTracingMode: 3
  m_RayTraceProcedural: 0
  m_RenderingLayerMask: 1
  m_RendererPriority: 0
  m_Materials:
  - {fileID: 2100000, guid: 00fedecc04c964a40820d9fd1419887c, type: 2}
  m_StaticBatchInfo:
    firstSubMesh: 0
    subMeshCount: 0
  m_StaticBatchRoot: {fileID: 0}
  m_ProbeAnchor: {fileID: 0}
  m_LightProbeVolumeOverride: {fileID: 0}
  m_ScaleInLightmap: 1
  m_ReceiveGI: 1
  m_PreserveUVs: 0
  m_IgnoreNormalsForChartDetection: 0
  m_ImportantGI: 0
  m_StitchLightmapSeams: 1
  m_SelectedEditorRenderState: 3
  m_MinimumChartSize: 4
  m_AutoUVMaxDistance: 0.5
  m_AutoUVMaxAngle: 89
  m_LightmapParameters: {fileID: 0}
  m_SortingLayerID: 0
  m_SortingLayer: 0
  m_SortingOrder: 0
  serializedVersion: 2
  m_Quality: 0
  m_UpdateWhenOffscreen: 0
  m_SkinnedMotionVectors: 1
  m_Mesh: {fileID: -7185616619019963909, guid: 8a271f2fe75a5c3408ff4761d2b39f49, type: 3}
  m_Bones:
  - {fileID: 7803637691532827936}
  - {fileID: 2481374826026894577}
  - {fileID: 3200471221637255498}
  - {fileID: 6379906207823383115}
  - {fileID: 577752268839539330}
  - {fileID: 1975977039200094728}
  - {fileID: 7685426405631082511}
  - {fileID: 2458635754405077632}
  - {fileID: 2031490864201418986}
  - {fileID: 2446476478086041357}
  - {fileID: 4359790968847099123}
  - {fileID: 3800967940243391778}
  - {fileID: 4931944513654695646}
  - {fileID: 3208170703727525598}
  - {fileID: 7646340945738995588}
  - {fileID: 7414981940853966246}
  - {fileID: 8297075662313241198}
  - {fileID: 8235217063382213384}
  - {fileID: 4632178714803785565}
  - {fileID: 7420950138441477934}
  - {fileID: 3865585581088588255}
  - {fileID: 6447678092783633753}
  m_BlendShapeWeights: []
  m_RootBone: {fileID: 2031490864201418986}
  m_AABB:
    m_Center: {x: -0.011351317, y: -0.026085556, z: 0.024672084}
    m_Extent: {x: 0.16288137, y: 0.337664, z: 0.11718593}
  m_DirtyAABB: 0
--- !u!1 &4613874930883259758
GameObject:
  m_ObjectHideFlags: 0
  m_CorrespondingSourceObject: {fileID: 0}
  m_PrefabInstance: {fileID: 0}
  m_PrefabAsset: {fileID: 0}
  serializedVersion: 6
  m_Component:
  - component: {fileID: 7646340945738995588}
  m_Layer: 8
  m_Name: mixamorig:Neck
  m_TagString: Untagged
  m_Icon: {fileID: 0}
  m_NavMeshLayer: 0
  m_StaticEditorFlags: 0
  m_IsActive: 1
--- !u!4 &7646340945738995588
Transform:
  m_ObjectHideFlags: 0
  m_CorrespondingSourceObject: {fileID: 0}
  m_PrefabInstance: {fileID: 0}
  m_PrefabAsset: {fileID: 0}
  m_GameObject: {fileID: 4613874930883259758}
  m_LocalRotation: {x: 0.027602177, y: -0.022205783, z: -0.0043171057, w: 0.999363}
  m_LocalPosition: {x: 2.060479e-10, y: 0.054956775, z: -0.0000000018111771}
  m_LocalScale: {x: 1, y: 1, z: 1}
  m_ConstrainProportionsScale: 0
  m_Children:
  - {fileID: 7414981940853966246}
  m_Father: {fileID: 3208170703727525598}
  m_RootOrder: 1
  m_LocalEulerAnglesHint: {x: 0, y: 0, z: 0}
--- !u!1 &4840941694971267268
GameObject:
  m_ObjectHideFlags: 0
  m_CorrespondingSourceObject: {fileID: 0}
  m_PrefabInstance: {fileID: 0}
  m_PrefabAsset: {fileID: 0}
  serializedVersion: 6
  m_Component:
  - component: {fileID: 3200471221637255498}
  m_Layer: 8
  m_Name: mixamorig:RightLeg
  m_TagString: Untagged
  m_Icon: {fileID: 0}
  m_NavMeshLayer: 0
  m_StaticEditorFlags: 0
  m_IsActive: 1
--- !u!4 &3200471221637255498
Transform:
  m_ObjectHideFlags: 0
  m_CorrespondingSourceObject: {fileID: 0}
  m_PrefabInstance: {fileID: 0}
  m_PrefabAsset: {fileID: 0}
  m_GameObject: {fileID: 4840941694971267268}
  m_LocalRotation: {x: -0.2937702, y: -0.14508091, z: -0.02433409, w: 0.94448847}
  m_LocalPosition: {x: 0.000000043974143, y: 0.15031381, z: 0.00000011615926}
  m_LocalScale: {x: 1, y: 1, z: 1}
  m_ConstrainProportionsScale: 0
  m_Children:
  - {fileID: 7803637691532827936}
  m_Father: {fileID: 6379906207823383115}
  m_RootOrder: 0
  m_LocalEulerAnglesHint: {x: 0, y: 0, z: 0}
--- !u!1 &4857842317074452408
GameObject:
  m_ObjectHideFlags: 0
  m_CorrespondingSourceObject: {fileID: 0}
  m_PrefabInstance: {fileID: 0}
  m_PrefabAsset: {fileID: 0}
  serializedVersion: 6
  m_Component:
  - component: {fileID: 2031490864201418986}
  m_Layer: 8
  m_Name: mixamorig:Hips
  m_TagString: Untagged
  m_Icon: {fileID: 0}
  m_NavMeshLayer: 0
  m_StaticEditorFlags: 0
  m_IsActive: 1
--- !u!4 &2031490864201418986
Transform:
  m_ObjectHideFlags: 0
  m_CorrespondingSourceObject: {fileID: 0}
  m_PrefabInstance: {fileID: 0}
  m_PrefabAsset: {fileID: 0}
  m_GameObject: {fileID: 4857842317074452408}
  m_LocalRotation: {x: 0.041880336, y: 0.0000024508047, z: -0.000032916196, w: 0.9991226}
  m_LocalPosition: {x: -0.009687528, y: 0.8126551, z: 0.068281814}
  m_LocalScale: {x: 2.4409459, y: 2.4409456, z: 2.4409456}
  m_ConstrainProportionsScale: 0
  m_Children:
  - {fileID: 2458635754405077632}
  - {fileID: 6379906207823383115}
  - {fileID: 2446476478086041357}
  m_Father: {fileID: 7138360146091616790}
  m_RootOrder: 0
  m_LocalEulerAnglesHint: {x: 0, y: 0, z: 0}
--- !u!1 &5056013112219058092
GameObject:
  m_ObjectHideFlags: 0
  m_CorrespondingSourceObject: {fileID: 0}
  m_PrefabInstance: {fileID: 0}
  m_PrefabAsset: {fileID: 0}
  serializedVersion: 6
  m_Component:
  - component: {fileID: 6379906207823383115}
  m_Layer: 8
  m_Name: mixamorig:RightUpLeg
  m_TagString: Untagged
  m_Icon: {fileID: 0}
  m_NavMeshLayer: 0
  m_StaticEditorFlags: 0
  m_IsActive: 1
--- !u!4 &6379906207823383115
Transform:
  m_ObjectHideFlags: 0
  m_CorrespondingSourceObject: {fileID: 0}
  m_PrefabInstance: {fileID: 0}
  m_PrefabAsset: {fileID: 0}
  m_GameObject: {fileID: 5056013112219058092}
  m_LocalRotation: {x: -0.014359637, y: 0.13591379, z: 0.984717, w: -0.10795223}
  m_LocalPosition: {x: 0.031664327, y: -0.020327648, z: -0.0034652157}
  m_LocalScale: {x: 1, y: 1, z: 1}
  m_ConstrainProportionsScale: 0
  m_Children:
  - {fileID: 3200471221637255498}
  m_Father: {fileID: 2031490864201418986}
  m_RootOrder: 1
  m_LocalEulerAnglesHint: {x: 0, y: 0, z: 0}
--- !u!1 &6035522711622603007
GameObject:
  m_ObjectHideFlags: 0
  m_CorrespondingSourceObject: {fileID: 0}
  m_PrefabInstance: {fileID: 0}
  m_PrefabAsset: {fileID: 0}
  serializedVersion: 6
  m_Component:
  - component: {fileID: 7420950138441477934}
  m_Layer: 8
  m_Name: mixamorig:LeftArm
  m_TagString: Untagged
  m_Icon: {fileID: 0}
  m_NavMeshLayer: 0
  m_StaticEditorFlags: 0
  m_IsActive: 1
--- !u!4 &7420950138441477934
Transform:
  m_ObjectHideFlags: 0
  m_CorrespondingSourceObject: {fileID: 0}
  m_PrefabInstance: {fileID: 0}
  m_PrefabAsset: {fileID: 0}
  m_GameObject: {fileID: 6035522711622603007}
  m_LocalRotation: {x: 0.19178118, y: 0.031720668, z: -0.02570912, w: 0.980588}
  m_LocalPosition: {x: -0.0000000058370366, y: 0.049546022, z: 0.000000020169743}
  m_LocalScale: {x: 1, y: 1, z: 1}
  m_ConstrainProportionsScale: 0
  m_Children:
  - {fileID: 3865585581088588255}
  m_Father: {fileID: 8297075662313241198}
  m_RootOrder: 0
  m_LocalEulerAnglesHint: {x: 0, y: 0, z: 0}
--- !u!1 &6618644147836622563
GameObject:
  m_ObjectHideFlags: 0
  m_CorrespondingSourceObject: {fileID: 0}
  m_PrefabInstance: {fileID: 0}
  m_PrefabAsset: {fileID: 0}
  serializedVersion: 6
  m_Component:
  - component: {fileID: 4931944513654695646}
  m_Layer: 8
  m_Name: mixamorig:RightArm
  m_TagString: Untagged
  m_Icon: {fileID: 0}
  m_NavMeshLayer: 0
  m_StaticEditorFlags: 0
  m_IsActive: 1
--- !u!4 &4931944513654695646
Transform:
  m_ObjectHideFlags: 0
  m_CorrespondingSourceObject: {fileID: 0}
  m_PrefabInstance: {fileID: 0}
  m_PrefabAsset: {fileID: 0}
  m_GameObject: {fileID: 6618644147836622563}
  m_LocalRotation: {x: 0.35138008, y: 0.34290278, z: 0.26702282, w: 0.82924575}
  m_LocalPosition: {x: 0.0000000039378376, y: 0.049546055, z: 8.1471513e-10}
  m_LocalScale: {x: 1, y: 1, z: 1}
  m_ConstrainProportionsScale: 0
  m_Children:
  - {fileID: 8235217063382213384}
  m_Father: {fileID: 3800967940243391778}
  m_RootOrder: 0
  m_LocalEulerAnglesHint: {x: 0, y: 0, z: 0}
--- !u!1 &6655513512427894247
GameObject:
  m_ObjectHideFlags: 0
  m_CorrespondingSourceObject: {fileID: 0}
  m_PrefabInstance: {fileID: 0}
  m_PrefabAsset: {fileID: 0}
  serializedVersion: 6
  m_Component:
  - component: {fileID: 8297075662313241198}
  m_Layer: 8
  m_Name: mixamorig:LeftShoulder
  m_TagString: Untagged
  m_Icon: {fileID: 0}
  m_NavMeshLayer: 0
  m_StaticEditorFlags: 0
  m_IsActive: 1
--- !u!4 &8297075662313241198
Transform:
  m_ObjectHideFlags: 0
  m_CorrespondingSourceObject: {fileID: 0}
  m_PrefabInstance: {fileID: 0}
  m_PrefabAsset: {fileID: 0}
  m_GameObject: {fileID: 6655513512427894247}
  m_LocalRotation: {x: 0.57701844, y: -0.39042956, z: 0.6505481, w: 0.30232704}
  m_LocalPosition: {x: -0.022235371, y: 0.04390891, z: -0.00050494744}
  m_LocalScale: {x: 1, y: 1, z: 1}
  m_ConstrainProportionsScale: 0
  m_Children:
  - {fileID: 7420950138441477934}
  m_Father: {fileID: 3208170703727525598}
  m_RootOrder: 0
  m_LocalEulerAnglesHint: {x: 0, y: 0, z: 0}
--- !u!1 &6986577329233688381
GameObject:
  m_ObjectHideFlags: 0
  m_CorrespondingSourceObject: {fileID: 0}
  m_PrefabInstance: {fileID: 0}
  m_PrefabAsset: {fileID: 0}
  serializedVersion: 6
  m_Component:
  - component: {fileID: 4359790968847099123}
  m_Layer: 8
  m_Name: mixamorig:Spine1
  m_TagString: Untagged
  m_Icon: {fileID: 0}
  m_NavMeshLayer: 0
  m_StaticEditorFlags: 0
  m_IsActive: 1
--- !u!4 &4359790968847099123
Transform:
  m_ObjectHideFlags: 0
  m_CorrespondingSourceObject: {fileID: 0}
  m_PrefabInstance: {fileID: 0}
  m_PrefabAsset: {fileID: 0}
  m_GameObject: {fileID: 6986577329233688381}
  m_LocalRotation: {x: 0, y: -0, z: -0, w: 1}
  m_LocalPosition: {x: -6.023196e-11, y: 0.04274414, z: 0.0000000013740942}
  m_LocalScale: {x: 1, y: 1, z: 1}
  m_ConstrainProportionsScale: 0
  m_Children:
  - {fileID: 3208170703727525598}
  m_Father: {fileID: 2446476478086041357}
  m_RootOrder: 0
  m_LocalEulerAnglesHint: {x: 0, y: 0, z: 0}
--- !u!1 &7255236870690952911
GameObject:
  m_ObjectHideFlags: 0
  m_CorrespondingSourceObject: {fileID: 0}
  m_PrefabInstance: {fileID: 0}
  m_PrefabAsset: {fileID: 0}
  serializedVersion: 6
  m_Component:
  - component: {fileID: 3032136253794704266}
  m_Layer: 8
  m_Name: mixamorig:HeadTop_End
  m_TagString: Untagged
  m_Icon: {fileID: 0}
  m_NavMeshLayer: 0
  m_StaticEditorFlags: 0
  m_IsActive: 1
--- !u!4 &3032136253794704266
Transform:
  m_ObjectHideFlags: 0
  m_CorrespondingSourceObject: {fileID: 0}
  m_PrefabInstance: {fileID: 0}
  m_PrefabAsset: {fileID: 0}
  m_GameObject: {fileID: 7255236870690952911}
  m_LocalRotation: {x: 0, y: -0, z: -0, w: 1}
  m_LocalPosition: {x: -0, y: 0.09245101, z: 0.010468557}
  m_LocalScale: {x: 1, y: 1, z: 1}
  m_ConstrainProportionsScale: 0
  m_Children: []
  m_Father: {fileID: 7414981940853966246}
  m_RootOrder: 0
  m_LocalEulerAnglesHint: {x: 0, y: 0, z: 0}
--- !u!1 &7709686315486852275
GameObject:
  m_ObjectHideFlags: 0
  m_CorrespondingSourceObject: {fileID: 0}
  m_PrefabInstance: {fileID: 0}
  m_PrefabAsset: {fileID: 0}
  serializedVersion: 6
  m_Component:
  - component: {fileID: 2458635754405077632}
  m_Layer: 8
  m_Name: mixamorig:LeftUpLeg
  m_TagString: Untagged
  m_Icon: {fileID: 0}
  m_NavMeshLayer: 0
  m_StaticEditorFlags: 0
  m_IsActive: 1
--- !u!4 &2458635754405077632
Transform:
  m_ObjectHideFlags: 0
  m_CorrespondingSourceObject: {fileID: 0}
  m_PrefabInstance: {fileID: 0}
  m_PrefabAsset: {fileID: 0}
  m_GameObject: {fileID: 7709686315486852275}
  m_LocalRotation: {x: 0.014916358, y: 0.20215146, z: 0.97414833, w: 0.09973681}
  m_LocalPosition: {x: -0.031664327, y: -0.020327624, z: -0.0029473412}
  m_LocalScale: {x: 1, y: 1, z: 1}
  m_ConstrainProportionsScale: 0
  m_Children:
  - {fileID: 577752268839539330}
  m_Father: {fileID: 2031490864201418986}
  m_RootOrder: 0
  m_LocalEulerAnglesHint: {x: 0, y: 0, z: 0}
--- !u!1 &8034126683627906853
GameObject:
  m_ObjectHideFlags: 0
  m_CorrespondingSourceObject: {fileID: 0}
  m_PrefabInstance: {fileID: 0}
  m_PrefabAsset: {fileID: 0}
  serializedVersion: 6
  m_Component:
  - component: {fileID: 3241441321489119575}
  m_Layer: 8
  m_Name: mixamorig:RightToe_End
  m_TagString: Untagged
  m_Icon: {fileID: 0}
  m_NavMeshLayer: 0
  m_StaticEditorFlags: 0
  m_IsActive: 1
--- !u!4 &3241441321489119575
Transform:
  m_ObjectHideFlags: 0
  m_CorrespondingSourceObject: {fileID: 0}
  m_PrefabInstance: {fileID: 0}
  m_PrefabAsset: {fileID: 0}
  m_GameObject: {fileID: 8034126683627906853}
  m_LocalRotation: {x: 0, y: -0, z: -0, w: 1}
  m_LocalPosition: {x: -0, y: 0.030875506, z: -3.7252902e-11}
  m_LocalScale: {x: 1, y: 1, z: 1}
  m_ConstrainProportionsScale: 0
  m_Children: []
  m_Father: {fileID: 2481374826026894577}
  m_RootOrder: 0
  m_LocalEulerAnglesHint: {x: 0, y: 0, z: 0}
--- !u!1001 &4686088859526046186
PrefabInstance:
  m_ObjectHideFlags: 0
  serializedVersion: 2
  m_Modification:
    m_TransformParent: {fileID: 5789497461648916830}
    m_Modifications:
    - target: {fileID: 2042887151761341609, guid: 62f195ba45dd7a34c8646717720a76ff, type: 3}
      propertyPath: m_Layer
      value: 8
      objectReference: {fileID: 0}
    - target: {fileID: 2952856303988018656, guid: 62f195ba45dd7a34c8646717720a76ff, type: 3}
      propertyPath: m_Name
      value: PREFAB_sniper_v2
      objectReference: {fileID: 0}
    - target: {fileID: 2952856303988018656, guid: 62f195ba45dd7a34c8646717720a76ff, type: 3}
      propertyPath: m_Layer
      value: 8
      objectReference: {fileID: 0}
    - target: {fileID: 3027143332794420922, guid: 62f195ba45dd7a34c8646717720a76ff, type: 3}
      propertyPath: m_LocalPosition.x
      value: -0.108000465
      objectReference: {fileID: 0}
    - target: {fileID: 3027143332794420922, guid: 62f195ba45dd7a34c8646717720a76ff, type: 3}
      propertyPath: m_LocalPosition.y
      value: 0.050137356
      objectReference: {fileID: 0}
    - target: {fileID: 3027143332794420922, guid: 62f195ba45dd7a34c8646717720a76ff, type: 3}
      propertyPath: m_LocalPosition.z
      value: 0.3980015
      objectReference: {fileID: 0}
    - target: {fileID: 3027143332794420922, guid: 62f195ba45dd7a34c8646717720a76ff, type: 3}
      propertyPath: m_LocalRotation.w
      value: 0.7119226
      objectReference: {fileID: 0}
    - target: {fileID: 3027143332794420922, guid: 62f195ba45dd7a34c8646717720a76ff, type: 3}
      propertyPath: m_LocalRotation.x
      value: -0.6928391
      objectReference: {fileID: 0}
    - target: {fileID: 3027143332794420922, guid: 62f195ba45dd7a34c8646717720a76ff, type: 3}
      propertyPath: m_LocalRotation.y
      value: -0.082150094
      objectReference: {fileID: 0}
    - target: {fileID: 3027143332794420922, guid: 62f195ba45dd7a34c8646717720a76ff, type: 3}
      propertyPath: m_LocalRotation.z
      value: -0.07994801
      objectReference: {fileID: 0}
    - target: {fileID: 3027143332794420922, guid: 62f195ba45dd7a34c8646717720a76ff, type: 3}
      propertyPath: m_LocalEulerAnglesHint.x
      value: -88.44401
      objectReference: {fileID: 0}
    - target: {fileID: 3027143332794420922, guid: 62f195ba45dd7a34c8646717720a76ff, type: 3}
      propertyPath: m_LocalEulerAnglesHint.y
      value: -13.165001
      objectReference: {fileID: 0}
    - target: {fileID: 3027143332794420922, guid: 62f195ba45dd7a34c8646717720a76ff, type: 3}
      propertyPath: m_LocalEulerAnglesHint.z
      value: 0
      objectReference: {fileID: 0}
    - target: {fileID: 3032610760669008326, guid: 62f195ba45dd7a34c8646717720a76ff, type: 3}
      propertyPath: m_RootOrder
      value: 1
      objectReference: {fileID: 0}
    - target: {fileID: 3032610760669008326, guid: 62f195ba45dd7a34c8646717720a76ff, type: 3}
      propertyPath: m_LocalPosition.x
      value: 0
      objectReference: {fileID: 0}
    - target: {fileID: 3032610760669008326, guid: 62f195ba45dd7a34c8646717720a76ff, type: 3}
      propertyPath: m_LocalPosition.y
      value: 0
      objectReference: {fileID: 0}
    - target: {fileID: 3032610760669008326, guid: 62f195ba45dd7a34c8646717720a76ff, type: 3}
      propertyPath: m_LocalPosition.z
      value: 0
      objectReference: {fileID: 0}
    - target: {fileID: 3032610760669008326, guid: 62f195ba45dd7a34c8646717720a76ff, type: 3}
      propertyPath: m_LocalRotation.w
      value: 1
      objectReference: {fileID: 0}
    - target: {fileID: 3032610760669008326, guid: 62f195ba45dd7a34c8646717720a76ff, type: 3}
      propertyPath: m_LocalRotation.x
      value: 0
      objectReference: {fileID: 0}
    - target: {fileID: 3032610760669008326, guid: 62f195ba45dd7a34c8646717720a76ff, type: 3}
      propertyPath: m_LocalRotation.y
      value: 0
      objectReference: {fileID: 0}
    - target: {fileID: 3032610760669008326, guid: 62f195ba45dd7a34c8646717720a76ff, type: 3}
      propertyPath: m_LocalRotation.z
      value: 0
      objectReference: {fileID: 0}
    - target: {fileID: 3032610760669008326, guid: 62f195ba45dd7a34c8646717720a76ff, type: 3}
      propertyPath: m_LocalEulerAnglesHint.x
      value: 0
      objectReference: {fileID: 0}
    - target: {fileID: 3032610760669008326, guid: 62f195ba45dd7a34c8646717720a76ff, type: 3}
      propertyPath: m_LocalEulerAnglesHint.y
      value: 0
      objectReference: {fileID: 0}
    - target: {fileID: 3032610760669008326, guid: 62f195ba45dd7a34c8646717720a76ff, type: 3}
      propertyPath: m_LocalEulerAnglesHint.z
      value: 0
      objectReference: {fileID: 0}
    - target: {fileID: 9121458888698348562, guid: 62f195ba45dd7a34c8646717720a76ff, type: 3}
      propertyPath: m_LocalPosition.x
      value: -0.25647166
      objectReference: {fileID: 0}
    - target: {fileID: 9121458888698348562, guid: 62f195ba45dd7a34c8646717720a76ff, type: 3}
      propertyPath: m_LocalPosition.y
      value: 0.037424065
      objectReference: {fileID: 0}
    - target: {fileID: 9121458888698348562, guid: 62f195ba45dd7a34c8646717720a76ff, type: 3}
      propertyPath: m_LocalPosition.z
      value: 1.0327635
      objectReference: {fileID: 0}
    - target: {fileID: 9121458888698348562, guid: 62f195ba45dd7a34c8646717720a76ff, type: 3}
      propertyPath: m_LocalRotation.w
      value: 0.6213317
      objectReference: {fileID: 0}
    - target: {fileID: 9121458888698348562, guid: 62f195ba45dd7a34c8646717720a76ff, type: 3}
      propertyPath: m_LocalRotation.x
      value: 0.010642849
      objectReference: {fileID: 0}
    - target: {fileID: 9121458888698348562, guid: 62f195ba45dd7a34c8646717720a76ff, type: 3}
      propertyPath: m_LocalRotation.y
      value: -0.7834299
      objectReference: {fileID: 0}
    - target: {fileID: 9121458888698348562, guid: 62f195ba45dd7a34c8646717720a76ff, type: 3}
      propertyPath: m_LocalRotation.z
      value: -0.008440777
      objectReference: {fileID: 0}
    - target: {fileID: 9121458888698348562, guid: 62f195ba45dd7a34c8646717720a76ff, type: 3}
      propertyPath: m_LocalEulerAnglesHint.y
      value: -103.16501
      objectReference: {fileID: 0}
    - target: {fileID: 9121458888698348562, guid: 62f195ba45dd7a34c8646717720a76ff, type: 3}
      propertyPath: m_LocalEulerAnglesHint.z
      value: -1.557
      objectReference: {fileID: 0}
    - target: {fileID: 9122136651448957360, guid: 62f195ba45dd7a34c8646717720a76ff, type: 3}
      propertyPath: m_Layer
      value: 10
      objectReference: {fileID: 0}
    - target: {fileID: 9122136653994053380, guid: 62f195ba45dd7a34c8646717720a76ff, type: 3}
      propertyPath: m_Layer
      value: 10
      objectReference: {fileID: 0}
    - target: {fileID: 9123704169938456744, guid: 62f195ba45dd7a34c8646717720a76ff, type: 3}
      propertyPath: m_Layer
      value: 10
      objectReference: {fileID: 0}
    - target: {fileID: 9124230665685844498, guid: 62f195ba45dd7a34c8646717720a76ff, type: 3}
      propertyPath: m_Layer
      value: 10
      objectReference: {fileID: 0}
    m_RemovedComponents: []
  m_SourcePrefab: {fileID: 100100000, guid: 62f195ba45dd7a34c8646717720a76ff, type: 3}
--- !u!114 &7007823911646588014 stripped
MonoBehaviour:
  m_CorrespondingSourceObject: {fileID: 2326283250749263236, guid: 62f195ba45dd7a34c8646717720a76ff, type: 3}
  m_PrefabInstance: {fileID: 4686088859526046186}
  m_PrefabAsset: {fileID: 0}
  m_GameObject: {fileID: 0}
  m_Enabled: 1
  m_EditorHideFlags: 0
  m_Script: {fileID: 11500000, guid: f2450383c78e4f9fa453d2d1004ffb55, type: 3}
  m_Name: 
  m_EditorClassIdentifier: 
--- !u!4 &7718513998093824044 stripped
Transform:
  m_CorrespondingSourceObject: {fileID: 3032610760669008326, guid: 62f195ba45dd7a34c8646717720a76ff, type: 3}
  m_PrefabInstance: {fileID: 4686088859526046186}
  m_PrefabAsset: {fileID: 0}
