{
    "hp": 50.0,
    "hpRegen": 1.0,
    "attack": 30.0,
    "attackSpeed": 0.6000000238418579,
    "attackRange": 5.0,
    "moveSpeed": 3.0,
    "moneyReward": 10,
    "unitNameKey": "UNIT_COLD_MAGE_NAME",
    "unitDescriptionKey": "",
    "faction": 4,
    "manaCost": 55,
    "openLevel": 10,
    "effectorsStatValues": {
        "entries": [
            {
                "key": "slowdownFactor",
                "value": 0.5
            },
            {
                "key": "slowdownTime",
                "value": 2.0
            },
            {
                "key": "fireMageDamageFactor",
                "value": 1.7000000476837159
            }
        ]
    }
}