{
  "port" : "3000",
  "checkTemperatureInterval" : "*/3 * * * * *",
  "storeDataInterval" : "*/3 * * * * *",
  "sensorFolder" : "./sensors",
  "sensorRegexp" : "[28]+",
  "sensorFileName" : "w1_slave",
  "database" : "./data/db/tmonitor",
  "sensorFile" : "./data/sensors.json",
  "logLevel" : "info",
  "gpios" : {
    "8" : {
      "id" : 0,
      "name" : "gpio 08",
      "value" : 0,
      "type" : "out"
    },
    "9" : {
      "id" : 9,
      "name" : "gpio 09",
      "value" : 0,
      "type" : "out"
    },
    "10" : {
      "id" : 10,
      "name" : "gpio 10",
      "value" : 0,
      "type" : "out"
    },
    "11" : {
      "id" : 11,
      "name" : "gpio 11",
      "value" : 0,
      "type" : "out"
    },
    "12" : {
      "id" : 12,
      "name" : "gpio 12",
      "value" : 0,
      "type" : "out"
    },
    "13" : {
      "id" : 13,
      "name" : "gpio 13",
      "value" : 0,
      "type" : "out"
    }
  }
}
