%!PS-Adobe-3.0 EPSF-3.0
%%Creator: cairo 1.16.0 (https://cairographics.org)
%%CreationDate: Sat Jun 19 11:01:40 2021
%%Pages: 1
%%DocumentData: Clean7Bit
%%LanguageLevel: 2
%%BoundingBox: 0 0 206 228
%%EndComments
%%BeginProlog
50 dict begin
/q { gsave } bind def
/Q { grestore } bind def
/cm { 6 array astore concat } bind def
/w { setlinewidth } bind def
/J { setlinecap } bind def
/j { setlinejoin } bind def
/M { setmiterlimit } bind def
/d { setdash } bind def
/m { moveto } bind def
/l { lineto } bind def
/c { curveto } bind def
/h { closepath } bind def
/re { exch dup neg 3 1 roll 5 3 roll moveto 0 rlineto
      0 exch rlineto 0 rlineto closepath } bind def
/S { stroke } bind def
/f { fill } bind def
/f* { eofill } bind def
/n { newpath } bind def
/W { clip } bind def
/W* { eoclip } bind def
/BT { } bind def
/ET { } bind def
/BDC { mark 3 1 roll /BDC pdfmark } bind def
/EMC { mark /EMC pdfmark } bind def
/cairo_store_point { /cairo_point_y exch def /cairo_point_x exch def } def
/Tj { show currentpoint cairo_store_point } bind def
/TJ {
  {
    dup
    type /stringtype eq
    { show } { -0.001 mul 0 cairo_font_matrix dtransform rmoveto } ifelse
  } forall
  currentpoint cairo_store_point
} bind def
/cairo_selectfont { cairo_font_matrix aload pop pop pop 0 0 6 array astore
    cairo_font exch selectfont cairo_point_x cairo_point_y moveto } bind def
/Tf { pop /cairo_font exch def /cairo_font_matrix where
      { pop cairo_selectfont } if } bind def
/Td { matrix translate cairo_font_matrix matrix concatmatrix dup
      /cairo_font_matrix exch def dup 4 get exch 5 get cairo_store_point
      /cairo_font where { pop cairo_selectfont } if } bind def
/Tm { 2 copy 8 2 roll 6 array astore /cairo_font_matrix exch def
      cairo_store_point /cairo_font where { pop cairo_selectfont } if } bind def
/g { setgray } bind def
/rg { setrgbcolor } bind def
/d1 { setcachedevice } bind def
/cairo_data_source {
  CairoDataIndex CairoData length lt
    { CairoData CairoDataIndex get /CairoDataIndex CairoDataIndex 1 add def }
    { () } ifelse
} def
/cairo_flush_ascii85_file { cairo_ascii85_file status { cairo_ascii85_file flushfile } if } def
/cairo_image { image cairo_flush_ascii85_file } def
/cairo_imagemask { imagemask cairo_flush_ascii85_file } def
%%EndProlog
%%BeginSetup
%%EndSetup
%%Page: 1 1
%%BeginPageSetup
%%PageBoundingBox: 0 0 206 228
%%EndPageSetup
q 0 0 206 228 rectclip
1 0 0 -1 0 228 cm q
1 g
203.961 122.41 m 203.988 123.352 204 124.301 204 125.25 c 204 126.199 203.988
 127.148 203.961 128.09 c 203.648 133.762 m 203.488 135.66 203.277 137.539
 203.02 139.406 c 202.074 145.008 m 201.703 146.875 201.285 148.719 200.812
 150.547 c 199.246 156.004 m 198.668 157.816 198.043 159.602 197.367 161.367
 c 195.191 166.613 m 194.418 168.344 193.594 170.051 192.727 171.73 c 189.973
 176.699 m 189.008 178.332 188 179.934 186.945 181.504 c 183.656 186.137
 m 182.516 187.648 181.332 189.129 180.109 190.574 c 176.324 194.809 m 175.023
 196.184 173.684 197.523 172.309 198.824 c 168.074 202.609 m 166.629 203.832
 165.148 205.016 163.637 206.156 c 159.004 209.445 m 157.434 210.5 155.832
 211.508 154.199 212.473 c 149.23 215.227 m 147.551 216.094 145.844 216.918
 144.113 217.691 c 138.867 219.867 m 137.102 220.543 135.316 221.168 133.504
 221.746 c 128.047 223.312 m 126.219 223.785 124.375 224.203 122.508 224.574
 c 116.906 225.52 m 115.039 225.777 113.16 225.988 111.262 226.148 c 105.59
 226.461 m 104.648 226.488 103.699 226.5 102.75 226.5 c 101.801 226.5 100.852
 226.488 99.91 226.461 c 94.238 226.148 m 92.34 225.988 90.461 225.777 88.594
 225.52 c 82.992 224.574 m 81.125 224.203 79.281 223.785 77.453 223.312 
c 71.996 221.746 m 70.184 221.168 68.398 220.543 66.633 219.867 c 61.387
 217.691 m 59.656 216.918 57.949 216.094 56.27 215.227 c 51.301 212.473 
m 49.668 211.508 48.066 210.5 46.496 209.445 c 41.863 206.156 m 40.352 205.016
 38.871 203.832 37.426 202.609 c 33.191 198.824 m 31.816 197.523 30.477 
196.184 29.176 194.809 c 25.391 190.574 m 24.168 189.129 22.984 187.648 
21.844 186.137 c 18.555 181.504 m 17.5 179.934 16.492 178.332 15.527 176.699
 c 12.773 171.73 m 11.906 170.051 11.082 168.344 10.309 166.613 c 8.133 
161.367 m 7.457 159.602 6.832 157.816 6.254 156.004 c 4.688 150.547 m 4.215
 148.719 3.797 146.875 3.426 145.008 c 2.48 139.406 m 2.223 137.539 2.012
 135.66 1.852 133.762 c 1.539 128.09 m 1.512 127.148 1.5 126.199 1.5 125.25
 c 1.5 124.301 1.512 123.352 1.539 122.41 c 1.852 116.738 m 2.012 114.84
 2.223 112.961 2.48 111.094 c 3.426 105.492 m 3.797 103.625 4.215 101.781
 4.688 99.953 c 6.254 94.496 m 6.832 92.684 7.457 90.898 8.133 89.133 c 
10.309 83.887 m 11.082 82.156 11.906 80.449 12.773 78.77 c 15.527 73.801
 m 16.492 72.168 17.5 70.566 18.555 68.996 c 21.844 64.363 m 22.984 62.852
 24.168 61.371 25.391 59.926 c 29.176 55.691 m 30.477 54.316 31.816 52.977
 33.191 51.676 c 37.426 47.891 m 38.871 46.668 40.352 45.484 41.863 44.344
 c 46.496 41.055 m 48.066 40 49.668 38.992 51.301 38.027 c 56.27 35.273 
m 57.949 34.406 59.656 33.582 61.387 32.809 c 66.633 30.633 m 68.398 29.957
 70.184 29.332 71.996 28.754 c 77.453 27.188 m 79.281 26.715 81.125 26.297
 82.992 25.926 c 88.594 24.98 m 90.461 24.723 92.34 24.512 94.238 24.352
 c 99.91 24.039 m 100.852 24.012 101.801 24 102.75 24 c 103.699 24 104.648
 24.012 105.59 24.039 c 111.262 24.352 m 113.16 24.512 115.039 24.723 116.906
 24.98 c 122.508 25.926 m 124.375 26.297 126.219 26.715 128.047 27.188 c
 133.504 28.754 m 135.316 29.332 137.102 29.957 138.867 30.633 c 144.113
 32.809 m 145.844 33.582 147.551 34.406 149.23 35.273 c 154.199 38.027 m
 155.832 38.992 157.434 40 159.004 41.055 c 163.637 44.344 m 165.148 45.484
 166.629 46.668 168.074 47.891 c 172.309 51.676 m 173.684 52.977 175.023
 54.316 176.324 55.691 c 180.109 59.926 m 181.332 61.371 182.516 62.852 
183.656 64.363 c 186.945 68.996 m 188 70.566 189.008 72.168 189.973 73.801
 c 192.727 78.77 m 193.594 80.449 194.418 82.156 195.191 83.887 c 197.367
 89.133 m 198.043 90.898 198.668 92.684 199.246 94.496 c 200.812 99.953 
m 201.285 101.781 201.703 103.625 202.074 105.492 c 203.02 111.094 m 203.277
 112.961 203.488 114.84 203.648 116.738 c 203.961 122.41 m 203.988 123.352
 204 124.301 204 125.25 c f
0.137255 0.266667 0.364706 rg
3 w
0 J
0 j
[] 0.0 d
4 M q 1 0 0 1 0 0 cm
203.961 122.41 m 203.988 123.352 204 124.301 204 125.25 c 204 126.199 203.988
 127.148 203.961 128.09 c 203.648 133.762 m 203.488 135.66 203.277 137.539
 203.02 139.406 c 202.074 145.008 m 201.703 146.875 201.285 148.719 200.812
 150.547 c 199.246 156.004 m 198.668 157.816 198.043 159.602 197.367 161.367
 c 195.191 166.613 m 194.418 168.344 193.594 170.051 192.727 171.73 c 189.973
 176.699 m 189.008 178.332 188 179.934 186.945 181.504 c 183.656 186.137
 m 182.516 187.648 181.332 189.129 180.109 190.574 c 176.324 194.809 m 175.023
 196.184 173.684 197.523 172.309 198.824 c 168.074 202.609 m 166.629 203.832
 165.148 205.016 163.637 206.156 c 159.004 209.445 m 157.434 210.5 155.832
 211.508 154.199 212.473 c 149.23 215.227 m 147.551 216.094 145.844 216.918
 144.113 217.691 c 138.867 219.867 m 137.102 220.543 135.316 221.168 133.504
 221.746 c 128.047 223.312 m 126.219 223.785 124.375 224.203 122.508 224.574
 c 116.906 225.52 m 115.039 225.777 113.16 225.988 111.262 226.148 c 105.59
 226.461 m 104.648 226.488 103.699 226.5 102.75 226.5 c 101.801 226.5 100.852
 226.488 99.91 226.461 c 94.238 226.148 m 92.34 225.988 90.461 225.777 88.594
 225.52 c 82.992 224.574 m 81.125 224.203 79.281 223.785 77.453 223.312 
c 71.996 221.746 m 70.184 221.168 68.398 220.543 66.633 219.867 c 61.387
 217.691 m 59.656 216.918 57.949 216.094 56.27 215.227 c 51.301 212.473 
m 49.668 211.508 48.066 210.5 46.496 209.445 c 41.863 206.156 m 40.352 205.016
 38.871 203.832 37.426 202.609 c 33.191 198.824 m 31.816 197.523 30.477 
196.184 29.176 194.809 c 25.391 190.574 m 24.168 189.129 22.984 187.648 
21.844 186.137 c 18.555 181.504 m 17.5 179.934 16.492 178.332 15.527 176.699
 c 12.773 171.73 m 11.906 170.051 11.082 168.344 10.309 166.613 c 8.133 
161.367 m 7.457 159.602 6.832 157.816 6.254 156.004 c 4.688 150.547 m 4.215
 148.719 3.797 146.875 3.426 145.008 c 2.48 139.406 m 2.223 137.539 2.012
 135.66 1.852 133.762 c 1.539 128.09 m 1.512 127.148 1.5 126.199 1.5 125.25
 c 1.5 124.301 1.512 123.352 1.539 122.41 c 1.852 116.738 m 2.012 114.84
 2.223 112.961 2.48 111.094 c 3.426 105.492 m 3.797 103.625 4.215 101.781
 4.688 99.953 c 6.254 94.496 m 6.832 92.684 7.457 90.898 8.133 89.133 c 
10.309 83.887 m 11.082 82.156 11.906 80.449 12.773 78.77 c 15.527 73.801
 m 16.492 72.168 17.5 70.566 18.555 68.996 c 21.844 64.363 m 22.984 62.852
 24.168 61.371 25.391 59.926 c 29.176 55.691 m 30.477 54.316 31.816 52.977
 33.191 51.676 c 37.426 47.891 m 38.871 46.668 40.352 45.484 41.863 44.344
 c 46.496 41.055 m 48.066 40 49.668 38.992 51.301 38.027 c 56.27 35.273 
m 57.949 34.406 59.656 33.582 61.387 32.809 c 66.633 30.633 m 68.398 29.957
 70.184 29.332 71.996 28.754 c 77.453 27.188 m 79.281 26.715 81.125 26.297
 82.992 25.926 c 88.594 24.98 m 90.461 24.723 92.34 24.512 94.238 24.352
 c 99.91 24.039 m 100.852 24.012 101.801 24 102.75 24 c 103.699 24 104.648
 24.012 105.59 24.039 c 111.262 24.352 m 113.16 24.512 115.039 24.723 116.906
 24.98 c 122.508 25.926 m 124.375 26.297 126.219 26.715 128.047 27.188 c
 133.504 28.754 m 135.316 29.332 137.102 29.957 138.867 30.633 c 144.113
 32.809 m 145.844 33.582 147.551 34.406 149.23 35.273 c 154.199 38.027 m
 155.832 38.992 157.434 40 159.004 41.055 c 163.637 44.344 m 165.148 45.484
 166.629 46.668 168.074 47.891 c 172.309 51.676 m 173.684 52.977 175.023
 54.316 176.324 55.691 c 180.109 59.926 m 181.332 61.371 182.516 62.852 
183.656 64.363 c 186.945 68.996 m 188 70.566 189.008 72.168 189.973 73.801
 c 192.727 78.77 m 193.594 80.449 194.418 82.156 195.191 83.887 c 197.367
 89.133 m 198.043 90.898 198.668 92.684 199.246 94.496 c 200.812 99.953 
m 201.285 101.781 201.703 103.625 202.074 105.492 c 203.02 111.094 m 203.277
 112.961 203.488 114.84 203.648 116.738 c 203.961 122.41 m 203.988 123.352
 204 124.301 204 125.25 c S Q
0 0.313726 0.45098 rg
10 M q 0 1 -1 0 0 0 cm
164.25 -99 m 187.5 -99 l 200.25 -76.5 l 187.5 -54 l 164.25 -54 l 151.5 
-76.5 l h
164.25 -99 m S Q
69.434 169.012 m 69.156 169.98 l 70.828 170.469 l 71.113 171.637 l 70.988
 171.766 70.949 171.953 71.004 172.125 c 73.004 178.477 l 73.074 178.688
 73.266 178.828 73.484 178.828 c 74.371 178.828 l 74.012 179.559 l 73.988
 179.559 73.965 179.559 73.941 179.559 c 72.984 179.559 72.188 180.344 72.188
 181.305 c 72.188 182.266 72.984 183.059 73.941 183.059 c 74.73 183.059 
75.406 182.527 75.613 181.801 c 79.172 181.801 l 79.379 182.527 80.055 183.059
 80.852 183.059 c 81.809 183.059 82.598 182.273 82.598 181.312 c 82.598 
180.352 81.809 179.559 80.852 179.559 c 80.062 179.559 79.395 180.082 79.176
 180.797 c 75.613 180.797 l 75.504 180.426 75.27 180.113 74.969 179.895 
c 75.496 178.828 l 81.129 178.828 l 81.344 178.828 81.539 178.688 81.609
 178.477 c 83.641 172.125 l 83.691 171.977 83.664 171.809 83.574 171.676
 c 83.477 171.547 83.324 171.473 83.16 171.473 c 72.113 171.473 l 71.738
 169.941 l 71.691 169.77 71.566 169.637 71.391 169.582 c h
72.172 172.477 m 82.469 172.477 l 80.762 177.824 l 73.859 177.824 l h
73.941 180.562 m 74.355 180.562 74.684 180.891 74.684 181.305 c 74.684 
181.727 74.355 182.047 73.941 182.047 c 73.523 182.047 73.199 181.727 73.199
 181.305 c 73.199 180.891 73.523 180.562 73.941 180.562 c h
80.852 180.57 m 81.262 180.57 81.594 180.898 81.594 181.312 c 81.594 181.734
 81.262 182.055 80.852 182.055 c 80.43 182.055 80.109 181.734 80.109 181.312
 c 80.109 180.898 80.43 180.57 80.852 180.57 c h
69.711 162.75 m 69.711 165.426 l 67.664 165.426 l 66.781 165.426 66.051
 166.156 66.051 167.039 c 66.051 169.078 l 63.406 169.078 l 63.406 170.086
 l 66.051 170.086 l 66.051 172.23 l 63.406 172.23 l 63.406 173.242 l 66.051
 173.242 l 66.051 175.371 l 63.406 175.371 l 63.406 176.387 l 66.051 176.387
 l 66.051 178.531 l 63.406 178.531 l 63.406 179.535 l 66.051 179.535 l 66.051
 181.656 l 63.406 181.656 l 63.406 182.672 l 66.051 182.672 l 66.051 184.746
 l 66.051 185.633 66.781 186.359 67.664 186.359 c 69.711 186.359 l 69.711
 189 l 70.719 189 l 70.719 186.359 l 72.863 186.359 l 72.863 189 l 73.875
 189 l 73.875 186.359 l 76.02 186.359 l 76.02 189 l 77.023 189 l 77.023 
186.359 l 79.176 186.359 l 79.176 189 l 80.184 189 l 80.184 186.359 l 82.297
 186.359 l 82.297 189 l 83.309 189 l 83.309 186.359 l 85.344 186.359 l 86.227
 186.359 86.953 185.633 86.953 184.746 c 86.953 182.672 l 89.594 182.672
 l 89.594 181.656 l 86.953 181.656 l 86.953 179.535 l 89.594 179.535 l 89.594
 178.531 l 86.953 178.531 l 86.953 176.387 l 89.594 176.387 l 89.594 175.371
 l 86.953 175.371 l 86.953 173.242 l 89.594 173.242 l 89.594 172.23 l 86.953
 172.23 l 86.953 170.086 l 89.594 170.086 l 89.594 169.078 l 86.953 169.078
 l 86.953 167.039 l 86.953 166.156 86.227 165.426 85.344 165.426 c 83.309
 165.426 l 83.309 162.75 l 82.297 162.75 l 82.297 165.426 l 80.184 165.426
 l 80.184 162.75 l 79.176 162.75 l 79.176 165.426 l 77.023 165.426 l 77.023
 162.75 l 76.02 162.75 l 76.02 165.426 l 73.875 165.426 l 73.875 162.75 
l 72.863 162.75 l 72.863 165.426 l 70.719 165.426 l 70.719 162.75 l h
67.664 166.434 m 85.344 166.434 l 85.688 166.434 85.949 166.695 85.949 
167.039 c 85.949 184.746 l 85.949 185.094 85.688 185.355 85.344 185.355 
c 67.664 185.355 l 67.32 185.355 67.059 185.094 67.059 184.746 c 67.059 
167.039 l 67.059 166.695 67.32 166.434 67.664 166.434 c h
67.664 166.434 m f
123.809 169.012 m 123.531 169.98 l 125.203 170.469 l 125.488 171.637 l 
125.363 171.766 125.324 171.953 125.379 172.125 c 127.379 178.477 l 127.449
 178.688 127.641 178.828 127.859 178.828 c 128.746 178.828 l 128.387 179.559
 l 128.363 179.559 128.34 179.559 128.316 179.559 c 127.359 179.559 126.562
 180.344 126.562 181.305 c 126.562 182.266 127.359 183.059 128.316 183.059
 c 129.105 183.059 129.781 182.527 129.988 181.801 c 133.547 181.801 l 133.754
 182.527 134.43 183.059 135.227 183.059 c 136.184 183.059 136.973 182.273
 136.973 181.312 c 136.973 180.352 136.184 179.559 135.227 179.559 c 134.438
 179.559 133.77 180.082 133.551 180.797 c 129.988 180.797 l 129.879 180.426
 129.645 180.113 129.344 179.895 c 129.871 178.828 l 135.504 178.828 l 135.719
 178.828 135.914 178.688 135.984 178.477 c 138.016 172.125 l 138.066 171.977
 138.039 171.809 137.949 171.676 c 137.852 171.547 137.699 171.473 137.535
 171.473 c 126.488 171.473 l 126.113 169.941 l 126.066 169.77 125.941 169.637
 125.766 169.582 c h
126.547 172.477 m 136.844 172.477 l 135.137 177.824 l 128.234 177.824 l
 h
128.316 180.562 m 128.73 180.562 129.059 180.891 129.059 181.305 c 129.059
 181.727 128.73 182.047 128.316 182.047 c 127.898 182.047 127.574 181.727
 127.574 181.305 c 127.574 180.891 127.898 180.562 128.316 180.562 c h
135.227 180.57 m 135.637 180.57 135.969 180.898 135.969 181.312 c 135.969
 181.734 135.637 182.055 135.227 182.055 c 134.805 182.055 134.484 181.734
 134.484 181.312 c 134.484 180.898 134.805 180.57 135.227 180.57 c h
124.086 162.75 m 124.086 165.426 l 122.039 165.426 l 121.156 165.426 120.426
 166.156 120.426 167.039 c 120.426 169.078 l 117.781 169.078 l 117.781 170.086
 l 120.426 170.086 l 120.426 172.23 l 117.781 172.23 l 117.781 173.242 l
 120.426 173.242 l 120.426 175.371 l 117.781 175.371 l 117.781 176.387 l
 120.426 176.387 l 120.426 178.531 l 117.781 178.531 l 117.781 179.535 l
 120.426 179.535 l 120.426 181.656 l 117.781 181.656 l 117.781 182.672 l
 120.426 182.672 l 120.426 184.746 l 120.426 185.633 121.156 186.359 122.039
 186.359 c 124.086 186.359 l 124.086 189 l 125.094 189 l 125.094 186.359
 l 127.238 186.359 l 127.238 189 l 128.25 189 l 128.25 186.359 l 130.395
 186.359 l 130.395 189 l 131.398 189 l 131.398 186.359 l 133.551 186.359
 l 133.551 189 l 134.559 189 l 134.559 186.359 l 136.672 186.359 l 136.672
 189 l 137.684 189 l 137.684 186.359 l 139.719 186.359 l 140.602 186.359
 141.328 185.633 141.328 184.746 c 141.328 182.672 l 143.969 182.672 l 143.969
 181.656 l 141.328 181.656 l 141.328 179.535 l 143.969 179.535 l 143.969
 178.531 l 141.328 178.531 l 141.328 176.387 l 143.969 176.387 l 143.969
 175.371 l 141.328 175.371 l 141.328 173.242 l 143.969 173.242 l 143.969
 172.23 l 141.328 172.23 l 141.328 170.086 l 143.969 170.086 l 143.969 169.078
 l 141.328 169.078 l 141.328 167.039 l 141.328 166.156 140.602 165.426 139.719
 165.426 c 137.684 165.426 l 137.684 162.75 l 136.672 162.75 l 136.672 165.426
 l 134.559 165.426 l 134.559 162.75 l 133.551 162.75 l 133.551 165.426 l
 131.398 165.426 l 131.398 162.75 l 130.395 162.75 l 130.395 165.426 l 128.25
 165.426 l 128.25 162.75 l 127.238 162.75 l 127.238 165.426 l 125.094 165.426
 l 125.094 162.75 l h
122.039 166.434 m 139.719 166.434 l 140.062 166.434 140.324 166.695 140.324
 167.039 c 140.324 184.746 l 140.324 185.094 140.062 185.355 139.719 185.355
 c 122.039 185.355 l 121.695 185.355 121.434 185.094 121.434 184.746 c 121.434
 167.039 l 121.434 166.695 121.695 166.434 122.039 166.434 c h
122.039 166.434 m f
1 g
122.438 167.625 16.875 16.5 re f
0 0.313726 0.45098 rg
134.828 172.754 m 134.828 174.047 134.07 175.094 133.148 175.094 c 132.219
 175.094 131.461 174.047 131.461 172.754 c 131.461 171.465 132.219 170.414
 133.148 170.414 c 134.07 170.414 134.828 171.465 134.828 172.754 c h
130.281 172.754 m 130.281 174.047 129.531 175.094 128.602 175.094 c 127.68
 175.094 126.922 174.047 126.922 172.754 c 126.922 171.465 127.68 170.414
 128.602 170.414 c 129.531 170.414 130.281 171.465 130.281 172.754 c h
133.734 181.336 m 133.734 179.152 l 133.734 178.141 133.117 177.141 132.602
 176.707 c 134.129 176.641 136.711 177.398 137.062 179.234 c 137.062 181.336
 l h
124.688 181.336 m 124.688 179.227 l 125.109 177.047 128.109 176.707 128.633
 176.707 c 129.324 176.707 132.148 177.227 132.531 179.191 c 132.531 181.336
 l h
124.688 181.336 m f
q 0 1 -1 0 0 0 cm
164.25 -153.375 m 187.5 -153.375 l 200.25 -130.875 l 187.5 -108.375 l 164.25
 -108.375 l 151.5 -130.875 l h
164.25 -153.375 m S Q
q 0 1 -1 0 0 0 cm
104.25 -181.5 m 127.5 -181.5 l 140.25 -159 l 127.5 -136.5 l 104.25 -136.5
 l 91.5 -159 l h
104.25 -181.5 m S Q
150.164 106.434 m 167.844 106.434 l 168.188 106.434 168.449 106.695 168.449
 107.039 c 168.449 124.746 l 168.449 125.094 168.188 125.355 167.844 125.355
 c 150.164 125.355 l 149.82 125.355 149.559 125.094 149.559 124.746 c 149.559
 107.039 l 149.559 106.695 149.82 106.434 150.164 106.434 c h
152.211 102.75 m 152.211 105.426 l 150.164 105.426 l 149.281 105.426 148.551
 106.156 148.551 107.039 c 148.551 109.078 l 145.906 109.078 l 145.906 110.086
 l 148.551 110.086 l 148.551 112.23 l 145.906 112.23 l 145.906 113.242 l
 148.551 113.242 l 148.551 115.371 l 145.906 115.371 l 145.906 116.387 l
 148.551 116.387 l 148.551 118.531 l 145.906 118.531 l 145.906 119.535 l
 148.551 119.535 l 148.551 121.656 l 145.906 121.656 l 145.906 122.672 l
 148.551 122.672 l 148.551 124.746 l 148.551 125.633 149.281 126.359 150.164
 126.359 c 152.211 126.359 l 152.211 129 l 153.219 129 l 153.219 126.359
 l 155.363 126.359 l 155.363 129 l 156.375 129 l 156.375 126.359 l 158.52
 126.359 l 158.52 129 l 159.523 129 l 159.523 126.359 l 161.676 126.359 
l 161.676 129 l 162.684 129 l 162.684 126.359 l 164.797 126.359 l 164.797
 129 l 165.809 129 l 165.809 126.359 l 167.844 126.359 l 168.727 126.359
 169.453 125.633 169.453 124.746 c 169.453 122.672 l 172.094 122.672 l 172.094
 121.656 l 169.453 121.656 l 169.453 119.535 l 172.094 119.535 l 172.094
 118.531 l 169.453 118.531 l 169.453 116.387 l 172.094 116.387 l 172.094
 115.371 l 169.453 115.371 l 169.453 113.242 l 172.094 113.242 l 172.094
 112.23 l 169.453 112.23 l 169.453 110.086 l 172.094 110.086 l 172.094 109.078
 l 169.453 109.078 l 169.453 107.039 l 169.453 106.156 168.727 105.426 167.844
 105.426 c 165.809 105.426 l 165.809 102.75 l 164.797 102.75 l 164.797 105.426
 l 162.684 105.426 l 162.684 102.75 l 161.676 102.75 l 161.676 105.426 l
 159.523 105.426 l 159.523 102.75 l 158.52 102.75 l 158.52 105.426 l 156.375
 105.426 l 156.375 102.75 l 155.363 102.75 l 155.363 105.426 l 153.219 105.426
 l 153.219 102.75 l h
165.676 115.566 m 165.766 115.566 165.848 115.605 165.914 115.641 c 165.922
 115.68 165.953 115.746 165.945 115.844 c 165.938 115.973 165.879 116.07
 165.887 116.062 c 165.879 116.07 165.871 116.078 165.863 116.086 c 164.781
 117.156 l 164.625 116.512 l 165.496 115.613 l 165.496 115.613 165.57 115.559
 165.676 115.559 c h
159.008 108.855 m 159.051 108.855 159.141 108.898 159.246 108.969 c 159.336
 109.086 159.324 109.266 159.234 109.371 c 158.391 110.258 l 157.703 110.094
 l 158.82 108.953 l 158.91 108.863 158.949 108.855 159.008 108.855 c h
165.742 108.75 m 165.887 108.758 165.945 108.797 165.977 108.809 c 166.117
 109.043 166.125 109.402 165.988 109.828 c 165.848 110.281 165.547 110.738
 165.375 110.91 c 165.367 110.91 165.375 110.91 165.375 110.91 c 163.043
 113.094 l 162.914 113.219 162.863 113.398 162.898 113.578 c 164.656 121.035
 l 163.824 121.883 l 161.102 115.801 l 161.031 115.656 160.906 115.547 160.738
 115.516 c 160.582 115.484 160.418 115.531 160.297 115.641 c 157.352 118.379
 l 157.246 118.477 157.184 118.605 157.184 118.746 c 157.164 122.227 l 156.871
 122.535 l 155.91 119.25 l 155.863 119.086 155.738 118.957 155.566 118.914
 c 152.332 117.977 l 152.625 117.668 l 156.098 117.676 l 156.238 117.676
 156.375 117.613 156.473 117.512 c 159.156 114.578 l 159.262 114.457 159.309
 114.293 159.277 114.137 c 159.246 113.977 159.141 113.844 158.992 113.773
 c 152.961 111.031 l 153.766 110.203 l 161.281 111.969 l 161.461 112.004
 161.641 111.953 161.766 111.816 c 164.039 109.363 l 164.039 109.359 164.047
 109.359 164.047 109.352 c 164.137 109.246 164.633 108.953 165.105 108.824
 c 165.344 108.766 165.578 108.742 165.742 108.75 c h
165.801 107.746 m 165.488 107.723 165.164 107.773 164.859 107.852 c 164.227
 108.016 163.656 108.262 163.289 108.691 c 161.227 110.918 l 159.531 110.52
 l 159.984 110.039 l 159.988 110.031 159.996 110.023 160.004 110.016 c 160.418
 109.531 160.461 108.75 159.961 108.234 c 159.945 108.219 159.922 108.203
 159.906 108.188 c 159.652 107.992 159.352 107.859 159.023 107.852 c 158.691
 107.844 158.363 107.984 158.113 108.234 c 158.109 108.234 158.109 108.234
 158.109 108.238 c 156.555 109.824 l 153.711 109.156 l 153.539 109.117 153.359
 109.172 153.234 109.297 c 151.746 110.844 l 151.637 110.961 151.582 111.129
 151.613 111.285 c 151.641 111.449 151.746 111.586 151.898 111.652 c 157.941
 114.406 l 155.879 116.664 l 152.398 116.656 l 152.266 116.656 152.129 116.715
 152.031 116.82 c 151.027 117.891 l 150.914 118.02 150.871 118.199 150.914
 118.371 c 150.961 118.539 151.094 118.672 151.262 118.719 c 155.023 119.805
 l 156.137 123.645 l 156.188 123.816 156.328 123.953 156.504 123.996 c 156.676
 124.043 156.863 123.988 156.984 123.855 c 158.023 122.789 l 158.113 122.699
 158.168 122.574 158.168 122.445 c 158.191 118.973 l 160.469 116.859 l 163.207
 122.969 l 163.273 123.121 163.418 123.227 163.574 123.254 c 163.738 123.285
 163.914 123.234 164.023 123.113 c 165.57 121.547 l 165.691 121.418 165.742
 121.246 165.703 121.074 c 165.051 118.305 l 166.574 116.797 l 166.551 116.82
 l 166.844 116.566 166.934 116.219 166.949 115.906 c 166.973 115.59 166.922
 115.273 166.711 114.988 c 166.688 114.961 166.664 114.938 166.641 114.914
 c 166.363 114.66 166.012 114.555 165.684 114.555 c 165.352 114.555 165.016
 114.652 164.762 114.914 c 164.355 115.344 l 163.949 113.633 l 166.074 111.629
 l 166.074 111.629 166.078 111.629 166.078 111.621 c 166.426 111.285 166.746
 110.754 166.949 110.137 c 167.152 109.523 167.219 108.766 166.762 108.156
 c 166.746 108.137 166.734 108.121 166.719 108.098 c 166.453 107.844 166.117
 107.762 165.801 107.746 c h
165.801 107.746 m f
q 0 1 -1 0 0 0 cm
104.25 -67.125 m 127.5 -67.125 l 140.25 -44.625 l 127.5 -22.125 l 104.25
 -22.125 l 91.5 -44.625 l h
104.25 -67.125 m S Q
37.559 109.012 m 37.281 109.98 l 38.953 110.469 l 39.238 111.637 l 39.113
 111.766 39.074 111.953 39.129 112.125 c 41.129 118.477 l 41.199 118.688
 41.391 118.828 41.609 118.828 c 42.496 118.828 l 42.137 119.559 l 42.113
 119.559 42.09 119.559 42.066 119.559 c 41.109 119.559 40.312 120.344 40.312
 121.305 c 40.312 122.266 41.109 123.059 42.066 123.059 c 42.855 123.059
 43.531 122.527 43.738 121.801 c 47.297 121.801 l 47.504 122.527 48.18 123.059
 48.977 123.059 c 49.934 123.059 50.723 122.273 50.723 121.312 c 50.723 
120.352 49.934 119.559 48.977 119.559 c 48.188 119.559 47.52 120.082 47.301
 120.797 c 43.738 120.797 l 43.629 120.426 43.395 120.113 43.094 119.895
 c 43.621 118.828 l 49.254 118.828 l 49.469 118.828 49.664 118.688 49.734
 118.477 c 51.766 112.125 l 51.816 111.977 51.789 111.809 51.699 111.676
 c 51.602 111.547 51.449 111.473 51.285 111.473 c 40.238 111.473 l 39.863
 109.941 l 39.816 109.77 39.691 109.637 39.516 109.582 c h
40.297 112.477 m 50.594 112.477 l 48.887 117.824 l 41.984 117.824 l h
42.066 120.562 m 42.48 120.562 42.809 120.891 42.809 121.305 c 42.809 121.727
 42.48 122.047 42.066 122.047 c 41.648 122.047 41.324 121.727 41.324 121.305
 c 41.324 120.891 41.648 120.562 42.066 120.562 c h
48.977 120.57 m 49.387 120.57 49.719 120.898 49.719 121.312 c 49.719 121.734
 49.387 122.055 48.977 122.055 c 48.555 122.055 48.234 121.734 48.234 121.312
 c 48.234 120.898 48.555 120.57 48.977 120.57 c h
37.836 102.75 m 37.836 105.426 l 35.789 105.426 l 34.906 105.426 34.176
 106.156 34.176 107.039 c 34.176 109.078 l 31.531 109.078 l 31.531 110.086
 l 34.176 110.086 l 34.176 112.23 l 31.531 112.23 l 31.531 113.242 l 34.176
 113.242 l 34.176 115.371 l 31.531 115.371 l 31.531 116.387 l 34.176 116.387
 l 34.176 118.531 l 31.531 118.531 l 31.531 119.535 l 34.176 119.535 l 34.176
 121.656 l 31.531 121.656 l 31.531 122.672 l 34.176 122.672 l 34.176 124.746
 l 34.176 125.633 34.906 126.359 35.789 126.359 c 37.836 126.359 l 37.836
 129 l 38.844 129 l 38.844 126.359 l 40.988 126.359 l 40.988 129 l 42 129
 l 42 126.359 l 44.145 126.359 l 44.145 129 l 45.148 129 l 45.148 126.359
 l 47.301 126.359 l 47.301 129 l 48.309 129 l 48.309 126.359 l 50.422 126.359
 l 50.422 129 l 51.434 129 l 51.434 126.359 l 53.469 126.359 l 54.352 126.359
 55.078 125.633 55.078 124.746 c 55.078 122.672 l 57.719 122.672 l 57.719
 121.656 l 55.078 121.656 l 55.078 119.535 l 57.719 119.535 l 57.719 118.531
 l 55.078 118.531 l 55.078 116.387 l 57.719 116.387 l 57.719 115.371 l 55.078
 115.371 l 55.078 113.242 l 57.719 113.242 l 57.719 112.23 l 55.078 112.23
 l 55.078 110.086 l 57.719 110.086 l 57.719 109.078 l 55.078 109.078 l 55.078
 107.039 l 55.078 106.156 54.352 105.426 53.469 105.426 c 51.434 105.426
 l 51.434 102.75 l 50.422 102.75 l 50.422 105.426 l 48.309 105.426 l 48.309
 102.75 l 47.301 102.75 l 47.301 105.426 l 45.148 105.426 l 45.148 102.75
 l 44.145 102.75 l 44.145 105.426 l 42 105.426 l 42 102.75 l 40.988 102.75
 l 40.988 105.426 l 38.844 105.426 l 38.844 102.75 l h
35.789 106.434 m 53.469 106.434 l 53.812 106.434 54.074 106.695 54.074 
107.039 c 54.074 124.746 l 54.074 125.094 53.812 125.355 53.469 125.355 
c 35.789 125.355 l 35.445 125.355 35.184 125.094 35.184 124.746 c 35.184
 107.039 l 35.184 106.695 35.445 106.434 35.789 106.434 c h
35.789 106.434 m f
1 g
35.25 108.375 18.75 15 re f
0 0.313726 0.45098 rg
38.723 110.25 m 50.527 110.25 l 51.414 110.25 52.125 110.918 52.125 111.75
 c 52.125 120 l 52.125 120.832 51.414 121.5 50.527 121.5 c 38.723 121.5 
l 37.836 121.5 37.125 120.832 37.125 120 c 37.125 111.75 l 37.125 110.918
 37.836 110.25 38.723 110.25 c h
38.723 110.25 m f
1 g
38.578 115.844 m 50.664 115.844 l 50.664 120.137 l 38.578 120.137 l h
38.578 111.621 m 50.664 111.621 l 50.664 113.078 l 38.578 113.078 l h
38.578 111.621 m f
0.137255 0.266667 0.364706 rg
0.75 w
q 1 0 0 1 0 0 cm
56.16 98.039 m 89.574 46.379 l S Q
q 1 0 0 1 0 0 cm
80.387 153.699 m 98.566 49.891 l S Q
q 1 0 0 1 0 0 cm
147.742 97.875 m 115.648 46.551 l S Q
q 1 0 0 1 0 0 cm
126.734 153.848 m 107.199 49.836 l S Q
1 g
127.125 25.875 m 127.125 39.336 116.211 50.25 102.75 50.25 c 89.289 50.25
 78.375 39.336 78.375 25.875 c 78.375 12.414 89.289 1.5 102.75 1.5 c 116.211
 1.5 127.125 12.414 127.125 25.875 c h
127.125 25.875 m f
0 0.313726 0.45098 rg
3 w
4 M q 1 0 0 1 0 0 cm
127.125 25.875 m 127.125 39.336 116.211 50.25 102.75 50.25 c 89.289 50.25
 78.375 39.336 78.375 25.875 c 78.375 12.414 89.289 1.5 102.75 1.5 c 116.211
 1.5 127.125 12.414 127.125 25.875 c h
127.125 25.875 m S Q
104.16 34.852 m 104.16 34.516 104.031 34.191 103.793 33.953 c 103.551 33.711
 103.23 33.586 102.891 33.586 c 102.547 33.586 102.234 33.711 101.992 33.953
 c 101.754 34.191 101.617 34.516 101.617 34.852 c 101.617 35.199 101.754
 35.512 101.992 35.754 c 102.473 36.234 103.312 36.234 103.793 35.754 c 
104.031 35.512 104.16 35.199 104.16 34.852 c h
101.992 26.469 m 102.473 26.949 103.312 26.949 103.793 26.469 c 104.031
 26.227 104.16 25.914 104.16 25.566 c 104.16 25.23 104.031 24.914 103.793
 24.676 c 103.551 24.426 103.23 24.301 102.891 24.301 c 102.547 24.301 102.234
 24.426 101.992 24.676 c 101.754 24.914 101.617 25.23 101.617 25.566 c 101.617
 25.914 101.754 26.227 101.992 26.469 c h
101.992 16.59 m 102.473 17.07 103.312 17.07 103.793 16.59 c 104.031 16.352
 104.16 16.035 104.16 15.691 c 104.16 15.352 104.031 15.031 103.793 14.789
 c 103.551 14.551 103.23 14.422 102.891 14.422 c 102.547 14.422 102.234 
14.551 101.992 14.789 c 101.754 15.031 101.617 15.352 101.617 15.691 c 101.617
 16.035 101.754 16.352 101.992 16.59 c h
94.816 31.344 m 94.816 30.996 94.68 30.684 94.441 30.441 c 94.191 30.195
 93.871 30.066 93.539 30.066 c 93.219 30.066 92.895 30.195 92.641 30.441
 c 92.145 30.938 92.145 31.738 92.641 32.242 c 93.141 32.738 93.945 32.738
 94.441 32.242 c 94.68 32.004 94.816 31.68 94.816 31.344 c h
92.273 21.406 m 92.273 21.742 92.398 22.066 92.641 22.305 c 93.141 22.801
 93.945 22.801 94.441 22.305 c 94.68 22.066 94.816 21.742 94.816 21.406 
c 94.816 21.066 94.68 20.746 94.441 20.504 c 94.191 20.258 93.871 20.129
 93.539 20.129 c 93.219 20.129 92.895 20.258 92.641 20.504 c 92.398 20.746
 92.273 21.066 92.273 21.406 c h
110.879 19.207 m 110.879 19.547 111.016 19.867 111.254 20.109 c 111.75 
20.602 112.551 20.602 113.047 20.109 c 113.289 19.867 113.422 19.547 113.422
 19.207 c 113.422 18.871 113.289 18.547 113.047 18.309 c 112.801 18.059 
112.477 17.941 112.156 17.941 c 111.824 17.941 111.504 18.059 111.254 18.309
 c 111.016 18.547 110.879 18.871 110.879 19.207 c h
111.254 30.594 m 111.75 31.086 112.551 31.086 113.047 30.594 c 113.551 
30.098 113.551 29.289 113.047 28.793 c 112.551 28.297 111.75 28.297 111.254
 28.793 c 110.762 29.289 110.762 30.098 111.254 30.594 c h
105.512 34.809 m 105.523 35.496 105.27 36.188 104.746 36.711 c 104.234 
37.23 103.559 37.484 102.891 37.484 c 102.219 37.484 101.543 37.23 101.031
 36.711 c 100.531 36.211 100.273 35.559 100.266 34.898 c 95.707 32.828 l
 95.617 32.953 95.52 33.082 95.398 33.195 c 94.891 33.711 94.215 33.969 
93.539 33.969 c 92.871 33.969 92.199 33.711 91.688 33.195 c 90.66 32.176
 90.66 30.512 91.688 29.484 c 91.941 29.219 92.25 29.023 92.574 28.898 c
 92.574 23.844 l 92.25 23.715 91.941 23.527 91.688 23.266 c 90.66 22.238
 90.66 20.574 91.688 19.547 c 92.707 18.516 94.371 18.516 95.398 19.547 
c 96.426 20.574 96.426 22.238 95.398 23.266 c 94.988 23.676 94.469 23.91
 93.93 23.992 c 93.93 28.746 l 94.469 28.828 94.988 29.07 95.398 29.484 
c 95.961 30.047 96.211 30.801 96.148 31.539 c 100.613 33.562 l 100.727 33.359
 100.859 33.164 101.031 33 c 101.332 32.691 101.691 32.496 102.074 32.371
 c 102.074 28.059 l 101.691 27.93 101.332 27.727 101.031 27.426 c 100.004
 26.406 100.004 24.734 101.031 23.715 c 101.324 23.414 101.684 23.219 102.074
 23.102 c 102.074 18.18 l 101.691 18.051 101.332 17.852 101.031 17.551 c
 100.004 16.523 100.004 14.859 101.031 13.836 c 102.059 12.809 103.727 12.809
 104.746 13.836 c 105.773 14.859 105.773 16.523 104.746 17.551 c 104.379
 17.926 103.914 18.156 103.426 18.262 c 103.426 23.023 l 103.922 23.121 
104.387 23.348 104.746 23.715 c 104.762 23.723 104.762 23.73 104.766 23.738
 c 109.703 20.152 l 109.344 19.207 109.539 18.105 110.297 17.348 c 111.316
 16.328 112.988 16.328 114.008 17.348 c 115.035 18.375 115.035 20.039 114.008
 21.066 c 113.496 21.578 112.824 21.832 112.156 21.832 c 111.57 21.832 110.984
 21.629 110.504 21.238 c 105.426 24.938 l 105.645 25.801 105.426 26.754 
104.746 27.426 c 104.379 27.801 103.914 28.035 103.426 28.141 c 103.426 
32.289 l 103.914 32.387 104.379 32.625 104.746 33 c 104.887 33.141 105.008
 33.293 105.113 33.457 c 109.68 30.547 l 109.359 29.633 109.559 28.566 110.297
 27.832 c 111.316 26.812 112.988 26.812 114.008 27.832 c 115.035 28.859 
115.035 30.523 114.008 31.551 c 113.496 32.062 112.824 32.316 112.156 32.316
 c 111.539 32.316 110.934 32.102 110.445 31.672 c h
95.969 39.023 m 89.184 35.941 l 89.184 15.898 l 95.969 12.66 l 95.969 16.453
 l 97.32 16.453 l 97.32 11.586 l 97.32 11.355 97.207 11.137 97.004 11.016
 c 96.809 10.891 96.562 10.875 96.352 10.973 c 88.215 14.859 l 87.977 14.969
 87.824 15.211 87.824 15.473 c 87.824 36.375 l 87.824 36.645 87.984 36.887
 88.223 36.996 c 96.367 40.695 l 96.457 40.734 96.547 40.754 96.645 40.754
 c 96.773 40.754 96.898 40.719 97.012 40.648 c 97.207 40.523 97.32 40.305
 97.32 40.078 c 97.32 35.445 l 95.969 35.445 l h
117.676 15.594 m 117.676 36.496 l 117.676 36.766 117.516 37.004 117.277
 37.117 c 109.133 40.816 l 109.043 40.852 108.953 40.875 108.855 40.875 
c 108.727 40.875 108.602 40.836 108.488 40.77 c 108.293 40.641 108.18 40.426
 108.18 40.199 c 108.18 35.445 l 109.531 35.445 l 109.531 39.141 l 116.316
 36.059 l 116.316 16.02 l 109.531 12.781 l 109.531 16.453 l 108.18 16.453
 l 108.18 11.707 l 108.18 11.477 108.293 11.258 108.496 11.129 c 108.691
 11.012 108.938 10.996 109.148 11.094 c 117.285 14.977 l 117.523 15.09 117.676
 15.328 117.676 15.594 c h
117.676 15.594 m f
0.137255 0.266667 0.364706 rg
0.75 w
10 M q 1 0 0 1 0 0 cm
66.547 157.141 m 54.578 134.609 l S Q
q 1 0 0 1 0 0 cm
140.16 129.578 m 95.34 162.172 l S Q
q 1 0 0 1 0 0 cm
99 175.875 m 108.375 175.875 l S Q
Q Q
showpage
%%Trailer
end
%%EOF
