%!PS-Adobe-3.0 EPSF-3.0
%%Creator: cairo 1.17.4 (https://cairographics.org)
%%CreationDate: Sun Jul 25 10:12:36 2021
%%Pages: 1
%%DocumentData: Clean7Bit
%%LanguageLevel: 2
%%BoundingBox: 0 0 166 146
%%EndComments
%%BeginProlog
50 dict begin
/q { gsave } bind def
/Q { grestore } bind def
/cm { 6 array astore concat } bind def
/w { setlinewidth } bind def
/J { setlinecap } bind def
/j { setlinejoin } bind def
/M { setmiterlimit } bind def
/d { setdash } bind def
/m { moveto } bind def
/l { lineto } bind def
/c { curveto } bind def
/h { closepath } bind def
/re { exch dup neg 3 1 roll 5 3 roll moveto 0 rlineto
      0 exch rlineto 0 rlineto closepath } bind def
/S { stroke } bind def
/f { fill } bind def
/f* { eofill } bind def
/n { newpath } bind def
/W { clip } bind def
/W* { eoclip } bind def
/BT { } bind def
/ET { } bind def
/BDC { mark 3 1 roll /BDC pdfmark } bind def
/EMC { mark /EMC pdfmark } bind def
/cairo_store_point { /cairo_point_y exch def /cairo_point_x exch def } def
/Tj { show currentpoint cairo_store_point } bind def
/TJ {
  {
    dup
    type /stringtype eq
    { show } { -0.001 mul 0 cairo_font_matrix dtransform rmoveto } ifelse
  } forall
  currentpoint cairo_store_point
} bind def
/cairo_selectfont { cairo_font_matrix aload pop pop pop 0 0 6 array astore
    cairo_font exch selectfont cairo_point_x cairo_point_y moveto } bind def
/Tf { pop /cairo_font exch def /cairo_font_matrix where
      { pop cairo_selectfont } if } bind def
/Td { matrix translate cairo_font_matrix matrix concatmatrix dup
      /cairo_font_matrix exch def dup 4 get exch 5 get cairo_store_point
      /cairo_font where { pop cairo_selectfont } if } bind def
/Tm { 2 copy 8 2 roll 6 array astore /cairo_font_matrix exch def
      cairo_store_point /cairo_font where { pop cairo_selectfont } if } bind def
/g { setgray } bind def
/rg { setrgbcolor } bind def
/d1 { setcachedevice } bind def
/cairo_data_source {
  CairoDataIndex CairoData length lt
    { CairoData CairoDataIndex get /CairoDataIndex CairoDataIndex 1 add def }
    { () } ifelse
} def
/cairo_flush_ascii85_file { cairo_ascii85_file status { cairo_ascii85_file flushfile } if } def
/cairo_image { image cairo_flush_ascii85_file } def
/cairo_imagemask { imagemask cairo_flush_ascii85_file } def
%%EndProlog
%%BeginSetup
%%EndSetup
%%Page: 1 1
%%BeginPageSetup
%%PageBoundingBox: 0 0 166 146
%%EndPageSetup
q 0 0 166 146 rectclip
1 0 0 -1 0 147 cm q
1 g
106.312 27 m 106.312 40.461 95.398 51.375 81.938 51.375 c 68.477 51.375
 57.562 40.461 57.562 27 c 57.562 13.539 68.477 2.625 81.938 2.625 c 95.398
 2.625 106.312 13.539 106.312 27 c h
106.312 27 m f
0 0.313726 0.45098 rg
3 w
0 J
0 j
[] 0.0 d
4 M q 1 0 0 1 0 0 cm
106.312 27 m 106.312 40.461 95.398 51.375 81.938 51.375 c 68.477 51.375
 57.562 40.461 57.562 27 c 57.562 13.539 68.477 2.625 81.938 2.625 c 95.398
 2.625 106.312 13.539 106.312 27 c h
106.312 27 m S Q
14.844 128.484 m 14.406 128.543 14.102 128.812 14.102 129.18 c 14.102 129.555
 14.461 129.824 14.844 129.93 c h
16.078 134.766 m 16.648 134.754 17.062 134.445 17.062 134.023 c 17.062 
133.508 16.441 133.238 16.078 133.184 c h
14.844 138.422 m 14.859 137.297 l 13.02 137.129 11.586 136.461 10.484 135.512
 c 12.203 133.477 l 12.887 134.062 14.012 134.602 14.863 134.723 c 14.859
 132.871 l 14.137 132.699 13.297 132.465 12.547 132.051 c 11.766 131.633
 11.047 130.934 11.023 129.57 c 10.973 128.438 11.484 127.102 12.961 126.383
 c 13.637 126.082 14.203 125.961 14.859 125.902 c 14.844 123.879 l 16.078
 123.887 l 16.078 125.926 l 17.594 126.031 19.109 126.699 19.844 127.379
 c 18.309 129.523 l 17.699 129.082 16.859 128.664 16.066 128.551 c 16.074
 130.273 l 17.062 130.484 18.27 130.844 18.938 131.332 c 19.621 131.797 
20.16 132.516 20.16 133.738 c 20.16 134.836 19.68 135.984 18.48 136.695 
c 17.863 137.047 16.934 137.297 16.074 137.34 c 16.074 138.414 l h
15.309 143.227 m 25.551 133.727 l 22.988 133.727 l 22.988 121.441 l 18.668
 122.387 12.465 122.379 7.637 121.484 c 7.637 133.727 l 5.102 133.727 l 
h
30.375 115.027 m 30.375 119.926 l 30.254 120.426 29.828 120.922 29.488 
121.238 c 29.488 122.004 l 30.375 121.402 l 30.375 127.215 l 30.234 127.828
 29.805 128.227 29.488 128.484 c 29.488 129.27 l 30.375 128.676 l 30.375
 134.422 l 30.27 135.031 29.895 135.48 29.488 135.773 c 29.488 136.539 l
 30.375 135.984 l 30.375 141.758 l 30.262 142.637 29.176 143.512 27.352 
144.277 c 23.754 145.664 19.207 146.094 15.047 146.094 c 11.91 146.094 7.559
 145.641 4.477 144.684 c 3.262 144.301 0.668 143.184 0.375 141.781 c 0.375
 135.977 l 1.266 136.574 l 1.266 135.773 l 0.969 135.539 0.523 135.137 0.375
 134.438 c 0.375 128.699 l 1.266 129.246 l 1.266 128.484 l 0.922 128.191
 0.441 127.746 0.375 127.059 c 0.375 121.41 l 1.266 122.004 l 1.266 121.191
 l 0.898 120.922 0.434 120.48 0.375 119.691 c 0.375 115.012 l 1.734 116.078
 4.238 116.82 6.113 117.18 c 9.906 117.93 11.641 118.043 16.176 118.043 
c 19.688 118.043 23.438 117.586 26.031 116.852 c 27.938 116.391 29.309 115.762
 30.375 115.027 c h
30.375 111.832 m 30.375 112.621 29.664 113.371 28.824 113.844 c 25.852 
115.461 19.98 116.191 16.449 116.191 c 12.301 116.191 7.711 115.875 4.352
 114.832 c 3.164 114.434 0.375 113.453 0.375 111.871 c 0.375 111.059 1.328
 110.211 2.578 109.68 c 5.977 108.211 10.734 107.625 15.824 107.625 c 19.539
 107.625 24.414 108.188 27.676 109.461 c 29.055 110.016 30.375 110.836 30.375
 111.832 c h
30.375 111.832 m f
5.25 118.875 20.25 25.5 re f
1 g
24.328 129.934 m 24.328 134.879 20.32 138.891 15.375 138.891 c 10.43 138.891
 6.422 134.879 6.422 129.934 c 6.422 124.988 10.43 120.98 15.375 120.98 
c 20.32 120.98 24.328 124.988 24.328 129.934 c h
24.328 129.934 m f
0 0.313726 0.45098 rg
82.344 128.484 m 81.906 128.543 81.602 128.812 81.602 129.18 c 81.602 129.555
 81.961 129.824 82.344 129.93 c h
83.578 134.766 m 84.148 134.754 84.562 134.445 84.562 134.023 c 84.562 
133.508 83.941 133.238 83.578 133.184 c h
82.344 138.422 m 82.359 137.297 l 80.52 137.129 79.086 136.461 77.984 135.512
 c 79.703 133.477 l 80.387 134.062 81.512 134.602 82.363 134.723 c 82.359
 132.871 l 81.637 132.699 80.797 132.465 80.047 132.051 c 79.266 131.633
 78.547 130.934 78.523 129.57 c 78.473 128.438 78.984 127.102 80.461 126.383
 c 81.137 126.082 81.703 125.961 82.359 125.902 c 82.344 123.879 l 83.578
 123.887 l 83.578 125.926 l 85.094 126.031 86.609 126.699 87.344 127.379
 c 85.809 129.523 l 85.199 129.082 84.359 128.664 83.566 128.551 c 83.574
 130.273 l 84.562 130.484 85.77 130.844 86.438 131.332 c 87.121 131.797 
87.66 132.516 87.66 133.738 c 87.66 134.836 87.18 135.984 85.98 136.695 
c 85.363 137.047 84.434 137.297 83.574 137.34 c 83.574 138.414 l h
82.809 143.227 m 93.051 133.727 l 90.488 133.727 l 90.488 121.441 l 86.168
 122.387 79.965 122.379 75.137 121.484 c 75.137 133.727 l 72.602 133.727
 l h
97.875 115.027 m 97.875 119.926 l 97.754 120.426 97.328 120.922 96.988 
121.238 c 96.988 122.004 l 97.875 121.402 l 97.875 127.215 l 97.734 127.828
 97.305 128.227 96.988 128.484 c 96.988 129.27 l 97.875 128.676 l 97.875
 134.422 l 97.77 135.031 97.395 135.48 96.988 135.773 c 96.988 136.539 l
 97.875 135.984 l 97.875 141.758 l 97.762 142.637 96.676 143.512 94.852 
144.277 c 91.254 145.664 86.707 146.094 82.547 146.094 c 79.41 146.094 75.059
 145.641 71.977 144.684 c 70.762 144.301 68.168 143.184 67.875 141.781 c
 67.875 135.977 l 68.766 136.574 l 68.766 135.773 l 68.469 135.539 68.023
 135.137 67.875 134.438 c 67.875 128.699 l 68.766 129.246 l 68.766 128.484
 l 68.422 128.191 67.941 127.746 67.875 127.059 c 67.875 121.41 l 68.766
 122.004 l 68.766 121.191 l 68.398 120.922 67.934 120.48 67.875 119.691 
c 67.875 115.012 l 69.234 116.078 71.738 116.82 73.613 117.18 c 77.406 117.93
 79.141 118.043 83.676 118.043 c 87.188 118.043 90.938 117.586 93.531 116.852
 c 95.438 116.391 96.809 115.762 97.875 115.027 c h
97.875 111.832 m 97.875 112.621 97.164 113.371 96.324 113.844 c 93.352 
115.461 87.48 116.191 83.949 116.191 c 79.801 116.191 75.211 115.875 71.852
 114.832 c 70.664 114.434 67.875 113.453 67.875 111.871 c 67.875 111.059
 68.828 110.211 70.078 109.68 c 73.477 108.211 78.234 107.625 83.324 107.625
 c 87.039 107.625 91.914 108.188 95.176 109.461 c 96.555 110.016 97.875 
110.836 97.875 111.832 c h
97.875 111.832 m f
72.75 118.875 20.25 25.5 re f
1 g
91.828 129.934 m 91.828 134.879 87.82 138.891 82.875 138.891 c 77.93 138.891
 73.922 134.879 73.922 129.934 c 73.922 124.988 77.93 120.98 82.875 120.98
 c 87.82 120.98 91.828 124.988 91.828 129.934 c h
91.828 129.934 m f
0 0.313726 0.45098 rg
149.844 128.484 m 149.406 128.543 149.102 128.812 149.102 129.18 c 149.102
 129.555 149.461 129.824 149.844 129.93 c h
151.078 134.766 m 151.648 134.754 152.062 134.445 152.062 134.023 c 152.062
 133.508 151.441 133.238 151.078 133.184 c h
149.844 138.422 m 149.859 137.297 l 148.02 137.129 146.586 136.461 145.484
 135.512 c 147.203 133.477 l 147.887 134.062 149.012 134.602 149.863 134.723
 c 149.859 132.871 l 149.137 132.699 148.297 132.465 147.547 132.051 c 146.766
 131.633 146.047 130.934 146.023 129.57 c 145.973 128.438 146.484 127.102
 147.961 126.383 c 148.637 126.082 149.203 125.961 149.859 125.902 c 149.844
 123.879 l 151.078 123.887 l 151.078 125.926 l 152.594 126.031 154.109 126.699
 154.844 127.379 c 153.309 129.523 l 152.699 129.082 151.859 128.664 151.066
 128.551 c 151.074 130.273 l 152.062 130.484 153.27 130.844 153.938 131.332
 c 154.621 131.797 155.16 132.516 155.16 133.738 c 155.16 134.836 154.68
 135.984 153.48 136.695 c 152.863 137.047 151.934 137.297 151.074 137.34
 c 151.074 138.414 l h
150.309 143.227 m 160.551 133.727 l 157.988 133.727 l 157.988 121.441 l
 153.668 122.387 147.465 122.379 142.637 121.484 c 142.637 133.727 l 140.102
 133.727 l h
165.375 115.027 m 165.375 119.926 l 165.254 120.426 164.828 120.922 164.488
 121.238 c 164.488 122.004 l 165.375 121.402 l 165.375 127.215 l 165.234
 127.828 164.805 128.227 164.488 128.484 c 164.488 129.27 l 165.375 128.676
 l 165.375 134.422 l 165.27 135.031 164.895 135.48 164.488 135.773 c 164.488
 136.539 l 165.375 135.984 l 165.375 141.758 l 165.262 142.637 164.176 143.512
 162.352 144.277 c 158.754 145.664 154.207 146.094 150.047 146.094 c 146.91
 146.094 142.559 145.641 139.477 144.684 c 138.262 144.301 135.668 143.184
 135.375 141.781 c 135.375 135.977 l 136.266 136.574 l 136.266 135.773 l
 135.969 135.539 135.523 135.137 135.375 134.438 c 135.375 128.699 l 136.266
 129.246 l 136.266 128.484 l 135.922 128.191 135.441 127.746 135.375 127.059
 c 135.375 121.41 l 136.266 122.004 l 136.266 121.191 l 135.898 120.922 
135.434 120.48 135.375 119.691 c 135.375 115.012 l 136.734 116.078 139.238
 116.82 141.113 117.18 c 144.906 117.93 146.641 118.043 151.176 118.043 
c 154.688 118.043 158.438 117.586 161.031 116.852 c 162.938 116.391 164.309
 115.762 165.375 115.027 c h
165.375 111.832 m 165.375 112.621 164.664 113.371 163.824 113.844 c 160.852
 115.461 154.98 116.191 151.449 116.191 c 147.301 116.191 142.711 115.875
 139.352 114.832 c 138.164 114.434 135.375 113.453 135.375 111.871 c 135.375
 111.059 136.328 110.211 137.578 109.68 c 140.977 108.211 145.734 107.625
 150.824 107.625 c 154.539 107.625 159.414 108.188 162.676 109.461 c 164.055
 110.016 165.375 110.836 165.375 111.832 c h
165.375 111.832 m f
140.25 118.875 20.25 25.5 re f
1 g
159.328 129.934 m 159.328 134.879 155.32 138.891 150.375 138.891 c 145.43
 138.891 141.422 134.879 141.422 129.934 c 141.422 124.988 145.43 120.98
 150.375 120.98 c 155.32 120.98 159.328 124.988 159.328 129.934 c h
159.328 129.934 m f
0.137255 0.266667 0.364706 rg
0.75 w
10 M q 1 0 0 1 0 0 cm
16.125 100.125 m 16.125 92.625 l 16.125 87.625 18.625 85.125 23.625 85.125
 c 75.375 85.125 l 80.375 85.125 82.875 82.625 82.875 77.625 c 82.875 59.902
 l S Q
82.875 55.965 m 85.5 61.215 l 82.875 59.902 l 80.25 61.215 l h
82.875 55.965 m f
q 1 0 0 1 0 0 cm
82.875 55.965 m 85.5 61.215 l 82.875 59.902 l 80.25 61.215 l h
82.875 55.965 m S Q
q 1 0 0 1 0 0 cm
82.875 100.125 m 82.875 59.902 l S Q
82.875 55.965 m 85.5 61.215 l 82.875 59.902 l 80.25 61.215 l h
82.875 55.965 m f
q 1 0 0 1 0 0 cm
82.875 55.965 m 85.5 61.215 l 82.875 59.902 l 80.25 61.215 l h
82.875 55.965 m S Q
q 1 0 0 1 0 0 cm
150.375 100.125 m 150.375 92.625 l 150.375 87.625 147.875 85.125 142.875
 85.125 c 90.375 85.125 l 85.375 85.125 82.875 82.625 82.875 77.625 c 82.875
 59.902 l S Q
82.875 55.965 m 85.5 61.215 l 82.875 59.902 l 80.25 61.215 l h
82.875 55.965 m f
q 1 0 0 1 0 0 cm
82.875 55.965 m 85.5 61.215 l 82.875 59.902 l 80.25 61.215 l h
82.875 55.965 m S Q
0 0.313726 0.45098 rg
0.971163 w
4 M q 1 0 0 1 0 0 cm
68.586 28.066 m 68.586 29.301 67.582 30.301 66.352 30.301 c 65.117 30.301
 64.117 29.301 64.117 28.066 c 64.117 26.836 65.117 25.836 66.352 25.836
 c 67.582 25.836 68.586 26.836 68.586 28.066 c h
68.586 28.066 m S Q
q 1 0 0 1 0 0 cm
79.754 20.105 m 79.754 21.34 78.754 22.34 77.52 22.34 c 76.285 22.34 75.285
 21.34 75.285 20.105 c 75.285 18.871 76.285 17.871 77.52 17.871 c 78.754
 17.871 79.754 18.871 79.754 20.105 c h
79.754 20.105 m S Q
q 1 0 0 1 0 0 cm
83.441 27.387 m 83.441 28.621 82.441 29.621 81.211 29.621 c 79.977 29.621
 78.977 28.621 78.977 27.387 c 78.977 26.156 79.977 25.156 81.211 25.156
 c 82.441 25.156 83.441 26.156 83.441 27.387 c h
83.441 27.387 m S Q
q 1 0 0 1 0 0 cm
89.754 28.75 m 89.754 29.98 88.754 30.98 87.523 30.98 c 86.289 30.98 85.289
 29.98 85.289 28.75 c 85.289 27.516 86.289 26.516 87.523 26.516 c 88.754
 26.516 89.754 27.516 89.754 28.75 c h
89.754 28.75 m S Q
q 1 0 0 1 0 0 cm
91.504 36.516 m 91.504 37.75 90.504 38.75 89.27 38.75 c 88.035 38.75 87.035
 37.75 87.035 36.516 c 87.035 35.285 88.035 34.285 89.27 34.285 c 90.504
 34.285 91.504 35.285 91.504 36.516 c h
91.504 36.516 m S Q
q 1 0 0 1 0 0 cm
99.758 25.836 m 99.758 27.066 98.758 28.066 97.523 28.066 c 96.293 28.066
 95.289 27.066 95.289 25.836 c 95.289 24.602 96.293 23.602 97.523 23.602
 c 98.758 23.602 99.758 24.602 99.758 25.836 c h
99.758 25.836 m S Q
10 M q 1 0 0 1 0 0 cm
68.195 26.805 m 75.48 21.074 l 79.266 21.754 m 80.531 25.156 l 83.441 28.066
 m 85.289 28.066 l 87.035 30.883 m 88.008 35.062 l 90.824 34.965 m 95.875
 27.387 l 73.828 17.871 m 72.469 16.512 l 72.371 21.074 m 70.527 21.074 
l 77.617 16.609 m 77.617 14.762 l 80.336 17.773 m 81.793 16.609 l 83.734
 21.074 m 81.793 21.074 l S Q
Q Q
showpage
%%Trailer
end
%%EOF
