%!PS-Adobe-3.0 EPSF-3.0
%%Creator: cairo 1.17.4 (https://cairographics.org)
%%CreationDate: Tue Jul  6 09:23:50 2021
%%Pages: 1
%%DocumentData: Clean7Bit
%%LanguageLevel: 2
%%BoundingBox: 0 1 157 144
%%EndComments
%%BeginProlog
50 dict begin
/q { gsave } bind def
/Q { grestore } bind def
/cm { 6 array astore concat } bind def
/w { setlinewidth } bind def
/J { setlinecap } bind def
/j { setlinejoin } bind def
/M { setmiterlimit } bind def
/d { setdash } bind def
/m { moveto } bind def
/l { lineto } bind def
/c { curveto } bind def
/h { closepath } bind def
/re { exch dup neg 3 1 roll 5 3 roll moveto 0 rlineto
      0 exch rlineto 0 rlineto closepath } bind def
/S { stroke } bind def
/f { fill } bind def
/f* { eofill } bind def
/n { newpath } bind def
/W { clip } bind def
/W* { eoclip } bind def
/BT { } bind def
/ET { } bind def
/BDC { mark 3 1 roll /BDC pdfmark } bind def
/EMC { mark /EMC pdfmark } bind def
/cairo_store_point { /cairo_point_y exch def /cairo_point_x exch def } def
/Tj { show currentpoint cairo_store_point } bind def
/TJ {
  {
    dup
    type /stringtype eq
    { show } { -0.001 mul 0 cairo_font_matrix dtransform rmoveto } ifelse
  } forall
  currentpoint cairo_store_point
} bind def
/cairo_selectfont { cairo_font_matrix aload pop pop pop 0 0 6 array astore
    cairo_font exch selectfont cairo_point_x cairo_point_y moveto } bind def
/Tf { pop /cairo_font exch def /cairo_font_matrix where
      { pop cairo_selectfont } if } bind def
/Td { matrix translate cairo_font_matrix matrix concatmatrix dup
      /cairo_font_matrix exch def dup 4 get exch 5 get cairo_store_point
      /cairo_font where { pop cairo_selectfont } if } bind def
/Tm { 2 copy 8 2 roll 6 array astore /cairo_font_matrix exch def
      cairo_store_point /cairo_font where { pop cairo_selectfont } if } bind def
/g { setgray } bind def
/rg { setrgbcolor } bind def
/d1 { setcachedevice } bind def
/cairo_data_source {
  CairoDataIndex CairoData length lt
    { CairoData CairoDataIndex get /CairoDataIndex CairoDataIndex 1 add def }
    { () } ifelse
} def
/cairo_flush_ascii85_file { cairo_ascii85_file status { cairo_ascii85_file flushfile } if } def
/cairo_image { image cairo_flush_ascii85_file } def
/cairo_imagemask { imagemask cairo_flush_ascii85_file } def
%%EndProlog
%%BeginSetup
%%EndSetup
%%Page: 1 1
%%BeginPageSetup
%%PageBoundingBox: 0 1 157 144
%%EndPageSetup
q 0 1 157 143 rectclip
1 0 0 -1 0 144 cm q
1 g
0.75 0.375 156 142.5 re f
52.5 18.75 m 52.5 42 l 30 54.75 l 7.5 42 l 7.5 18.75 l 30 6 l h
52.5 18.75 m f
0 0.313726 0.45098 rg
3 w
0 J
0 j
[] 0.0 d
10 M q 0 1 -1 0 0 0 cm
18.75 -52.5 m 42 -52.5 l 54.75 -30 l 42 -7.5 l 18.75 -7.5 l 6 -30 l h
18.75 -52.5 m S Q
1 g
101.25 101.25 m 101.25 124.5 l 78.75 137.25 l 56.25 124.5 l 56.25 101.25
 l 78.75 88.5 l h
101.25 101.25 m f
0 0.313726 0.45098 rg
q 0 1 -1 0 0 0 cm
101.25 -101.25 m 124.5 -101.25 l 137.25 -78.75 l 124.5 -56.25 l 101.25 
-56.25 l 88.5 -78.75 l h
101.25 -101.25 m S Q
1 g
150 18.75 m 150 42 l 127.5 54.75 l 105 42 l 105 18.75 l 127.5 6 l h
150 18.75 m f
0 0.313726 0.45098 rg
q 0 1 -1 0 0 0 cm
18.75 -150 m 42 -150 l 54.75 -127.5 l 42 -105 l 18.75 -105 l 6 -127.5 l
 h
18.75 -150 m S Q
0.137255 0.266667 0.364706 rg
0.75 w
q 1 0 0 1 0 0 cm
67.68 94.77 m 60.066 82.336 l S Q
q 1 0 0 1 0 0 cm
40.598 48.742 m 55.125 73.926 l S Q
q 1 0 0 1 0 0 cm
52.926 82.125 m 50.926 78.66 51.66 75.926 55.125 73.926 c 58.59 71.926 
61.324 72.66 63.324 76.125 c S Q
1 g
61.875 79.125 m 61.875 81.195 60.195 82.875 58.125 82.875 c 56.055 82.875
 54.375 81.195 54.375 79.125 c 54.375 77.055 56.055 75.375 58.125 75.375
 c 60.195 75.375 61.875 77.055 61.875 79.125 c h
61.875 79.125 m f
0.137255 0.266667 0.364706 rg
4 M q 1 0 0 1 0 0 cm
61.875 79.125 m 61.875 81.195 60.195 82.875 58.125 82.875 c 56.055 82.875
 54.375 81.195 54.375 79.125 c 54.375 77.055 56.055 75.375 58.125 75.375
 c 60.195 75.375 61.875 77.055 61.875 79.125 c h
61.875 79.125 m S Q
10 M q 1 0 0 1 0 0 cm
89.82 94.77 m 97.434 82.336 l S Q
q 1 0 0 1 0 0 cm
116.902 48.742 m 102.375 73.926 l S Q
q 1 0 0 1 0 0 cm
94.176 76.125 m 96.176 72.66 98.91 71.926 102.375 73.926 c 105.84 75.926
 106.574 78.66 104.574 82.125 c S Q
1 g
103.125 79.125 m 103.125 81.195 101.445 82.875 99.375 82.875 c 97.305 82.875
 95.625 81.195 95.625 79.125 c 95.625 77.055 97.305 75.375 99.375 75.375
 c 101.445 75.375 103.125 77.055 103.125 79.125 c h
103.125 79.125 m f
0.137255 0.266667 0.364706 rg
4 M q 1 0 0 1 0 0 cm
103.125 79.125 m 103.125 81.195 101.445 82.875 99.375 82.875 c 97.305 82.875
 95.625 81.195 95.625 79.125 c 95.625 77.055 97.305 75.375 99.375 75.375
 c 101.445 75.375 103.125 77.055 103.125 79.125 c h
103.125 79.125 m S Q
Q Q
showpage
%%Trailer
end
%%EOF
