%!PS-Adobe-3.0 EPSF-3.0
%%Creator: cairo 1.17.4 (https://cairographics.org)
%%CreationDate: Thu Aug  5 11:35:28 2021
%%Pages: 1
%%DocumentData: Clean7Bit
%%LanguageLevel: 2
%%BoundingBox: 0 0 346 46
%%EndComments
%%BeginProlog
50 dict begin
/q { gsave } bind def
/Q { grestore } bind def
/cm { 6 array astore concat } bind def
/w { setlinewidth } bind def
/J { setlinecap } bind def
/j { setlinejoin } bind def
/M { setmiterlimit } bind def
/d { setdash } bind def
/m { moveto } bind def
/l { lineto } bind def
/c { curveto } bind def
/h { closepath } bind def
/re { exch dup neg 3 1 roll 5 3 roll moveto 0 rlineto
      0 exch rlineto 0 rlineto closepath } bind def
/S { stroke } bind def
/f { fill } bind def
/f* { eofill } bind def
/n { newpath } bind def
/W { clip } bind def
/W* { eoclip } bind def
/BT { } bind def
/ET { } bind def
/BDC { mark 3 1 roll /BDC pdfmark } bind def
/EMC { mark /EMC pdfmark } bind def
/cairo_store_point { /cairo_point_y exch def /cairo_point_x exch def } def
/Tj { show currentpoint cairo_store_point } bind def
/TJ {
  {
    dup
    type /stringtype eq
    { show } { -0.001 mul 0 cairo_font_matrix dtransform rmoveto } ifelse
  } forall
  currentpoint cairo_store_point
} bind def
/cairo_selectfont { cairo_font_matrix aload pop pop pop 0 0 6 array astore
    cairo_font exch selectfont cairo_point_x cairo_point_y moveto } bind def
/Tf { pop /cairo_font exch def /cairo_font_matrix where
      { pop cairo_selectfont } if } bind def
/Td { matrix translate cairo_font_matrix matrix concatmatrix dup
      /cairo_font_matrix exch def dup 4 get exch 5 get cairo_store_point
      /cairo_font where { pop cairo_selectfont } if } bind def
/Tm { 2 copy 8 2 roll 6 array astore /cairo_font_matrix exch def
      cairo_store_point /cairo_font where { pop cairo_selectfont } if } bind def
/g { setgray } bind def
/rg { setrgbcolor } bind def
/d1 { setcachedevice } bind def
/cairo_data_source {
  CairoDataIndex CairoData length lt
    { CairoData CairoDataIndex get /CairoDataIndex CairoDataIndex 1 add def }
    { () } ifelse
} def
/cairo_flush_ascii85_file { cairo_ascii85_file status { cairo_ascii85_file flushfile } if } def
/cairo_image { image cairo_flush_ascii85_file } def
/cairo_imagemask { imagemask cairo_flush_ascii85_file } def
%%EndProlog
%%BeginSetup
%%EndSetup
%%Page: 1 1
%%BeginPageSetup
%%PageBoundingBox: 0 0 346 46
%%EndPageSetup
q 0 0 346 46 rectclip
1 0 0 -1 0 46 cm q
1 g
0.375 0.375 m 108.375 0.375 l 120.375 22.875 l 108.375 45.375 l 0.375 45.375
 l 13.875 22.875 l h
0.375 0.375 m f
0 0.313726 0.45098 rg
0.75 w
0 J
0 j
[] 0.0 d
10 M q 1 0 0 1 0 0 cm
0.375 0.375 m 108.375 0.375 l 120.375 22.875 l 108.375 45.375 l 0.375 45.375
 l 13.875 22.875 l h
0.375 0.375 m S Q
1 g
112.875 0.375 m 220.875 0.375 l 232.875 22.875 l 220.875 45.375 l 112.875
 45.375 l 126.375 22.875 l h
112.875 0.375 m f
0 0.313726 0.45098 rg
q 1 0 0 1 0 0 cm
112.875 0.375 m 220.875 0.375 l 232.875 22.875 l 220.875 45.375 l 112.875
 45.375 l 126.375 22.875 l h
112.875 0.375 m S Q
1 g
225.375 0.375 m 333.375 0.375 l 345.375 22.875 l 333.375 45.375 l 225.375
 45.375 l 238.875 22.875 l h
225.375 0.375 m f
0 0.313726 0.45098 rg
q 1 0 0 1 0 0 cm
225.375 0.375 m 333.375 0.375 l 345.375 22.875 l 333.375 45.375 l 225.375
 45.375 l 238.875 22.875 l h
225.375 0.375 m S Q
Q Q
showpage
%%Trailer
end
%%EOF
