%!PS-Adobe-3.0 EPSF-3.0
%%Creator: cairo 1.17.4 (https://cairographics.org)
%%CreationDate: Fri Jul  2 15:54:19 2021
%%Pages: 1
%%DocumentData: Clean7Bit
%%LanguageLevel: 2
%%BoundingBox: 0 0 200 170
%%EndComments
%%BeginProlog
50 dict begin
/q { gsave } bind def
/Q { grestore } bind def
/cm { 6 array astore concat } bind def
/w { setlinewidth } bind def
/J { setlinecap } bind def
/j { setlinejoin } bind def
/M { setmiterlimit } bind def
/d { setdash } bind def
/m { moveto } bind def
/l { lineto } bind def
/c { curveto } bind def
/h { closepath } bind def
/re { exch dup neg 3 1 roll 5 3 roll moveto 0 rlineto
      0 exch rlineto 0 rlineto closepath } bind def
/S { stroke } bind def
/f { fill } bind def
/f* { eofill } bind def
/n { newpath } bind def
/W { clip } bind def
/W* { eoclip } bind def
/BT { } bind def
/ET { } bind def
/BDC { mark 3 1 roll /BDC pdfmark } bind def
/EMC { mark /EMC pdfmark } bind def
/cairo_store_point { /cairo_point_y exch def /cairo_point_x exch def } def
/Tj { show currentpoint cairo_store_point } bind def
/TJ {
  {
    dup
    type /stringtype eq
    { show } { -0.001 mul 0 cairo_font_matrix dtransform rmoveto } ifelse
  } forall
  currentpoint cairo_store_point
} bind def
/cairo_selectfont { cairo_font_matrix aload pop pop pop 0 0 6 array astore
    cairo_font exch selectfont cairo_point_x cairo_point_y moveto } bind def
/Tf { pop /cairo_font exch def /cairo_font_matrix where
      { pop cairo_selectfont } if } bind def
/Td { matrix translate cairo_font_matrix matrix concatmatrix dup
      /cairo_font_matrix exch def dup 4 get exch 5 get cairo_store_point
      /cairo_font where { pop cairo_selectfont } if } bind def
/Tm { 2 copy 8 2 roll 6 array astore /cairo_font_matrix exch def
      cairo_store_point /cairo_font where { pop cairo_selectfont } if } bind def
/g { setgray } bind def
/rg { setrgbcolor } bind def
/d1 { setcachedevice } bind def
/cairo_data_source {
  CairoDataIndex CairoData length lt
    { CairoData CairoDataIndex get /CairoDataIndex CairoDataIndex 1 add def }
    { () } ifelse
} def
/cairo_flush_ascii85_file { cairo_ascii85_file status { cairo_ascii85_file flushfile } if } def
/cairo_image { image cairo_flush_ascii85_file } def
/cairo_imagemask { imagemask cairo_flush_ascii85_file } def
%%EndProlog
%%BeginSetup
%%EndSetup
%%Page: 1 1
%%BeginPageSetup
%%PageBoundingBox: 0 0 200 170
%%EndPageSetup
q 0 0 200 170 rectclip
1 0 0 -1 0 170 cm q
1 g
0.375 0.375 198.75 168.75 re f
0 0.313726 0.45098 rg
3 w
0 J
0 j
[] 0.0 d
10 M q 0 1 -1 0 0 0 cm
123.75 -184.125 m 147 -184.125 l 159.75 -161.625 l 147 -139.125 l 123.75
 -139.125 l 111 -161.625 l h
123.75 -184.125 m S Q
q 0 1 -1 0 0 0 cm
123.75 -81 m 147 -81 l 159.75 -58.5 l 147 -36 l 123.75 -36 l 111 -58.5 
l h
123.75 -81 m S Q
1 g
81 35.625 m 81 58.875 l 58.5 71.625 l 36 58.875 l 36 35.625 l 58.5 22.875
 l h
81 35.625 m f
0 0.313726 0.45098 rg
q 0 1 -1 0 0 0 cm
35.625 -81 m 58.875 -81 l 71.625 -58.5 l 58.875 -36 l 35.625 -36 l 22.875
 -58.5 l h
35.625 -81 m S Q
46.777 36.031 m 46.523 36.031 46.312 36.238 46.312 36.496 c 46.312 58.004
 l 46.312 58.262 46.523 58.469 46.777 58.469 c 62.852 58.469 l 62.852 57.531
 l 47.25 57.531 l 47.25 39.891 l 69.75 39.898 l 69.75 57.531 l 67.801 57.531
 l 67.801 58.469 l 70.223 58.469 l 70.477 58.469 70.688 58.262 70.688 58.004
 c 70.688 36.496 l 70.688 36.238 70.477 36.031 70.223 36.031 c h
47.25 36.969 m 69.75 36.969 l 69.75 38.969 l 47.25 38.953 l h
58.516 41.438 m 55.836 41.438 53.664 43.613 53.664 46.281 c 53.664 48.961
 55.836 51.137 58.516 51.137 c 61.191 51.137 63.367 48.961 63.367 46.281
 c 63.367 43.613 61.191 41.438 58.516 41.438 c h
58.516 42.367 m 60.684 42.367 62.43 44.113 62.43 46.281 c 62.43 48.457 
60.684 50.203 58.516 50.203 c 56.348 50.203 54.602 48.457 54.602 46.281 
c 54.602 44.113 56.348 42.367 58.516 42.367 c h
60.578 44.488 m 57.691 47.527 l 56.438 46.191 l 55.754 46.828 l 57.344 
48.531 l 57.531 48.727 57.84 48.727 58.027 48.531 c 61.254 45.137 l h
60.488 51.668 m 60.488 55.027 l 58.809 53.633 l 58.637 53.488 58.387 53.488
 58.215 53.633 c 56.512 55.051 l 56.512 51.684 l 55.574 51.684 l 55.574 
56.047 l 55.574 56.445 56.031 56.664 56.34 56.406 c 58.508 54.602 l 60.66
 56.387 l 60.961 56.641 61.426 56.422 61.426 56.023 c 61.426 51.668 l h
60.488 51.668 m f
0.137255 0.266667 0.364706 rg
0.75 w
q 1 0 0 1 0 0 cm
49.949 27.93 m 42.145 19.559 44.492 15.375 56.992 15.375 c 69.492 15.375
 73.941 18.215 70.34 23.895 c S Q
67.867 27.219 m 68.461 21.383 l 69.977 23.895 l 72.891 24.195 l h
67.867 27.219 m f
q 1 0 0 1 0 0 cm
67.867 27.219 m 68.461 21.383 l 69.977 23.895 l 72.891 24.195 l h
67.867 27.219 m S Q
q 1 0 0 1 0 0 cm
139.125 135.375 m 85.777 135.375 l S Q
81.84 135.375 m 87.09 132.75 l 85.777 135.375 l 87.09 138 l h
81.84 135.375 m f
q 1 0 0 1 0 0 cm
81.84 135.375 m 87.09 132.75 l 85.777 135.375 l 87.09 138 l h
81.84 135.375 m S Q
0 0.313726 0.45098 rg
65.488 87.344 m 65.488 87.148 l 68.414 84.207 l 68.609 84.207 l 68.609 
87.344 l h
76.41 91.852 m 77.176 91.852 77.871 91.25 77.871 90.352 c 77.871 89.637
 77.266 88.91 76.402 88.91 c 75.613 88.91 74.949 89.586 74.949 90.375 c 
74.949 91.234 75.652 91.852 76.41 91.852 c h
76.441 92.242 m 75.391 92.242 74.566 91.371 74.566 90.457 c 74.566 89.234
 75.48 88.52 76.426 88.52 c 77.453 88.52 78.27 89.367 78.27 90.352 c 78.27
 91.559 77.266 92.242 76.441 92.242 c h
76.41 92.824 m 77.766 92.824 78.855 91.707 78.855 90.441 c 78.855 89 77.789
 87.938 76.359 87.938 c 75.164 87.938 73.973 88.934 73.973 90.434 c 73.973
 91.551 74.91 92.824 76.41 92.824 c h
72.848 96.328 m 74.676 92.848 l 73.957 92.324 73.328 91.453 73.402 90.117
 c 73.531 88.617 74.766 87.344 76.469 87.344 c 77.984 87.344 79.441 88.59
 79.441 90.434 c 79.402 91.445 78.969 92.203 78.246 92.789 c 80.488 96.082
 l 78.719 95.668 l 77.746 97.02 l 76.449 93.473 l 75.441 97.137 l 74.422
 96.059 l h
65.488 93.809 m 65.488 87.93 l 69.195 87.93 l 69.195 84.207 l 78.367 84.207
 l 78.367 87.328 l 77.887 87.027 77.242 86.758 76.426 86.758 c 74.477 86.758
 72.809 88.289 72.809 90.434 c 72.809 91.43 73.281 92.398 73.934 93.008 
c 73.516 93.809 l h
65.488 93.809 m f
0.137255 0.266667 0.364706 rg
q 1 0 0 1 0 0 cm
58.5 106.223 m 58.5 76.402 l S Q
58.5 110.16 m 55.875 104.91 l 58.5 106.223 l 61.125 104.91 l h
58.5 110.16 m f
q 1 0 0 1 0 0 cm
58.5 110.16 m 55.875 104.91 l 58.5 106.223 l 61.125 104.91 l h
58.5 110.16 m S Q
58.5 72.465 m 61.125 77.715 l 58.5 76.402 l 55.875 77.715 l h
58.5 72.465 m f
q 1 0 0 1 0 0 cm
58.5 72.465 m 61.125 77.715 l 58.5 76.402 l 55.875 77.715 l h
58.5 72.465 m S Q
q 1 0 0 1 0 0 cm
81 49.027 m 119.75 52.094 144.266 72.312 154.551 109.688 c S Q
155.602 113.484 m 151.672 109.117 l 154.551 109.688 l 156.734 107.723 l
 h
155.602 113.484 m f
q 1 0 0 1 0 0 cm
155.602 113.484 m 151.672 109.117 l 154.551 109.688 l 156.734 107.723 l
 h
155.602 113.484 m S Q
Q Q
showpage
%%Trailer
end
%%EOF
