%!PS-Adobe-3.0 EPSF-3.0
%%Creator: cairo 1.17.4 (https://cairographics.org)
%%CreationDate: Thu Jul  8 14:29:58 2021
%%Pages: 1
%%DocumentData: Clean7Bit
%%LanguageLevel: 2
%%BoundingBox: 0 0 216 165
%%EndComments
%%BeginProlog
50 dict begin
/q { gsave } bind def
/Q { grestore } bind def
/cm { 6 array astore concat } bind def
/w { setlinewidth } bind def
/J { setlinecap } bind def
/j { setlinejoin } bind def
/M { setmiterlimit } bind def
/d { setdash } bind def
/m { moveto } bind def
/l { lineto } bind def
/c { curveto } bind def
/h { closepath } bind def
/re { exch dup neg 3 1 roll 5 3 roll moveto 0 rlineto
      0 exch rlineto 0 rlineto closepath } bind def
/S { stroke } bind def
/f { fill } bind def
/f* { eofill } bind def
/n { newpath } bind def
/W { clip } bind def
/W* { eoclip } bind def
/BT { } bind def
/ET { } bind def
/BDC { mark 3 1 roll /BDC pdfmark } bind def
/EMC { mark /EMC pdfmark } bind def
/cairo_store_point { /cairo_point_y exch def /cairo_point_x exch def } def
/Tj { show currentpoint cairo_store_point } bind def
/TJ {
  {
    dup
    type /stringtype eq
    { show } { -0.001 mul 0 cairo_font_matrix dtransform rmoveto } ifelse
  } forall
  currentpoint cairo_store_point
} bind def
/cairo_selectfont { cairo_font_matrix aload pop pop pop 0 0 6 array astore
    cairo_font exch selectfont cairo_point_x cairo_point_y moveto } bind def
/Tf { pop /cairo_font exch def /cairo_font_matrix where
      { pop cairo_selectfont } if } bind def
/Td { matrix translate cairo_font_matrix matrix concatmatrix dup
      /cairo_font_matrix exch def dup 4 get exch 5 get cairo_store_point
      /cairo_font where { pop cairo_selectfont } if } bind def
/Tm { 2 copy 8 2 roll 6 array astore /cairo_font_matrix exch def
      cairo_store_point /cairo_font where { pop cairo_selectfont } if } bind def
/g { setgray } bind def
/rg { setrgbcolor } bind def
/d1 { setcachedevice } bind def
/cairo_data_source {
  CairoDataIndex CairoData length lt
    { CairoData CairoDataIndex get /CairoDataIndex CairoDataIndex 1 add def }
    { () } ifelse
} def
/cairo_flush_ascii85_file { cairo_ascii85_file status { cairo_ascii85_file flushfile } if } def
/cairo_image { image cairo_flush_ascii85_file } def
/cairo_imagemask { imagemask cairo_flush_ascii85_file } def
%%EndProlog
%%BeginSetup
%%EndSetup
%%Page: 1 1
%%BeginPageSetup
%%PageBoundingBox: 0 0 216 165
%%EndPageSetup
q 0 0 216 165 rectclip
1 0 0 -1 0 165 cm q
0.137255 0.266667 0.364706 rg
0.75 w
0 J
0 j
[] 0.0 d
10 M q 1 0 0 1 0 0 cm
161.633 46.215 m 140.129 107.656 103.469 138.375 51.652 138.375 c S Q
48.742 138.312 m 53.992 135.688 l 52.68 138.312 l 53.992 140.938 l h
48.742 138.312 m f
q 1 0 0 1 0 0 cm
48.742 138.312 m 53.992 135.688 l 52.68 138.312 l 53.992 140.938 l h
48.742 138.312 m S Q
q 1 0 0 1 0 0 cm
171.488 95.301 m 128.414 124.016 88.469 138.375 51.652 138.375 c S Q
q 1 0 0 1 0 0 cm
146.25 138.375 m 51.652 138.375 l S Q
q 1 0 0 1 0 0 cm
41.203 122.773 m 75.254 97.363 l S Q
76.953 96.18 m 74.32 101.422 l 73.801 98.535 l 71.176 97.215 l h
76.953 96.18 m f
q 1 0 0 1 0 0 cm
76.953 96.18 m 74.32 101.422 l 73.801 98.535 l 71.176 97.215 l h
76.953 96.18 m S Q
q 1 0 0 1 0 0 cm
42.887 39.758 m 77.039 65.379 l S Q
79.211 66.98 m 73.438 65.934 l 76.062 64.621 l 76.586 61.73 l h
79.211 66.98 m f
q 1 0 0 1 0 0 cm
79.211 66.98 m 73.438 65.934 l 76.062 64.621 l 76.586 61.73 l h
79.211 66.98 m S Q
1 g
46.875 14.25 m 46.875 37.5 l 24.375 50.25 l 1.875 37.5 l 1.875 14.25 l 
24.375 1.5 l h
46.875 14.25 m f
0 0.313726 0.45098 rg
3 w
q 0 1 -1 0 0 0 cm
14.25 -46.875 m 37.5 -46.875 l 50.25 -24.375 l 37.5 -1.875 l 14.25 -1.875
 l 1.5 -24.375 l h
14.25 -46.875 m S Q
1 g
191.25 126.75 m 191.25 150 l 168.75 162.75 l 146.25 150 l 146.25 126.75
 l 168.75 114 l h
191.25 126.75 m f
0 0.313726 0.45098 rg
q 0 1 -1 0 0 0 cm
126.75 -191.25 m 150 -191.25 l 162.75 -168.75 l 150 -146.25 l 126.75 -146.25
 l 114 -168.75 l h
126.75 -191.25 m S Q
1 g
213.75 70.5 m 213.75 93.75 l 191.25 106.5 l 168.75 93.75 l 168.75 70.5 
l 191.25 57.75 l h
213.75 70.5 m f
0 0.313726 0.45098 rg
q 0 1 -1 0 0 0 cm
70.5 -213.75 m 93.75 -213.75 l 106.5 -191.25 l 93.75 -168.75 l 70.5 -168.75
 l 57.75 -191.25 l h
70.5 -213.75 m S Q
1 g
191.25 14.25 m 191.25 37.5 l 168.75 50.25 l 146.25 37.5 l 146.25 14.25 
l 168.75 1.5 l h
191.25 14.25 m f
0 0.313726 0.45098 rg
q 0 1 -1 0 0 0 cm
14.25 -191.25 m 37.5 -191.25 l 50.25 -168.75 l 37.5 -146.25 l 14.25 -146.25
 l 1.5 -168.75 l h
14.25 -191.25 m S Q
0.137255 0.266667 0.364706 rg
46.418 124.375 m 49.109 119.156 l 49.598 122.051 l 52.207 123.402 l h
46.418 124.375 m f
0.75 w
q 1 0 0 1 0 0 cm
46.418 124.375 m 49.109 119.156 l 49.598 122.051 l 52.207 123.402 l h
46.418 124.375 m S Q
1 g
46.875 126.75 m 46.875 150 l 24.375 162.75 l 1.875 150 l 1.875 126.75 l
 24.375 114 l h
46.875 126.75 m f
0 0.313726 0.45098 rg
3 w
q 0 1 -1 0 0 0 cm
126.75 -46.875 m 150 -46.875 l 162.75 -24.375 l 150 -1.875 l 126.75 -1.875
 l 114 -24.375 l h
126.75 -46.875 m S Q
29.859 137.223 m 29.859 132.781 l 30.984 132.781 l 30.984 137.223 l h
27.422 137.223 m 27.422 135 l 28.551 135 l 28.551 137.223 l h
25.027 137.223 m 25.027 133.848 l 26.145 133.848 l 26.145 137.223 l h
27.914 140.516 m 31.5 140.516 33.93 138.008 33.93 135.18 c 33.93 132.273
 31.695 129.828 27.898 129.828 c 25.086 129.828 22.074 131.805 22.074 135.113
 c 22.074 138.348 24.996 140.516 27.914 140.516 c h
15.699 148.488 m 14.828 149.207 13.719 149.387 12.832 148.598 c 12.031 
147.797 12.336 146.805 12.898 146.305 c 16.934 142.488 l 17.641 141.82 18.863
 140.965 20.102 140.445 c 20.699 140.148 21.098 139.801 20.715 139.023 c
 20.121 137.891 19.656 136.832 19.656 134.836 c 19.656 130.98 23.445 127.637
 27.961 127.637 c 33.426 127.637 36.406 131.867 36.406 135.242 c 36.406 
139.043 32.762 142.703 28.215 142.703 c 27.066 142.703 25.648 142.336 24.66
 142 c 23.684 141.684 22.582 141.652 21.781 142.719 c 21.301 143.25 20.754
 144.277 19.273 145.555 c h
15.699 148.488 m f
0.137255 0.266667 0.364706 rg
0.75 w
q 1 0 0 1 0 0 cm
82.996 97.629 m 48.84 122.586 l S Q
1 g
121.875 70.5 m 121.875 93.75 l 99.375 106.5 l 76.875 93.75 l 76.875 70.5
 l 99.375 57.75 l h
121.875 70.5 m f
0 0.313726 0.45098 rg
3 w
q 0 1 -1 0 0 0 cm
70.5 -121.875 m 93.75 -121.875 l 106.5 -99.375 l 93.75 -76.875 l 70.5 -76.875
 l 57.75 -99.375 l h
70.5 -121.875 m S Q
1 g
85.246 69.938 m 84.434 69.938 83.773 70.605 83.773 71.422 c 83.773 92.828
 l 83.773 93.645 84.434 94.312 85.246 94.312 c 113.504 94.312 l 114.316 
94.312 114.977 93.645 114.977 92.828 c 114.977 71.422 l 114.977 70.605 114.316
 69.938 113.504 69.938 c h
85.246 69.938 m f
0 0.313726 0.45098 rg
104.609 90.953 m 105.547 89.512 l 100.207 85.941 l 100.762 85.094 l 106.102
 88.664 l 106.996 87.301 l 108.879 91.199 l h
104.574 73.336 m 105.512 74.766 l 100.176 78.336 l 100.734 79.184 l 106.066
 75.613 l 106.965 76.98 l 108.84 73.078 l h
107.219 79.898 m 107.219 81.621 l 100.816 81.621 l 100.816 82.641 l 107.219
 82.641 l 107.219 84.277 l 110.918 82.074 l h
94.207 79.898 m 94.207 81.621 l 87.809 81.621 l 87.809 82.641 l 94.207 
82.641 l 94.207 84.277 l 97.906 82.074 l h
85.246 69.938 m 84.434 69.938 83.773 70.605 83.773 71.422 c 83.773 92.828
 l 83.773 93.645 84.434 94.312 85.246 94.312 c 113.504 94.312 l 114.316 
94.312 114.977 93.645 114.977 92.828 c 114.977 71.422 l 114.977 70.605 114.316
 69.938 113.504 69.938 c h
85.246 70.613 m 113.504 70.613 l 113.953 70.613 114.309 70.965 114.309 
71.422 c 114.309 92.828 l 114.309 93.285 113.953 93.637 113.504 93.637 c
 85.246 93.637 l 84.797 93.637 84.441 93.285 84.441 92.828 c 84.441 71.422
 l 84.441 70.965 84.797 70.613 85.246 70.613 c h
85.246 70.613 m f
1 g
2.25 w
4 M q 1 0 0 1 0 0 cm
84.496 70.312 m 113.805 70.312 l 114.203 70.312 114.523 70.633 114.523 
71.031 c 114.523 93.594 l 114.523 93.992 114.203 94.312 113.805 94.312 c
 84.496 94.312 l 84.098 94.312 83.773 93.992 83.773 93.594 c 83.773 71.031
 l 83.773 70.633 84.098 70.312 84.496 70.312 c h
84.496 70.312 m S Q
0.137255 0.266667 0.364706 rg
0.75 w
10 M q 1 0 0 1 0 0 cm
117.066 67.777 m 147.344 43.23 l S Q
149.395 41.633 m 146.965 46.98 l 146.336 44.113 l 143.664 42.898 l h
149.395 41.633 m f
q 1 0 0 1 0 0 cm
149.395 41.633 m 146.965 46.98 l 146.336 44.113 l 143.664 42.898 l h
149.395 41.633 m S Q
Q Q
showpage
%%Trailer
end
%%EOF
