%!PS-Adobe-3.0 EPSF-3.0
%%Creator: cairo 1.16.0 (https://cairographics.org)
%%CreationDate: Thu Jun 24 11:18:28 2021
%%Pages: 1
%%DocumentData: Clean7Bit
%%LanguageLevel: 2
%%BoundingBox: 0 0 227 214
%%EndComments
%%BeginProlog
50 dict begin
/q { gsave } bind def
/Q { grestore } bind def
/cm { 6 array astore concat } bind def
/w { setlinewidth } bind def
/J { setlinecap } bind def
/j { setlinejoin } bind def
/M { setmiterlimit } bind def
/d { setdash } bind def
/m { moveto } bind def
/l { lineto } bind def
/c { curveto } bind def
/h { closepath } bind def
/re { exch dup neg 3 1 roll 5 3 roll moveto 0 rlineto
      0 exch rlineto 0 rlineto closepath } bind def
/S { stroke } bind def
/f { fill } bind def
/f* { eofill } bind def
/n { newpath } bind def
/W { clip } bind def
/W* { eoclip } bind def
/BT { } bind def
/ET { } bind def
/BDC { mark 3 1 roll /BDC pdfmark } bind def
/EMC { mark /EMC pdfmark } bind def
/cairo_store_point { /cairo_point_y exch def /cairo_point_x exch def } def
/Tj { show currentpoint cairo_store_point } bind def
/TJ {
  {
    dup
    type /stringtype eq
    { show } { -0.001 mul 0 cairo_font_matrix dtransform rmoveto } ifelse
  } forall
  currentpoint cairo_store_point
} bind def
/cairo_selectfont { cairo_font_matrix aload pop pop pop 0 0 6 array astore
    cairo_font exch selectfont cairo_point_x cairo_point_y moveto } bind def
/Tf { pop /cairo_font exch def /cairo_font_matrix where
      { pop cairo_selectfont } if } bind def
/Td { matrix translate cairo_font_matrix matrix concatmatrix dup
      /cairo_font_matrix exch def dup 4 get exch 5 get cairo_store_point
      /cairo_font where { pop cairo_selectfont } if } bind def
/Tm { 2 copy 8 2 roll 6 array astore /cairo_font_matrix exch def
      cairo_store_point /cairo_font where { pop cairo_selectfont } if } bind def
/g { setgray } bind def
/rg { setrgbcolor } bind def
/d1 { setcachedevice } bind def
/cairo_data_source {
  CairoDataIndex CairoData length lt
    { CairoData CairoDataIndex get /CairoDataIndex CairoDataIndex 1 add def }
    { () } ifelse
} def
/cairo_flush_ascii85_file { cairo_ascii85_file status { cairo_ascii85_file flushfile } if } def
/cairo_image { image cairo_flush_ascii85_file } def
/cairo_imagemask { imagemask cairo_flush_ascii85_file } def
%%EndProlog
%%BeginSetup
%%EndSetup
%%Page: 1 1
%%BeginPageSetup
%%PageBoundingBox: 0 0 227 214
%%EndPageSetup
q 0 0 227 214 rectclip
1 0 0 -1 0 214 cm q
0.137255 0.266667 0.364706 rg
0.75 w
0 J
0 j
[] 0.0 d
10 M q 1 0 0 1 0 0 cm
23.25 106.723 m 136.621 174.809 l S Q
q 1 0 0 1 0 0 cm
136.621 38.641 m 23.25 106.723 l S Q
q 1 0 0 1 0 0 cm
180 78.848 m 23.25 106.723 l S Q
q 1 0 0 1 0 0 cm
180 134.602 m 23.25 106.723 l S Q
1 g
7.5 91.723 37.5 25.5 re f
180 14.473 m 180 37.723 l 157.5 50.473 l 135 37.723 l 135 14.473 l 157.5
 1.723 l h
180 14.473 m f
0 0.313726 0.45098 rg
3 w
q 0 1 -1 0 0 0 cm
14.473 -180 m 37.723 -180 l 50.473 -157.5 l 37.723 -135 l 14.473 -135 l
 1.723 -157.5 l h
14.473 -180 m S Q
148.664 16.656 m 166.344 16.656 l 166.688 16.656 166.949 16.918 166.949
 17.266 c 166.949 34.973 l 166.949 35.316 166.688 35.578 166.344 35.578 
c 148.664 35.578 l 148.32 35.578 148.059 35.316 148.059 34.973 c 148.059
 17.266 l 148.059 16.918 148.32 16.656 148.664 16.656 c h
150.711 12.973 m 150.711 15.652 l 148.664 15.652 l 147.781 15.652 147.051
 16.379 147.051 17.266 c 147.051 19.305 l 144.406 19.305 l 144.406 20.309
 l 147.051 20.309 l 147.051 22.453 l 144.406 22.453 l 144.406 23.465 l 147.051
 23.465 l 147.051 25.598 l 144.406 25.598 l 144.406 26.609 l 147.051 26.609
 l 147.051 28.754 l 144.406 28.754 l 144.406 29.758 l 147.051 29.758 l 147.051
 31.883 l 144.406 31.883 l 144.406 32.895 l 147.051 32.895 l 147.051 34.973
 l 147.051 35.855 147.781 36.586 148.664 36.586 c 150.711 36.586 l 150.711
 39.223 l 151.719 39.223 l 151.719 36.586 l 153.863 36.586 l 153.863 39.223
 l 154.875 39.223 l 154.875 36.586 l 157.02 36.586 l 157.02 39.223 l 158.023
 39.223 l 158.023 36.586 l 160.176 36.586 l 160.176 39.223 l 161.184 39.223
 l 161.184 36.586 l 163.297 36.586 l 163.297 39.223 l 164.309 39.223 l 164.309
 36.586 l 166.344 36.586 l 167.227 36.586 167.953 35.855 167.953 34.973 
c 167.953 32.895 l 170.594 32.895 l 170.594 31.883 l 167.953 31.883 l 167.953
 29.758 l 170.594 29.758 l 170.594 28.754 l 167.953 28.754 l 167.953 26.609
 l 170.594 26.609 l 170.594 25.598 l 167.953 25.598 l 167.953 23.465 l 170.594
 23.465 l 170.594 22.453 l 167.953 22.453 l 167.953 20.309 l 170.594 20.309
 l 170.594 19.305 l 167.953 19.305 l 167.953 17.266 l 167.953 16.379 167.227
 15.652 166.344 15.652 c 164.309 15.652 l 164.309 12.973 l 163.297 12.973
 l 163.297 15.652 l 161.184 15.652 l 161.184 12.973 l 160.176 12.973 l 160.176
 15.652 l 158.023 15.652 l 158.023 12.973 l 157.02 12.973 l 157.02 15.652
 l 154.875 15.652 l 154.875 12.973 l 153.863 12.973 l 153.863 15.652 l 151.719
 15.652 l 151.719 12.973 l h
164.176 25.793 m 164.266 25.793 164.348 25.828 164.414 25.867 c 164.422
 25.902 164.453 25.973 164.445 26.07 c 164.438 26.195 164.379 26.293 164.387
 26.285 c 164.379 26.293 164.371 26.301 164.363 26.309 c 163.281 27.383 
l 163.125 26.738 l 163.996 25.836 l 163.996 25.836 164.07 25.785 164.176
 25.785 c h
157.508 19.078 m 157.551 19.078 157.641 19.125 157.746 19.191 c 157.836
 19.312 157.824 19.492 157.734 19.598 c 156.891 20.48 l 156.203 20.316 l
 157.32 19.176 l 157.41 19.086 157.449 19.078 157.508 19.078 c h
164.242 18.973 m 164.387 18.98 164.445 19.02 164.477 19.035 c 164.617 19.266
 164.625 19.625 164.488 20.055 c 164.348 20.504 164.047 20.961 163.875 21.133
 c 163.867 21.133 163.875 21.133 163.875 21.133 c 161.543 23.316 l 161.414
 23.445 161.363 23.625 161.398 23.805 c 163.156 31.258 l 162.324 32.105 
l 159.602 26.023 l 159.531 25.883 159.406 25.77 159.238 25.738 c 159.082
 25.711 158.918 25.754 158.797 25.867 c 155.852 28.605 l 155.746 28.703 
155.684 28.828 155.684 28.973 c 155.664 32.453 l 155.371 32.758 l 154.41
 29.473 l 154.363 29.309 154.238 29.18 154.066 29.137 c 150.832 28.199 l
 151.125 27.891 l 154.598 27.898 l 154.738 27.898 154.875 27.84 154.973 
27.734 c 157.656 24.801 l 157.762 24.68 157.809 24.516 157.777 24.359 c 
157.746 24.203 157.641 24.066 157.492 24 c 151.461 21.254 l 152.266 20.43
 l 159.781 22.191 l 159.961 22.23 160.141 22.176 160.266 22.043 c 162.539
 19.59 l 162.539 19.582 162.547 19.582 162.547 19.574 c 162.637 19.469 163.133
 19.176 163.605 19.051 c 163.844 18.988 164.078 18.965 164.242 18.973 c 
h
164.301 17.969 m 163.988 17.945 163.664 18 163.359 18.074 c 162.727 18.238
 162.156 18.488 161.789 18.914 c 159.727 21.141 l 158.031 20.742 l 158.484
 20.266 l 158.488 20.258 158.496 20.25 158.504 20.242 c 158.918 19.754 158.961
 18.973 158.461 18.457 c 158.445 18.441 158.422 18.426 158.406 18.41 c 158.152
 18.215 157.852 18.082 157.523 18.074 c 157.191 18.066 156.863 18.211 156.613
 18.457 c 156.609 18.457 156.609 18.457 156.609 18.465 c 155.055 20.047 
l 152.211 19.379 l 152.039 19.34 151.859 19.395 151.734 19.523 c 150.246
 21.066 l 150.137 21.188 150.082 21.352 150.113 21.508 c 150.141 21.676 
150.246 21.809 150.398 21.875 c 156.441 24.629 l 154.379 26.887 l 150.898
 26.879 l 150.766 26.879 150.629 26.938 150.531 27.043 c 149.527 28.117 
l 149.414 28.242 149.371 28.426 149.414 28.598 c 149.461 28.762 149.594 
28.898 149.762 28.941 c 153.523 30.027 l 154.637 33.867 l 154.688 34.043
 154.828 34.176 155.004 34.223 c 155.176 34.266 155.363 34.215 155.484 34.078
 c 156.523 33.016 l 156.613 32.926 156.668 32.797 156.668 32.668 c 156.691
 29.195 l 158.969 27.082 l 161.707 33.195 l 161.773 33.344 161.918 33.449
 162.074 33.48 c 162.238 33.508 162.414 33.457 162.523 33.336 c 164.07 31.77
 l 164.191 31.641 164.242 31.469 164.203 31.297 c 163.551 28.527 l 165.074
 27.023 l 165.051 27.043 l 165.344 26.789 165.434 26.445 165.449 26.129 
c 165.473 25.812 165.422 25.5 165.211 25.215 c 165.188 25.184 165.164 25.16
 165.141 25.141 c 164.863 24.883 164.512 24.777 164.184 24.777 c 163.852
 24.777 163.516 24.875 163.262 25.141 c 162.855 25.566 l 162.449 23.855 
l 164.574 21.855 l 164.574 21.855 164.578 21.855 164.578 21.848 c 164.926
 21.508 165.246 20.977 165.449 20.363 c 165.652 19.746 165.719 18.988 165.262
 18.383 c 165.246 18.359 165.234 18.344 165.219 18.32 c 164.953 18.066 164.617
 17.984 164.301 17.969 c h
164.301 17.969 m f
1 g
225 63.223 m 225 86.473 l 202.5 99.223 l 180 86.473 l 180 63.223 l 202.5
 50.473 l h
225 63.223 m f
0 0.313726 0.45098 rg
q 0 1 -1 0 0 0 cm
63.223 -225 m 86.473 -225 l 99.223 -202.5 l 86.473 -180 l 63.223 -180 l
 50.473 -202.5 l h
63.223 -225 m S Q
195.434 66.113 m 195.156 67.078 l 196.828 67.566 l 197.113 68.738 l 196.988
 68.863 196.949 69.051 197.004 69.223 c 199.004 75.578 l 199.074 75.785 
199.266 75.93 199.484 75.93 c 200.371 75.93 l 200.012 76.656 l 199.988 76.656
 199.965 76.656 199.941 76.656 c 198.984 76.656 198.188 77.445 198.188 78.402
 c 198.188 79.363 198.984 80.16 199.941 80.16 c 200.73 80.16 201.406 79.625
 201.613 78.898 c 205.172 78.898 l 205.379 79.625 206.055 80.16 206.852 
80.16 c 207.809 80.16 208.598 79.371 208.598 78.41 c 208.598 77.453 207.809
 76.656 206.852 76.656 c 206.062 76.656 205.395 77.18 205.176 77.895 c 201.613
 77.895 l 201.504 77.527 201.27 77.211 200.969 76.992 c 201.496 75.93 l 
207.129 75.93 l 207.344 75.93 207.539 75.785 207.609 75.578 c 209.641 69.223
 l 209.691 69.074 209.664 68.91 209.574 68.773 c 209.477 68.648 209.324 
68.57 209.16 68.57 c 198.113 68.57 l 197.738 67.043 l 197.691 66.867 197.566
 66.734 197.391 66.68 c h
198.172 69.578 m 208.469 69.578 l 206.762 74.926 l 199.859 74.926 l h
199.941 77.66 m 200.355 77.66 200.684 77.992 200.684 78.402 c 200.684 78.824
 200.355 79.148 199.941 79.148 c 199.523 79.148 199.199 78.824 199.199 78.402
 c 199.199 77.992 199.523 77.66 199.941 77.66 c h
206.852 77.668 m 207.262 77.668 207.594 78 207.594 78.41 c 207.594 78.832
 207.262 79.152 206.852 79.152 c 206.43 79.152 206.109 78.832 206.109 78.41
 c 206.109 78 206.43 77.668 206.852 77.668 c h
195.711 59.848 m 195.711 62.527 l 193.664 62.527 l 192.781 62.527 192.051
 63.254 192.051 64.141 c 192.051 66.18 l 189.406 66.18 l 189.406 67.184 
l 192.051 67.184 l 192.051 69.328 l 189.406 69.328 l 189.406 70.34 l 192.051
 70.34 l 192.051 72.473 l 189.406 72.473 l 189.406 73.484 l 192.051 73.484
 l 192.051 75.629 l 189.406 75.629 l 189.406 76.633 l 192.051 76.633 l 192.051
 78.758 l 189.406 78.758 l 189.406 79.77 l 192.051 79.77 l 192.051 81.848
 l 192.051 82.73 192.781 83.461 193.664 83.461 c 195.711 83.461 l 195.711
 86.098 l 196.719 86.098 l 196.719 83.461 l 198.863 83.461 l 198.863 86.098
 l 199.875 86.098 l 199.875 83.461 l 202.02 83.461 l 202.02 86.098 l 203.023
 86.098 l 203.023 83.461 l 205.176 83.461 l 205.176 86.098 l 206.184 86.098
 l 206.184 83.461 l 208.297 83.461 l 208.297 86.098 l 209.309 86.098 l 209.309
 83.461 l 211.344 83.461 l 212.227 83.461 212.953 82.73 212.953 81.848 c
 212.953 79.77 l 215.594 79.77 l 215.594 78.758 l 212.953 78.758 l 212.953
 76.633 l 215.594 76.633 l 215.594 75.629 l 212.953 75.629 l 212.953 73.484
 l 215.594 73.484 l 215.594 72.473 l 212.953 72.473 l 212.953 70.34 l 215.594
 70.34 l 215.594 69.328 l 212.953 69.328 l 212.953 67.184 l 215.594 67.184
 l 215.594 66.18 l 212.953 66.18 l 212.953 64.141 l 212.953 63.254 212.227
 62.527 211.344 62.527 c 209.309 62.527 l 209.309 59.848 l 208.297 59.848
 l 208.297 62.527 l 206.184 62.527 l 206.184 59.848 l 205.176 59.848 l 205.176
 62.527 l 203.023 62.527 l 203.023 59.848 l 202.02 59.848 l 202.02 62.527
 l 199.875 62.527 l 199.875 59.848 l 198.863 59.848 l 198.863 62.527 l 196.719
 62.527 l 196.719 59.848 l h
193.664 63.531 m 211.344 63.531 l 211.688 63.531 211.949 63.793 211.949
 64.141 c 211.949 81.848 l 211.949 82.191 211.688 82.453 211.344 82.453 
c 193.664 82.453 l 193.32 82.453 193.059 82.191 193.059 81.848 c 193.059
 64.141 l 193.059 63.793 193.32 63.531 193.664 63.531 c h
193.664 63.531 m f
1 g
194.062 63.973 16.875 16.5 re f
0 0.313726 0.45098 rg
206.453 69.105 m 206.453 70.395 205.695 71.445 204.773 71.445 c 203.844
 71.445 203.086 70.395 203.086 69.105 c 203.086 67.812 203.844 66.766 204.773
 66.766 c 205.695 66.766 206.453 67.812 206.453 69.105 c h
201.906 69.105 m 201.906 70.395 201.156 71.445 200.227 71.445 c 199.305
 71.445 198.547 70.395 198.547 69.105 c 198.547 67.812 199.305 66.766 200.227
 66.766 c 201.156 66.766 201.906 67.812 201.906 69.105 c h
205.359 77.684 m 205.359 75.5 l 205.359 74.488 204.742 73.492 204.227 73.055
 c 205.754 72.988 208.336 73.746 208.688 75.586 c 208.688 77.684 l h
196.312 77.684 m 196.312 75.578 l 196.734 73.395 199.734 73.055 200.258
 73.055 c 200.949 73.055 203.773 73.574 204.156 75.539 c 204.156 77.684 
l h
196.312 77.684 m f
1 g
225 126.973 m 225 150.223 l 202.5 162.973 l 180 150.223 l 180 126.973 l
 202.5 114.223 l h
225 126.973 m f
0 0.313726 0.45098 rg
q 0 1 -1 0 0 0 cm
126.973 -225 m 150.223 -225 l 162.973 -202.5 l 150.223 -180 l 126.973 -180
 l 114.223 -202.5 l h
126.973 -225 m S Q
195.434 131.738 m 195.156 132.703 l 196.828 133.191 l 197.113 134.363 l
 196.988 134.488 196.949 134.676 197.004 134.848 c 199.004 141.203 l 199.074
 141.41 199.266 141.555 199.484 141.555 c 200.371 141.555 l 200.012 142.281
 l 199.988 142.281 199.965 142.281 199.941 142.281 c 198.984 142.281 198.188
 143.07 198.188 144.027 c 198.188 144.988 198.984 145.785 199.941 145.785
 c 200.73 145.785 201.406 145.25 201.613 144.523 c 205.172 144.523 l 205.379
 145.25 206.055 145.785 206.852 145.785 c 207.809 145.785 208.598 144.996
 208.598 144.035 c 208.598 143.078 207.809 142.281 206.852 142.281 c 206.062
 142.281 205.395 142.805 205.176 143.52 c 201.613 143.52 l 201.504 143.152
 201.27 142.836 200.969 142.617 c 201.496 141.555 l 207.129 141.555 l 207.344
 141.555 207.539 141.41 207.609 141.203 c 209.641 134.848 l 209.691 134.699
 209.664 134.535 209.574 134.398 c 209.477 134.273 209.324 134.195 209.16
 134.195 c 198.113 134.195 l 197.738 132.668 l 197.691 132.492 197.566 132.359
 197.391 132.305 c h
198.172 135.203 m 208.469 135.203 l 206.762 140.551 l 199.859 140.551 l
 h
199.941 143.285 m 200.355 143.285 200.684 143.617 200.684 144.027 c 200.684
 144.449 200.355 144.773 199.941 144.773 c 199.523 144.773 199.199 144.449
 199.199 144.027 c 199.199 143.617 199.523 143.285 199.941 143.285 c h
206.852 143.293 m 207.262 143.293 207.594 143.625 207.594 144.035 c 207.594
 144.457 207.262 144.777 206.852 144.777 c 206.43 144.777 206.109 144.457
 206.109 144.035 c 206.109 143.625 206.43 143.293 206.852 143.293 c h
195.711 125.473 m 195.711 128.152 l 193.664 128.152 l 192.781 128.152 192.051
 128.879 192.051 129.766 c 192.051 131.805 l 189.406 131.805 l 189.406 132.809
 l 192.051 132.809 l 192.051 134.953 l 189.406 134.953 l 189.406 135.965
 l 192.051 135.965 l 192.051 138.098 l 189.406 138.098 l 189.406 139.109
 l 192.051 139.109 l 192.051 141.254 l 189.406 141.254 l 189.406 142.258
 l 192.051 142.258 l 192.051 144.383 l 189.406 144.383 l 189.406 145.395
 l 192.051 145.395 l 192.051 147.473 l 192.051 148.355 192.781 149.086 193.664
 149.086 c 195.711 149.086 l 195.711 151.723 l 196.719 151.723 l 196.719
 149.086 l 198.863 149.086 l 198.863 151.723 l 199.875 151.723 l 199.875
 149.086 l 202.02 149.086 l 202.02 151.723 l 203.023 151.723 l 203.023 149.086
 l 205.176 149.086 l 205.176 151.723 l 206.184 151.723 l 206.184 149.086
 l 208.297 149.086 l 208.297 151.723 l 209.309 151.723 l 209.309 149.086
 l 211.344 149.086 l 212.227 149.086 212.953 148.355 212.953 147.473 c 212.953
 145.395 l 215.594 145.395 l 215.594 144.383 l 212.953 144.383 l 212.953
 142.258 l 215.594 142.258 l 215.594 141.254 l 212.953 141.254 l 212.953
 139.109 l 215.594 139.109 l 215.594 138.098 l 212.953 138.098 l 212.953
 135.965 l 215.594 135.965 l 215.594 134.953 l 212.953 134.953 l 212.953
 132.809 l 215.594 132.809 l 215.594 131.805 l 212.953 131.805 l 212.953
 129.766 l 212.953 128.879 212.227 128.152 211.344 128.152 c 209.309 128.152
 l 209.309 125.473 l 208.297 125.473 l 208.297 128.152 l 206.184 128.152
 l 206.184 125.473 l 205.176 125.473 l 205.176 128.152 l 203.023 128.152
 l 203.023 125.473 l 202.02 125.473 l 202.02 128.152 l 199.875 128.152 l
 199.875 125.473 l 198.863 125.473 l 198.863 128.152 l 196.719 128.152 l
 196.719 125.473 l h
193.664 129.156 m 211.344 129.156 l 211.688 129.156 211.949 129.418 211.949
 129.766 c 211.949 147.473 l 211.949 147.816 211.688 148.078 211.344 148.078
 c 193.664 148.078 l 193.32 148.078 193.059 147.816 193.059 147.473 c 193.059
 129.766 l 193.059 129.418 193.32 129.156 193.664 129.156 c h
193.664 129.156 m f
1 g
5.551 90.973 m 40.949 90.973 l 43.195 90.973 45 92.781 45 95.023 c 45 113.926
 l 45 116.168 43.195 117.973 40.949 117.973 c 5.551 117.973 l 3.305 117.973
 1.5 116.168 1.5 113.926 c 1.5 95.023 l 1.5 92.781 3.305 90.973 5.551 90.973
 c h
5.551 90.973 m f
0.137255 0.266667 0.364706 rg
0.75 w
q 1 0 0 1 0 0 cm
187.727 154.605 m 172.273 171.344 l S Q
1 g
180 175.723 m 180 198.973 l 157.5 211.723 l 135 198.973 l 135 175.723 l
 157.5 162.973 l h
180 175.723 m f
0 0.313726 0.45098 rg
3 w
q 0 1 -1 0 0 0 cm
175.723 -180 m 198.973 -180 l 211.723 -157.5 l 198.973 -135 l 175.723 -135
 l 162.973 -157.5 l h
175.723 -180 m S Q
150.434 180.488 m 150.156 181.453 l 151.828 181.941 l 152.113 183.113 l
 151.988 183.238 151.949 183.426 152.004 183.598 c 154.004 189.953 l 154.074
 190.16 154.266 190.305 154.484 190.305 c 155.371 190.305 l 155.012 191.031
 l 154.988 191.031 154.965 191.031 154.941 191.031 c 153.984 191.031 153.188
 191.82 153.188 192.777 c 153.188 193.738 153.984 194.535 154.941 194.535
 c 155.73 194.535 156.406 194 156.613 193.273 c 160.172 193.273 l 160.379
 194 161.055 194.535 161.852 194.535 c 162.809 194.535 163.598 193.746 163.598
 192.785 c 163.598 191.828 162.809 191.031 161.852 191.031 c 161.062 191.031
 160.395 191.555 160.176 192.27 c 156.613 192.27 l 156.504 191.902 156.27
 191.586 155.969 191.367 c 156.496 190.305 l 162.129 190.305 l 162.344 190.305
 162.539 190.16 162.609 189.953 c 164.641 183.598 l 164.691 183.449 164.664
 183.285 164.574 183.148 c 164.477 183.023 164.324 182.945 164.16 182.945
 c 153.113 182.945 l 152.738 181.418 l 152.691 181.242 152.566 181.109 152.391
 181.055 c h
153.172 183.953 m 163.469 183.953 l 161.762 189.301 l 154.859 189.301 l
 h
154.941 192.035 m 155.355 192.035 155.684 192.367 155.684 192.777 c 155.684
 193.199 155.355 193.523 154.941 193.523 c 154.523 193.523 154.199 193.199
 154.199 192.777 c 154.199 192.367 154.523 192.035 154.941 192.035 c h
161.852 192.043 m 162.262 192.043 162.594 192.375 162.594 192.785 c 162.594
 193.207 162.262 193.527 161.852 193.527 c 161.43 193.527 161.109 193.207
 161.109 192.785 c 161.109 192.375 161.43 192.043 161.852 192.043 c h
150.711 174.223 m 150.711 176.902 l 148.664 176.902 l 147.781 176.902 147.051
 177.629 147.051 178.516 c 147.051 180.555 l 144.406 180.555 l 144.406 181.559
 l 147.051 181.559 l 147.051 183.703 l 144.406 183.703 l 144.406 184.715
 l 147.051 184.715 l 147.051 186.848 l 144.406 186.848 l 144.406 187.859
 l 147.051 187.859 l 147.051 190.004 l 144.406 190.004 l 144.406 191.008
 l 147.051 191.008 l 147.051 193.133 l 144.406 193.133 l 144.406 194.145
 l 147.051 194.145 l 147.051 196.223 l 147.051 197.105 147.781 197.836 148.664
 197.836 c 150.711 197.836 l 150.711 200.473 l 151.719 200.473 l 151.719
 197.836 l 153.863 197.836 l 153.863 200.473 l 154.875 200.473 l 154.875
 197.836 l 157.02 197.836 l 157.02 200.473 l 158.023 200.473 l 158.023 197.836
 l 160.176 197.836 l 160.176 200.473 l 161.184 200.473 l 161.184 197.836
 l 163.297 197.836 l 163.297 200.473 l 164.309 200.473 l 164.309 197.836
 l 166.344 197.836 l 167.227 197.836 167.953 197.105 167.953 196.223 c 167.953
 194.145 l 170.594 194.145 l 170.594 193.133 l 167.953 193.133 l 167.953
 191.008 l 170.594 191.008 l 170.594 190.004 l 167.953 190.004 l 167.953
 187.859 l 170.594 187.859 l 170.594 186.848 l 167.953 186.848 l 167.953
 184.715 l 170.594 184.715 l 170.594 183.703 l 167.953 183.703 l 167.953
 181.559 l 170.594 181.559 l 170.594 180.555 l 167.953 180.555 l 167.953
 178.516 l 167.953 177.629 167.227 176.902 166.344 176.902 c 164.309 176.902
 l 164.309 174.223 l 163.297 174.223 l 163.297 176.902 l 161.184 176.902
 l 161.184 174.223 l 160.176 174.223 l 160.176 176.902 l 158.023 176.902
 l 158.023 174.223 l 157.02 174.223 l 157.02 176.902 l 154.875 176.902 l
 154.875 174.223 l 153.863 174.223 l 153.863 176.902 l 151.719 176.902 l
 151.719 174.223 l h
148.664 177.906 m 166.344 177.906 l 166.688 177.906 166.949 178.168 166.949
 178.516 c 166.949 196.223 l 166.949 196.566 166.688 196.828 166.344 196.828
 c 148.664 196.828 l 148.32 196.828 148.059 196.566 148.059 196.223 c 148.059
 178.516 l 148.059 178.168 148.32 177.906 148.664 177.906 c h
148.664 177.906 m f
1 g
148.125 179.848 18.75 15 re f
0 0.313726 0.45098 rg
151.598 181.723 m 163.402 181.723 l 164.289 181.723 165 182.391 165 183.223
 c 165 191.473 l 165 192.305 164.289 192.973 163.402 192.973 c 151.598 192.973
 l 150.711 192.973 150 192.305 150 191.473 c 150 183.223 l 150 182.391 150.711
 181.723 151.598 181.723 c h
151.598 181.723 m f
1 g
151.453 187.32 m 163.539 187.32 l 163.539 191.609 l 151.453 191.609 l h
151.453 183.098 m 163.539 183.098 l 163.539 184.551 l 151.453 184.551 l
 h
151.453 183.098 m f
0 0.313726 0.45098 rg
5.379 94.492 m 40.273 94.492 l 40.273 114.328 l 5.379 114.328 l h
4.551 92.062 m 41.387 92.062 l 42.824 92.062 43.965 93.117 43.965 94.461
 c 43.965 114.59 l 43.965 115.934 42.824 116.992 41.387 116.992 c 4.551 
116.992 l 3.105 116.992 1.973 115.934 1.973 114.59 c 1.973 94.461 l 1.973
 93.117 3.105 92.062 4.551 92.062 c h
4.551 90.223 m 2.047 90.223 0 92.129 0 94.461 c 0 114.59 l 0 116.926 2.047
 118.828 4.551 118.828 c 18.879 118.828 l 18.879 123.023 l 12.039 123.023
 l 10.867 123.023 9.914 123.906 9.914 124.992 c 9.914 126.082 10.867 126.965
 12.039 126.965 c 33.691 126.965 l 34.859 126.965 35.805 126.082 35.805 
124.992 c 35.805 123.906 34.859 123.023 33.691 123.023 c 27.781 123.023 
l 27.781 118.828 l 41.387 118.828 l 43.891 118.828 45.938 116.926 45.938
 114.59 c 45.938 94.461 l 45.938 92.129 43.891 90.223 41.387 90.223 c h
4.551 90.223 m f
Q Q
showpage
%%Trailer
end
%%EOF
