%!PS-Adobe-3.0 EPSF-3.0
%%Creator: cairo 1.16.0 (https://cairographics.org)
%%CreationDate: Thu Jun 24 11:27:06 2021
%%Pages: 1
%%DocumentData: Clean7Bit
%%LanguageLevel: 2
%%BoundingBox: 0 0 197 67
%%EndComments
%%BeginProlog
50 dict begin
/q { gsave } bind def
/Q { grestore } bind def
/cm { 6 array astore concat } bind def
/w { setlinewidth } bind def
/J { setlinecap } bind def
/j { setlinejoin } bind def
/M { setmiterlimit } bind def
/d { setdash } bind def
/m { moveto } bind def
/l { lineto } bind def
/c { curveto } bind def
/h { closepath } bind def
/re { exch dup neg 3 1 roll 5 3 roll moveto 0 rlineto
      0 exch rlineto 0 rlineto closepath } bind def
/S { stroke } bind def
/f { fill } bind def
/f* { eofill } bind def
/n { newpath } bind def
/W { clip } bind def
/W* { eoclip } bind def
/BT { } bind def
/ET { } bind def
/BDC { mark 3 1 roll /BDC pdfmark } bind def
/EMC { mark /EMC pdfmark } bind def
/cairo_store_point { /cairo_point_y exch def /cairo_point_x exch def } def
/Tj { show currentpoint cairo_store_point } bind def
/TJ {
  {
    dup
    type /stringtype eq
    { show } { -0.001 mul 0 cairo_font_matrix dtransform rmoveto } ifelse
  } forall
  currentpoint cairo_store_point
} bind def
/cairo_selectfont { cairo_font_matrix aload pop pop pop 0 0 6 array astore
    cairo_font exch selectfont cairo_point_x cairo_point_y moveto } bind def
/Tf { pop /cairo_font exch def /cairo_font_matrix where
      { pop cairo_selectfont } if } bind def
/Td { matrix translate cairo_font_matrix matrix concatmatrix dup
      /cairo_font_matrix exch def dup 4 get exch 5 get cairo_store_point
      /cairo_font where { pop cairo_selectfont } if } bind def
/Tm { 2 copy 8 2 roll 6 array astore /cairo_font_matrix exch def
      cairo_store_point /cairo_font where { pop cairo_selectfont } if } bind def
/g { setgray } bind def
/rg { setrgbcolor } bind def
/d1 { setcachedevice } bind def
/cairo_data_source {
  CairoDataIndex CairoData length lt
    { CairoData CairoDataIndex get /CairoDataIndex CairoDataIndex 1 add def }
    { () } ifelse
} def
/cairo_flush_ascii85_file { cairo_ascii85_file status { cairo_ascii85_file flushfile } if } def
/cairo_image { image cairo_flush_ascii85_file } def
/cairo_imagemask { imagemask cairo_flush_ascii85_file } def
%%EndProlog
%%BeginSetup
%%EndSetup
%%Page: 1 1
%%BeginPageSetup
%%PageBoundingBox: 0 0 197 67
%%EndPageSetup
q 0 0 197 67 rectclip
1 0 0 -1 0 67 cm q
0 0.313726 0.45098 rg
33.512 34.641 m 29.578 35.324 23.863 35.902 18.945 35.902 c 14.512 35.938
 8.969 35.504 4.035 34.688 c 4.109 37.133 4.906 39.215 6.246 41.023 c 7.469
 49.508 13.656 53.715 18.504 53.715 c 24.699 53.715 30.09 48.996 31.266 
41 c 32.52 39.41 33.504 36.957 33.512 34.641 c h
12.262 37.91 m 12.09 38.43 12.172 38.953 12.629 39.395 c 13.23 39.973 13.949
 39.949 14.52 39.5 c 14.902 39.188 15.18 38.715 15.047 38.168 c 15.301 38.234
 15.473 38.355 15.602 38.496 c 15.809 38.699 15.789 38.953 15.727 39.277
 c 15.613 39.777 15.082 40.512 14.266 40.648 c 12.801 40.895 12.172 40.305
 11.602 39.824 c 11.266 39.449 10.926 38.93 11.016 38.406 c 11.078 38.07
 11.812 37.949 12.262 37.91 c h
25.262 37.902 m 25.844 37.957 26.281 38.062 26.52 38.324 c 26.656 38.832
 26.391 39.352 25.828 39.914 c 24.953 40.656 24.359 40.859 23.211 40.648
 c 22.695 40.527 22.043 40.07 21.84 39.344 c 21.781 39.141 21.684 38.758
 21.879 38.57 c 22.059 38.359 22.23 38.242 22.492 38.172 c 22.395 38.645
 22.531 39.059 22.98 39.484 c 23.438 39.875 24.246 40.047 24.855 39.441 
c 25.23 39.082 25.531 38.465 25.262 37.902 c h
8.43 40.492 m 9.48 41.543 11.016 42.492 12.699 43.109 c 14.203 43.688 15.465
 43.777 16.664 42.777 c 17.258 42.305 17.656 41.871 18.121 41.414 c 18.512
 41.008 18.824 40.984 19.246 41.348 c 19.828 41.918 20.34 42.426 20.812 
42.758 c 22.191 43.852 23.289 43.68 25.41 42.875 c 26.797 42.328 28.297 
41.293 29.129 40.5 c 28.734 43.418 27.855 45.68 25.824 48.125 c 24.121 50.031
 21.789 51.48 18.691 51.48 c 15.863 51.48 13.363 50.016 11.543 47.953 c 
9.871 45.93 8.836 43.609 8.43 40.492 c h
17.176 45.742 m 16.434 46.125 15.848 46.484 15.848 47.113 c 15.855 47.594
 16.32 47.73 17.094 47.82 c 18.105 47.91 19.125 47.895 20.137 47.832 c 20.836
 47.797 21.504 47.773 21.711 47.16 c 21.84 46.699 21.18 46.125 20.664 45.898
 c 19.559 45.336 18.148 45.367 17.176 45.742 c h
2.199 33.09 m 0.984 32.879 0 32.047 0.047 30.68 c 0.098 29.758 0.75 28.883
 2.266 28.609 c 3.691 28.355 5.586 28.062 7.402 27.859 c 7.852 25.656 8.273
 23.359 8.543 20.586 c 8.527 19.258 8.812 18.164 10.109 17.48 c 10.934 17.09
 12.301 17.016 13.688 17.48 c 16.441 18.574 20.773 18.688 24.016 17.473 
c 25.012 17.145 26.16 16.965 27.309 17.445 c 28.566 18.012 29.012 19.07 
28.973 20.121 c 29.16 23.023 29.617 25.754 30.098 27.859 c 31.996 28.117
 33.961 28.332 35.633 28.699 c 36.879 29.008 37.5 29.84 37.5 30.801 c 37.5
 32.023 36.621 32.723 35.887 32.945 c 31.965 33.777 26.559 34.699 18.832
 34.699 c 13.051 34.699 7.434 34.125 2.199 33.09 c h
2.199 33.09 m f
0.137255 0.266667 0.364706 rg
0.75 w
0 J
0 j
[] 0.0 d
10 M q 1 0 0 1 0 0 cm
47.625 33.465 m 132.848 33.465 l S Q
136.785 33.465 m 131.535 36.09 l 132.848 33.465 l 131.535 30.84 l h
136.785 33.465 m f
q 1 0 0 1 0 0 cm
136.785 33.465 m 131.535 36.09 l 132.848 33.465 l 131.535 30.84 l h
136.785 33.465 m S Q
q 1 0 0 1 0 0 cm
48 18.465 m 133.223 18.465 l S Q
137.16 18.465 m 131.91 21.09 l 133.223 18.465 l 131.91 15.84 l h
137.16 18.465 m f
q 1 0 0 1 0 0 cm
137.16 18.465 m 131.91 21.09 l 133.223 18.465 l 131.91 15.84 l h
137.16 18.465 m S Q
q 1 0 0 1 0 0 cm
48 47.715 m 133.223 47.715 l S Q
137.16 47.715 m 131.91 50.34 l 133.223 47.715 l 131.91 45.09 l h
137.16 47.715 m f
q 1 0 0 1 0 0 cm
137.16 47.715 m 131.91 50.34 l 133.223 47.715 l 131.91 45.09 l h
137.16 47.715 m S Q
q 1 0 0 1 0 0 cm
48 3.465 m 133.223 3.465 l S Q
137.16 3.465 m 131.91 6.09 l 133.223 3.465 l 131.91 0.84 l h
137.16 3.465 m f
q 1 0 0 1 0 0 cm
137.16 3.465 m 131.91 6.09 l 133.223 3.465 l 131.91 0.84 l h
137.16 3.465 m S Q
q 1 0 0 1 0 0 cm
48 63.09 m 133.223 63.09 l S Q
137.16 63.09 m 131.91 65.715 l 133.223 63.09 l 131.91 60.465 l h
137.16 63.09 m f
q 1 0 0 1 0 0 cm
137.16 63.09 m 131.91 65.715 l 133.223 63.09 l 131.91 60.465 l h
137.16 63.09 m S Q
1 g
195 23.715 m 195 46.965 l 172.5 59.715 l 150 46.965 l 150 23.715 l 172.5
 10.965 l h
195 23.715 m f
0 0.313726 0.45098 rg
3 w
q 0 1 -1 0 0 0 cm
23.715 -195 m 46.965 -195 l 59.715 -172.5 l 46.965 -150 l 23.715 -150 l
 10.965 -172.5 l h
23.715 -195 m S Q
178.141 34.047 m 178.141 29.609 l 179.266 29.609 l 179.266 34.047 l h
175.703 34.047 m 175.703 31.828 l 176.836 31.828 l 176.836 34.047 l h
173.309 34.047 m 173.309 30.672 l 174.426 30.672 l 174.426 34.047 l h
176.199 37.34 m 179.781 37.34 182.211 34.836 182.211 32.008 c 182.211 29.098
 179.977 26.652 176.184 26.652 c 173.371 26.652 170.355 28.633 170.355 31.941
 c 170.355 35.172 173.281 37.34 176.199 37.34 c h
163.98 45.312 m 163.109 46.035 162 46.215 161.113 45.426 c 160.312 44.625
 160.621 43.633 161.184 43.133 c 165.219 39.312 l 165.922 38.645 167.145
 37.793 168.383 37.273 c 168.984 36.973 169.379 36.629 168.996 35.848 c 
168.406 34.715 167.941 33.66 167.941 31.664 c 167.941 27.809 171.727 24.465
 176.242 24.465 c 181.711 24.465 184.688 28.695 184.688 32.07 c 184.688 
35.871 181.043 39.531 176.496 39.531 c 175.352 39.531 173.934 39.164 172.941
 38.824 c 171.969 38.512 170.863 38.48 170.062 39.547 c 169.582 40.078 169.035
 41.105 167.559 42.383 c h
163.98 45.312 m f
Q Q
showpage
%%Trailer
end
%%EOF
