%!PS-Adobe-3.0 EPSF-3.0
%%Creator: cairo 1.17.4 (https://cairographics.org)
%%CreationDate: Mon Aug  2 13:53:42 2021
%%Pages: 1
%%DocumentData: Clean7Bit
%%LanguageLevel: 2
%%BoundingBox: 0 0 301 136
%%EndComments
%%BeginProlog
50 dict begin
/q { gsave } bind def
/Q { grestore } bind def
/cm { 6 array astore concat } bind def
/w { setlinewidth } bind def
/J { setlinecap } bind def
/j { setlinejoin } bind def
/M { setmiterlimit } bind def
/d { setdash } bind def
/m { moveto } bind def
/l { lineto } bind def
/c { curveto } bind def
/h { closepath } bind def
/re { exch dup neg 3 1 roll 5 3 roll moveto 0 rlineto
      0 exch rlineto 0 rlineto closepath } bind def
/S { stroke } bind def
/f { fill } bind def
/f* { eofill } bind def
/n { newpath } bind def
/W { clip } bind def
/W* { eoclip } bind def
/BT { } bind def
/ET { } bind def
/BDC { mark 3 1 roll /BDC pdfmark } bind def
/EMC { mark /EMC pdfmark } bind def
/cairo_store_point { /cairo_point_y exch def /cairo_point_x exch def } def
/Tj { show currentpoint cairo_store_point } bind def
/TJ {
  {
    dup
    type /stringtype eq
    { show } { -0.001 mul 0 cairo_font_matrix dtransform rmoveto } ifelse
  } forall
  currentpoint cairo_store_point
} bind def
/cairo_selectfont { cairo_font_matrix aload pop pop pop 0 0 6 array astore
    cairo_font exch selectfont cairo_point_x cairo_point_y moveto } bind def
/Tf { pop /cairo_font exch def /cairo_font_matrix where
      { pop cairo_selectfont } if } bind def
/Td { matrix translate cairo_font_matrix matrix concatmatrix dup
      /cairo_font_matrix exch def dup 4 get exch 5 get cairo_store_point
      /cairo_font where { pop cairo_selectfont } if } bind def
/Tm { 2 copy 8 2 roll 6 array astore /cairo_font_matrix exch def
      cairo_store_point /cairo_font where { pop cairo_selectfont } if } bind def
/g { setgray } bind def
/rg { setrgbcolor } bind def
/d1 { setcachedevice } bind def
/cairo_data_source {
  CairoDataIndex CairoData length lt
    { CairoData CairoDataIndex get /CairoDataIndex CairoDataIndex 1 add def }
    { () } ifelse
} def
/cairo_flush_ascii85_file { cairo_ascii85_file status { cairo_ascii85_file flushfile } if } def
/cairo_image { image cairo_flush_ascii85_file } def
/cairo_imagemask { imagemask cairo_flush_ascii85_file } def
%%EndProlog
%%BeginSetup
%%EndSetup
%%Page: 1 1
%%BeginPageSetup
%%PageBoundingBox: 0 0 301 136
%%EndPageSetup
q 0 0 301 136 rectclip
1 0 0 -1 0 136 cm q
1 g
0.375 0.375 300 135 re f
0.137255 0.266667 0.364706 rg
0.75 w
0 J
0 j
[] 0.0 d
10 M q 1 0 0 1 0 0 cm
22.875 120.375 m 22.875 12.652 l S Q
22.875 8.715 m 25.5 13.965 l 22.875 12.652 l 20.25 13.965 l h
22.875 8.715 m f
q 1 0 0 1 0 0 cm
22.875 8.715 m 25.5 13.965 l 22.875 12.652 l 20.25 13.965 l h
22.875 8.715 m S Q
q 1 0 0 1 0 0 cm
22.875 120.375 m 288.098 120.375 l S Q
292.035 120.375 m 286.785 123 l 288.098 120.375 l 286.785 117.75 l h
292.035 120.375 m f
q 1 0 0 1 0 0 cm
292.035 120.375 m 286.785 123 l 288.098 120.375 l 286.785 117.75 l h
292.035 120.375 m S Q
q 1 0 0 1 0 0 cm
30.375 45.375 m 75.375 45.375 l S Q
q 1 0 0 1 0 0 cm
75.375 45.375 m 75.375 85.375 84.125 107.875 101.625 112.875 c 119.125 
117.875 136.625 116.625 154.125 109.125 c 171.625 101.625 189.125 89.125
 206.625 71.625 c 224.125 54.125 243.781 45.375 265.598 45.375 c S Q
269.535 45.375 m 264.285 48 l 265.598 45.375 l 264.285 42.75 l h
269.535 45.375 m f
q 1 0 0 1 0 0 cm
269.535 45.375 m 264.285 48 l 265.598 45.375 l 264.285 42.75 l h
269.535 45.375 m S Q
q 1 0 0 1 0 0 cm
75.375 45.375 m 85.375 80.375 102.875 96.625 127.875 94.125 c 152.875 91.625
 174.125 82.875 191.625 67.875 c 209.125 52.875 235.375 45.375 270.375 45.375
 c S Q
q 1 0 0 1 0 0 cm
75.375 45.375 m 95.375 60.375 111.625 67.875 124.125 67.875 c 136.625 67.875
 150.375 64.125 165.375 56.625 c 180.375 49.125 215.375 45.375 270.375 45.375
 c S Q
q 1 0 0 1 0 0 cm
176.895 105.988 m 144.691 61.129 l S Q
1 g
154.055 44.293 m 194.312 102.816 l 195.613 105.156 l 185.469 110.844 l 
184.703 111.695 l 141.336 52.812 l 142.637 50.531 l 151.469 44.199 l 152.551
 42.879 l 153.18 45.945 l f
0.137255 0.266667 0.364706 rg
142.395 57.93 m 147.59 60.664 l 144.691 61.129 l 143.324 63.727 l h
142.395 57.93 m f
q 1 0 0 1 0 0 cm
142.395 57.93 m 147.59 60.664 l 144.691 61.129 l 143.324 63.727 l h
142.395 57.93 m S Q
Q Q
showpage
%%Trailer
end
%%EOF
