%!PS-Adobe-3.0 EPSF-3.0
%%Creator: cairo 1.17.4 (https://cairographics.org)
%%CreationDate: Wed Jun 30 10:05:58 2021
%%Pages: 1
%%DocumentData: Clean7Bit
%%LanguageLevel: 2
%%BoundingBox: 0 0 254 151
%%EndComments
%%BeginProlog
50 dict begin
/q { gsave } bind def
/Q { grestore } bind def
/cm { 6 array astore concat } bind def
/w { setlinewidth } bind def
/J { setlinecap } bind def
/j { setlinejoin } bind def
/M { setmiterlimit } bind def
/d { setdash } bind def
/m { moveto } bind def
/l { lineto } bind def
/c { curveto } bind def
/h { closepath } bind def
/re { exch dup neg 3 1 roll 5 3 roll moveto 0 rlineto
      0 exch rlineto 0 rlineto closepath } bind def
/S { stroke } bind def
/f { fill } bind def
/f* { eofill } bind def
/n { newpath } bind def
/W { clip } bind def
/W* { eoclip } bind def
/BT { } bind def
/ET { } bind def
/BDC { mark 3 1 roll /BDC pdfmark } bind def
/EMC { mark /EMC pdfmark } bind def
/cairo_store_point { /cairo_point_y exch def /cairo_point_x exch def } def
/Tj { show currentpoint cairo_store_point } bind def
/TJ {
  {
    dup
    type /stringtype eq
    { show } { -0.001 mul 0 cairo_font_matrix dtransform rmoveto } ifelse
  } forall
  currentpoint cairo_store_point
} bind def
/cairo_selectfont { cairo_font_matrix aload pop pop pop 0 0 6 array astore
    cairo_font exch selectfont cairo_point_x cairo_point_y moveto } bind def
/Tf { pop /cairo_font exch def /cairo_font_matrix where
      { pop cairo_selectfont } if } bind def
/Td { matrix translate cairo_font_matrix matrix concatmatrix dup
      /cairo_font_matrix exch def dup 4 get exch 5 get cairo_store_point
      /cairo_font where { pop cairo_selectfont } if } bind def
/Tm { 2 copy 8 2 roll 6 array astore /cairo_font_matrix exch def
      cairo_store_point /cairo_font where { pop cairo_selectfont } if } bind def
/g { setgray } bind def
/rg { setrgbcolor } bind def
/d1 { setcachedevice } bind def
/cairo_data_source {
  CairoDataIndex CairoData length lt
    { CairoData CairoDataIndex get /CairoDataIndex CairoDataIndex 1 add def }
    { () } ifelse
} def
/cairo_flush_ascii85_file { cairo_ascii85_file status { cairo_ascii85_file flushfile } if } def
/cairo_image { image cairo_flush_ascii85_file } def
/cairo_imagemask { imagemask cairo_flush_ascii85_file } def
%%EndProlog
%%BeginSetup
%%EndSetup
%%Page: 1 1
%%BeginPageSetup
%%PageBoundingBox: 0 0 254 151
%%EndPageSetup
q 0 0 254 151 rectclip
1 0 0 -1 0 151 cm q
1 g
0.562 0.375 253.125 150 re f
0 0.313726 0.45098 rg
3 w
0 J
0 j
[] 0.0 d
10 M q 0 1 -1 0 0 0 cm
63.75 -48.375 m 87 -48.375 l 99.75 -25.875 l 87 -3.375 l 63.75 -3.375 l
 51 -25.875 l h
63.75 -48.375 m S Q
q 0 1 -1 0 0 0 cm
63.75 -250.875 m 87 -250.875 l 99.75 -228.375 l 87 -205.875 l 63.75 -205.875
 l 51 -228.375 l h
63.75 -250.875 m S Q
0.137255 0.266667 0.364706 rg
0.75 w
q 1 0 0 1 0 0 cm
67.125 15.375 m 182.348 15.375 l S Q
186.285 15.375 m 181.035 18 l 182.348 15.375 l 181.035 12.75 l h
186.285 15.375 m f
q 1 0 0 1 0 0 cm
186.285 15.375 m 181.035 18 l 182.348 15.375 l 181.035 12.75 l h
186.285 15.375 m S Q
q 1 0 0 1 0 0 cm
187.125 45.375 m 71.902 45.375 l S Q
67.965 45.375 m 73.215 42.75 l 71.902 45.375 l 73.215 48 l h
67.965 45.375 m f
q 1 0 0 1 0 0 cm
67.965 45.375 m 73.215 42.75 l 71.902 45.375 l 73.215 48 l h
67.965 45.375 m S Q
q 1 0 0 1 0 0 cm
187.125 60.383 m 71.902 60.375 l S Q
67.965 60.375 m 73.215 57.75 l 71.902 60.375 l 73.215 63 l h
67.965 60.375 m f
q 1 0 0 1 0 0 cm
67.965 60.375 m 73.215 57.75 l 71.902 60.375 l 73.215 63 l h
67.965 60.375 m S Q
q 1 0 0 1 0 0 cm
187.125 75.375 m 71.902 75.375 l S Q
67.965 75.375 m 73.215 72.75 l 71.902 75.375 l 73.215 78 l h
67.965 75.375 m f
q 1 0 0 1 0 0 cm
67.965 75.375 m 73.215 72.75 l 71.902 75.375 l 73.215 78 l h
67.965 75.375 m S Q
q 1 0 0 1 0 0 cm
67.125 105.375 m 182.348 105.375 l S Q
186.285 105.375 m 181.035 108 l 182.348 105.375 l 181.035 102.75 l h
186.285 105.375 m f
q 1 0 0 1 0 0 cm
186.285 105.375 m 181.035 108 l 182.348 105.375 l 181.035 102.75 l h
186.285 105.375 m S Q
q 1 0 0 1 0 0 cm
67.125 135.375 m 182.348 135.375 l S Q
186.285 135.375 m 181.035 138 l 182.348 135.375 l 181.035 132.75 l h
186.285 135.375 m f
q 1 0 0 1 0 0 cm
186.285 135.375 m 181.035 138 l 182.348 135.375 l 181.035 132.75 l h
186.285 135.375 m S Q
q 1 0 0 1 0 0 cm
187.125 142.875 m 71.902 142.875 l S Q
67.965 142.875 m 73.215 140.25 l 71.902 142.875 l 73.215 145.5 l h
67.965 142.875 m f
q 1 0 0 1 0 0 cm
67.965 142.875 m 73.215 140.25 l 71.902 142.875 l 73.215 145.5 l h
67.965 142.875 m S Q
Q Q
showpage
%%Trailer
end
%%EOF
