%!PS-Adobe-3.0 EPSF-3.0
%%Creator: cairo 1.17.4 (https://cairographics.org)
%%CreationDate: Fri Aug  6 14:12:00 2021
%%Pages: 1
%%DocumentData: Clean7Bit
%%LanguageLevel: 2
%%BoundingBox: 3 0 195 169
%%EndComments
%%BeginProlog
50 dict begin
/q { gsave } bind def
/Q { grestore } bind def
/cm { 6 array astore concat } bind def
/w { setlinewidth } bind def
/J { setlinecap } bind def
/j { setlinejoin } bind def
/M { setmiterlimit } bind def
/d { setdash } bind def
/m { moveto } bind def
/l { lineto } bind def
/c { curveto } bind def
/h { closepath } bind def
/re { exch dup neg 3 1 roll 5 3 roll moveto 0 rlineto
      0 exch rlineto 0 rlineto closepath } bind def
/S { stroke } bind def
/f { fill } bind def
/f* { eofill } bind def
/n { newpath } bind def
/W { clip } bind def
/W* { eoclip } bind def
/BT { } bind def
/ET { } bind def
/BDC { mark 3 1 roll /BDC pdfmark } bind def
/EMC { mark /EMC pdfmark } bind def
/cairo_store_point { /cairo_point_y exch def /cairo_point_x exch def } def
/Tj { show currentpoint cairo_store_point } bind def
/TJ {
  {
    dup
    type /stringtype eq
    { show } { -0.001 mul 0 cairo_font_matrix dtransform rmoveto } ifelse
  } forall
  currentpoint cairo_store_point
} bind def
/cairo_selectfont { cairo_font_matrix aload pop pop pop 0 0 6 array astore
    cairo_font exch selectfont cairo_point_x cairo_point_y moveto } bind def
/Tf { pop /cairo_font exch def /cairo_font_matrix where
      { pop cairo_selectfont } if } bind def
/Td { matrix translate cairo_font_matrix matrix concatmatrix dup
      /cairo_font_matrix exch def dup 4 get exch 5 get cairo_store_point
      /cairo_font where { pop cairo_selectfont } if } bind def
/Tm { 2 copy 8 2 roll 6 array astore /cairo_font_matrix exch def
      cairo_store_point /cairo_font where { pop cairo_selectfont } if } bind def
/g { setgray } bind def
/rg { setrgbcolor } bind def
/d1 { setcachedevice } bind def
/cairo_data_source {
  CairoDataIndex CairoData length lt
    { CairoData CairoDataIndex get /CairoDataIndex CairoDataIndex 1 add def }
    { () } ifelse
} def
/cairo_flush_ascii85_file { cairo_ascii85_file status { cairo_ascii85_file flushfile } if } def
/cairo_image { image cairo_flush_ascii85_file } def
/cairo_imagemask { imagemask cairo_flush_ascii85_file } def
%%EndProlog
%%BeginSetup
%%EndSetup
%%Page: 1 1
%%BeginPageSetup
%%PageBoundingBox: 3 0 195 169
%%EndPageSetup
q 3 0 192 169 rectclip
1 0 0 -1 0 169 cm q
1 g
192.562 73.906 m 192.562 97.156 l 170.062 109.906 l 147.562 97.156 l 147.562
 73.906 l 170.062 61.156 l h
192.562 73.906 m f
0 0.313726 0.45098 rg
3 w
0 J
0 j
[] 0.0 d
10 M q 0 1 -1 0 0 0 cm
73.906 -192.562 m 97.156 -192.562 l 109.906 -170.062 l 97.156 -147.562 
l 73.906 -147.562 l 61.156 -170.062 l h
73.906 -192.562 m S Q
0.137255 0.266667 0.364706 rg
0.75 w
q 1 0 0 1 0 0 cm
23.25 53.281 m 23.266 114.531 l S Q
23.266 118.469 m 20.641 113.219 l 23.266 114.531 l 25.891 113.219 l h
23.266 118.469 m f
q 1 0 0 1 0 0 cm
23.266 118.469 m 20.641 113.219 l 23.266 114.531 l 25.891 113.219 l h
23.266 118.469 m S Q
1 g
49.5 130.5 m 49.5 153.75 l 27 166.5 l 4.5 153.75 l 4.5 130.5 l 27 117.75
 l h
49.5 130.5 m f
0 0.313726 0.45098 rg
3 w
q 0 1 -1 0 0 0 cm
130.5 -49.5 m 153.75 -49.5 l 166.5 -27 l 153.75 -4.5 l 130.5 -4.5 l 117.75
 -27 l h
130.5 -49.5 m S Q
32.641 140.836 m 32.641 136.395 l 33.766 136.395 l 33.766 140.836 l h
30.203 140.836 m 30.203 138.613 l 31.336 138.613 l 31.336 140.836 l h
27.809 140.836 m 27.809 137.461 l 28.926 137.461 l 28.926 140.836 l h
30.699 144.129 m 34.281 144.129 36.711 141.621 36.711 138.797 c 36.711 
135.887 34.477 133.441 30.684 133.441 c 27.871 133.441 24.855 135.422 24.855
 138.727 c 24.855 141.961 27.781 144.129 30.699 144.129 c h
18.48 152.102 m 17.609 152.82 16.5 153 15.613 152.211 c 14.812 151.41 15.121
 150.422 15.684 149.918 c 19.719 146.102 l 20.422 145.434 21.645 144.578
 22.883 144.059 c 23.484 143.762 23.879 143.414 23.496 142.637 c 22.906 
141.504 22.441 140.445 22.441 138.449 c 22.441 134.594 26.227 131.25 30.742
 131.25 c 36.211 131.25 39.188 135.48 39.188 138.855 c 39.188 142.656 35.543
 146.316 30.996 146.316 c 29.852 146.316 28.434 145.949 27.441 145.613 c
 26.469 145.297 25.363 145.266 24.562 146.332 c 24.082 146.863 23.535 147.891
 22.059 149.168 c h
18.48 152.102 m f
0.137255 0.266667 0.364706 rg
0.75 w
q 1 0 0 1 0 0 cm
30.238 118.289 m 30.531 57.652 l S Q
30.547 53.715 m 33.148 58.973 l 30.531 57.652 l 27.898 58.949 l h
30.547 53.715 m f
q 1 0 0 1 0 0 cm
30.547 53.715 m 33.148 58.973 l 30.531 57.652 l 27.898 58.949 l h
30.547 53.715 m S Q
q 1 0 0 1 0 0 cm
44.527 43.852 m 143.031 76.551 l S Q
146.766 77.797 m 140.953 78.629 l 143.031 76.551 l 142.613 73.648 l h
146.766 77.797 m f
q 1 0 0 1 0 0 cm
146.766 77.797 m 140.953 78.629 l 143.031 76.551 l 142.613 73.648 l h
146.766 77.797 m S Q
1 g
49.5 18 m 49.5 41.25 l 27 54 l 4.5 41.25 l 4.5 18 l 27 5.25 l h
49.5 18 m f
0 0.313726 0.45098 rg
3 w
q 0 1 -1 0 0 0 cm
18 -49.5 m 41.25 -49.5 l 54 -27 l 41.25 -4.5 l 18 -4.5 l 5.25 -27 l h
18 -49.5 m S Q
1 g
192.562 18 m 192.562 41.25 l 170.062 54 l 147.562 41.25 l 147.562 18 l 
170.062 5.25 l h
192.562 18 m f
0 0.313726 0.45098 rg
q 0 1 -1 0 0 0 cm
18 -192.562 m 41.25 -192.562 l 54 -170.062 l 41.25 -147.562 l 18 -147.562
 l 5.25 -170.062 l h
18 -192.562 m S Q
1 g
174.004 2.785 m 190.594 12.312 l 186.797 18.996 l 170.207 9.469 l h
174.004 2.785 m f
0 0.313726 0.45098 rg
189.066 9.391 m 187.102 9.742 184.246 10.035 181.785 10.035 c 179.574 10.059
 176.797 9.832 174.328 9.414 c 174.367 10.664 174.766 11.73 175.441 12.652
 c 176.047 16.98 179.145 19.125 181.559 19.125 c 184.656 19.125 187.359 
16.719 187.949 12.637 c 188.574 11.828 189.066 10.574 189.066 9.391 c h
178.441 11.062 m 178.359 11.324 178.395 11.594 178.629 11.82 c 178.926 
12.113 179.289 12.105 179.574 11.871 c 179.766 11.715 179.902 11.477 179.836
 11.191 c 179.961 11.227 180.051 11.289 180.113 11.363 c 180.219 11.469 
180.203 11.594 180.172 11.762 c 180.121 12.016 179.859 12.391 179.445 12.457
 c 178.719 12.586 178.402 12.285 178.117 12.039 c 177.945 11.852 177.773
 11.578 177.824 11.316 c 177.848 11.145 178.215 11.086 178.441 11.062 c 
h
184.941 11.055 m 185.234 11.086 185.453 11.137 185.574 11.273 c 185.641
 11.535 185.512 11.797 185.227 12.082 c 184.785 12.465 184.492 12.562 183.922
 12.457 c 183.66 12.398 183.328 12.164 183.234 11.797 c 183.203 11.691 183.156
 11.496 183.246 11.398 c 183.344 11.297 183.426 11.227 183.555 11.199 c 
183.512 11.438 183.578 11.648 183.801 11.863 c 184.035 12.066 184.441 12.148
 184.738 11.844 c 184.926 11.664 185.078 11.348 184.941 11.055 c h
176.527 12.383 m 177.051 12.914 177.824 13.402 178.656 13.711 c 179.414
 14.012 180.047 14.055 180.645 13.547 c 180.945 13.305 181.141 13.078 181.371
 12.848 c 181.566 12.645 181.727 12.629 181.934 12.816 c 182.227 13.102 
182.484 13.363 182.723 13.539 c 183.406 14.094 183.961 14.004 185.016 13.598
 c 185.715 13.312 186.457 12.789 186.879 12.383 c 186.684 13.875 186.238
 15.031 185.219 16.273 c 184.371 17.25 183.211 17.984 181.656 17.984 c 180.246
 17.984 178.996 17.242 178.078 16.184 c 177.246 15.148 176.73 13.973 176.527
 12.383 c h
180.898 15.059 m 180.523 15.254 180.238 15.434 180.238 15.758 c 180.238
 15.996 180.473 16.074 180.855 16.117 c 181.363 16.164 181.875 16.156 182.387
 16.125 c 182.73 16.102 183.066 16.094 183.164 15.781 c 183.234 15.547 182.902
 15.254 182.648 15.137 c 182.094 14.852 181.387 14.863 180.898 15.059 c 
h
173.406 8.602 m 172.801 8.488 172.312 8.07 172.336 7.371 c 172.363 6.906
 172.688 6.449 173.445 6.324 c 174.156 6.188 175.109 6.039 176.012 5.934
 c 176.234 4.809 176.453 3.637 176.586 2.227 c 176.578 1.547 176.715 0.988
 177.367 0.637 c 177.781 0.434 178.461 0.398 179.152 0.637 c 180.531 1.199
 182.699 1.254 184.32 0.637 c 184.824 0.465 185.391 0.375 185.969 0.621 
c 186.594 0.914 186.816 1.449 186.797 1.988 c 186.891 3.465 187.125 4.859
 187.363 5.934 c 188.309 6.066 189.293 6.172 190.133 6.359 c 190.754 6.516
 191.062 6.945 191.062 7.434 c 191.062 8.062 190.629 8.414 190.254 8.527
 c 188.297 8.953 185.586 9.426 181.734 9.426 c 178.836 9.426 176.023 9.129
 173.406 8.602 c h
173.406 8.602 m f
Q Q
showpage
%%Trailer
end
%%EOF
