%!PS-Adobe-3.0 EPSF-3.0
%%Creator: cairo 1.17.4 (https://cairographics.org)
%%CreationDate: Wed Jun 30 14:22:40 2021
%%Pages: 1
%%DocumentData: Clean7Bit
%%LanguageLevel: 2
%%BoundingBox: 0 0 256 196
%%EndComments
%%BeginProlog
50 dict begin
/q { gsave } bind def
/Q { grestore } bind def
/cm { 6 array astore concat } bind def
/w { setlinewidth } bind def
/J { setlinecap } bind def
/j { setlinejoin } bind def
/M { setmiterlimit } bind def
/d { setdash } bind def
/m { moveto } bind def
/l { lineto } bind def
/c { curveto } bind def
/h { closepath } bind def
/re { exch dup neg 3 1 roll 5 3 roll moveto 0 rlineto
      0 exch rlineto 0 rlineto closepath } bind def
/S { stroke } bind def
/f { fill } bind def
/f* { eofill } bind def
/n { newpath } bind def
/W { clip } bind def
/W* { eoclip } bind def
/BT { } bind def
/ET { } bind def
/BDC { mark 3 1 roll /BDC pdfmark } bind def
/EMC { mark /EMC pdfmark } bind def
/cairo_store_point { /cairo_point_y exch def /cairo_point_x exch def } def
/Tj { show currentpoint cairo_store_point } bind def
/TJ {
  {
    dup
    type /stringtype eq
    { show } { -0.001 mul 0 cairo_font_matrix dtransform rmoveto } ifelse
  } forall
  currentpoint cairo_store_point
} bind def
/cairo_selectfont { cairo_font_matrix aload pop pop pop 0 0 6 array astore
    cairo_font exch selectfont cairo_point_x cairo_point_y moveto } bind def
/Tf { pop /cairo_font exch def /cairo_font_matrix where
      { pop cairo_selectfont } if } bind def
/Td { matrix translate cairo_font_matrix matrix concatmatrix dup
      /cairo_font_matrix exch def dup 4 get exch 5 get cairo_store_point
      /cairo_font where { pop cairo_selectfont } if } bind def
/Tm { 2 copy 8 2 roll 6 array astore /cairo_font_matrix exch def
      cairo_store_point /cairo_font where { pop cairo_selectfont } if } bind def
/g { setgray } bind def
/rg { setrgbcolor } bind def
/d1 { setcachedevice } bind def
/cairo_data_source {
  CairoDataIndex CairoData length lt
    { CairoData CairoDataIndex get /CairoDataIndex CairoDataIndex 1 add def }
    { () } ifelse
} def
/cairo_flush_ascii85_file { cairo_ascii85_file status { cairo_ascii85_file flushfile } if } def
/cairo_image { image cairo_flush_ascii85_file } def
/cairo_imagemask { imagemask cairo_flush_ascii85_file } def
%%EndProlog
%%BeginSetup
%%EndSetup
%%Page: 1 1
%%BeginPageSetup
%%PageBoundingBox: 0 0 256 196
%%EndPageSetup
q 0 0 256 196 rectclip
1 0 0 -1 0 196 cm q
1 g
0.375 0.375 255 195 re f
153.816 94.785 m 152.574 92.637 154.477 89.207 158.062 87.137 c 159.785
 86.145 161.676 85.598 163.316 85.629 c 164.957 85.652 166.211 86.254 166.809
 87.285 c 182.934 115.215 l 184.176 117.363 182.273 120.793 178.688 122.863
 c 175.102 124.934 171.184 124.863 169.941 122.715 c h
153.816 94.785 m f
0.137255 0.266667 0.364706 rg
0.649519 w
0 J
0 j
[ 1.948557 1.948557] 0 d
10 M q 1 -0.57735 0.57735 1 0 0 cm
74.319 137.693 m 74.318 135.544 77.23 133.796 80.816 133.796 c 82.537 133.797
 84.192 134.206 85.409 134.94 c 86.629 135.668 87.309 136.662 87.311 137.694
 c 87.311 165.624 l 87.312 167.773 84.4 169.521 80.814 169.521 c 77.228 
169.521 74.32 167.772 74.319 165.623 c h
74.319 137.693 m S Q
[ 1.948557 1.948557] 0 d
q 1 -0.57735 0.57735 1 0 0 cm
87.311 137.694 m 87.312 139.843 84.4 141.592 80.814 141.592 c 77.228 141.592
 74.32 139.843 74.319 137.693 c S Q
1 g
218.625 153.75 m 218.625 177 l 196.125 189.75 l 173.625 177 l 173.625 153.75
 l 196.125 141 l h
218.625 153.75 m f
0 0.313726 0.45098 rg
3 w
[] 0.0 d
q 0 1 -1 0 0 0 cm
153.75 -218.625 m 177 -218.625 l 189.75 -196.125 l 177 -173.625 l 153.75
 -173.625 l 141 -196.125 l h
153.75 -218.625 m S Q
1 g
83.25 153.75 m 83.25 177 l 60.75 189.75 l 38.25 177 l 38.25 153.75 l 60.75
 141 l h
83.25 153.75 m f
0 0.313726 0.45098 rg
q 0 1 -1 0 0 0 cm
153.75 -83.25 m 177 -83.25 l 189.75 -60.75 l 177 -38.25 l 153.75 -38.25
 l 141 -60.75 l h
153.75 -83.25 m S Q
1 g
102.375 172.875 m 99.891 172.875 97.875 169.516 97.875 165.375 c 97.875
 163.387 98.348 161.477 99.195 160.074 c 100.035 158.664 101.184 157.875
 102.375 157.875 c 153.375 157.875 l 155.859 157.875 157.875 161.234 157.875
 165.375 c 157.875 169.516 155.859 172.875 153.375 172.875 c h
102.375 172.875 m f
0.137255 0.266667 0.364706 rg
0.75 w
q 0 -1 1 0 0 0 cm
-172.875 102.375 m -172.875 99.891 -169.516 97.875 -165.375 97.875 c -163.387
 97.875 -161.477 98.348 -160.074 99.195 c -158.664 100.035 -157.875 101.184
 -157.875 102.375 c -157.875 153.375 l -157.875 155.859 -161.234 157.875
 -165.375 157.875 c -169.516 157.875 -172.875 155.859 -172.875 153.375 c
 h
-172.875 102.375 m S Q
q 0 -1 1 0 0 0 cm
-157.875 102.375 m -157.875 104.859 -161.234 106.875 -165.375 106.875 c
 -169.516 106.875 -172.875 104.859 -172.875 102.375 c S Q
1 g
85.059 122.961 m 83.816 125.113 79.898 125.18 76.312 123.109 c 74.59 122.117
 73.172 120.75 72.379 119.316 c 71.578 117.883 71.473 116.496 72.066 115.461
 c 88.191 87.531 l 89.434 85.383 93.352 85.316 96.938 87.387 c 100.523 89.457
 102.426 92.883 101.184 95.031 c h
85.059 122.961 m f
0.137255 0.266667 0.364706 rg
0.649519 w
[ 1.948557 1.948557] 0 d
q -1 -0.57735 0.57735 -1 0 0 cm
-117.038 -55.389 m -117.038 -57.541 -114.128 -59.288 -110.542 -59.288 c
 -108.821 -59.29 -107.165 -58.878 -105.95 -58.146 c -104.728 -57.418 -104.049
 -56.424 -104.046 -55.39 c -104.046 -27.46 l -104.047 -25.311 -106.957 -23.565
 -110.543 -23.565 c -114.129 -23.565 -117.039 -25.31 -117.037 -27.46 c h
-117.038 -55.389 m S Q
[ 1.948557 1.948557] 0 d
q -1 -0.57735 0.57735 -1 0 0 cm
-104.046 -55.39 m -104.047 -53.241 -106.957 -51.494 -110.543 -51.494 c 
-114.129 -51.494 -117.039 -53.24 -117.038 -55.389 c S Q
0.75 w
[] 0.0 d
q 1 0 0 1 0 0 cm
75.375 127.875 m 103.004 79.523 l S Q
104.961 76.102 m 104.633 81.961 l 103.004 79.523 l 100.074 79.359 l h
104.961 76.102 m f
q 1 0 0 1 0 0 cm
104.961 76.102 m 104.633 81.961 l 103.004 79.523 l 100.074 79.359 l h
104.961 76.102 m S Q
q 1 0 0 1 0 0 cm
97.875 82.875 m 70.246 131.227 l S Q
68.289 134.648 m 68.617 128.789 l 70.246 131.227 l 73.176 131.391 l h
68.289 134.648 m f
q 1 0 0 1 0 0 cm
68.289 134.648 m 68.617 128.789 l 70.246 131.227 l 73.176 131.391 l h
68.289 134.648 m S Q
q 1 0 0 1 0 0 cm
157.875 82.875 m 185.504 131.227 l S Q
187.461 134.648 m 182.574 131.391 l 185.504 131.227 l 187.133 128.789 l
 h
187.461 134.648 m f
q 1 0 0 1 0 0 cm
187.461 134.648 m 182.574 131.391 l 185.504 131.227 l 187.133 128.789 l
 h
187.461 134.648 m S Q
q 1 0 0 1 0 0 cm
180.375 127.875 m 152.746 79.523 l S Q
150.789 76.102 m 155.676 79.359 l 152.746 79.523 l 151.117 81.961 l h
150.789 76.102 m f
q 1 0 0 1 0 0 cm
150.789 76.102 m 155.676 79.359 l 152.746 79.523 l 151.117 81.961 l h
150.789 76.102 m S Q
q 1 0 0 1 0 0 cm
90.375 166.875 m 160.598 166.875 l S Q
164.535 166.875 m 159.285 169.5 l 160.598 166.875 l 159.285 164.25 l h
164.535 166.875 m f
q 1 0 0 1 0 0 cm
164.535 166.875 m 159.285 169.5 l 160.598 166.875 l 159.285 164.25 l h
164.535 166.875 m S Q
q 1 0 0 1 0 0 cm
165.375 163.875 m 95.152 163.875 l S Q
91.215 163.875 m 96.465 161.25 l 95.152 163.875 l 96.465 166.5 l h
91.215 163.875 m f
q 1 0 0 1 0 0 cm
91.215 163.875 m 96.465 161.25 l 95.152 163.875 l 96.465 166.5 l h
91.215 163.875 m S Q
q 1 0 0 1 0 0 cm
119.852 30.375 m 114.852 20.375 117.352 15.375 127.352 15.375 c 137.352
 15.375 140.566 18.949 136.992 26.102 c S Q
135.75 29.625 m 135.75 23.754 l 137.512 26.102 l 140.445 26.102 l h
135.75 29.625 m f
q 1 0 0 1 0 0 cm
135.75 29.625 m 135.75 23.754 l 137.512 26.102 l 140.445 26.102 l h
135.75 29.625 m S Q
1 g
150.375 43.125 m 150.375 66.375 l 127.875 79.125 l 105.375 66.375 l 105.375
 43.125 l 127.875 30.375 l h
150.375 43.125 m f
0 0.313726 0.45098 rg
3 w
q 0 1 -1 0 0 0 cm
43.125 -150.375 m 66.375 -150.375 l 79.125 -127.875 l 66.375 -105.375 l
 43.125 -105.375 l 30.375 -127.875 l h
43.125 -150.375 m S Q
116.152 43.531 m 115.898 43.531 115.688 43.738 115.688 43.996 c 115.688
 65.504 l 115.688 65.762 115.898 65.969 116.152 65.969 c 132.227 65.969 
l 132.227 65.031 l 116.625 65.031 l 116.625 47.391 l 139.125 47.398 l 139.125
 65.031 l 137.176 65.031 l 137.176 65.969 l 139.598 65.969 l 139.852 65.969
 140.062 65.762 140.062 65.504 c 140.062 43.996 l 140.062 43.738 139.852
 43.531 139.598 43.531 c h
116.625 44.469 m 139.125 44.469 l 139.125 46.469 l 116.625 46.453 l h
127.891 48.938 m 125.211 48.938 123.039 51.113 123.039 53.781 c 123.039
 56.461 125.211 58.637 127.891 58.637 c 130.566 58.637 132.742 56.461 132.742
 53.781 c 132.742 51.113 130.566 48.938 127.891 48.938 c h
127.891 49.867 m 130.059 49.867 131.805 51.613 131.805 53.781 c 131.805
 55.957 130.059 57.703 127.891 57.703 c 125.723 57.703 123.977 55.957 123.977
 53.781 c 123.977 51.613 125.723 49.867 127.891 49.867 c h
129.953 51.988 m 127.066 55.027 l 125.812 53.691 l 125.129 54.328 l 126.719
 56.031 l 126.906 56.227 127.215 56.227 127.402 56.031 c 130.629 52.637 
l h
129.863 59.168 m 129.863 62.527 l 128.184 61.133 l 128.012 60.988 127.762
 60.988 127.59 61.133 c 125.887 62.551 l 125.887 59.184 l 124.949 59.184
 l 124.949 63.547 l 124.949 63.945 125.406 64.164 125.715 63.906 c 127.883
 62.102 l 130.035 63.887 l 130.336 64.141 130.801 63.922 130.801 63.523 
c 130.801 59.168 l h
129.863 59.168 m f
1 g
196.125 34.125 m 193.641 34.125 191.625 30.766 191.625 26.625 c 191.625
 24.637 192.098 22.727 192.945 21.324 c 193.785 19.914 194.934 19.125 196.125
 19.125 c 209.625 19.125 l 212.109 19.125 214.125 22.484 214.125 26.625 
c 214.125 30.766 212.109 34.125 209.625 34.125 c h
196.125 34.125 m f
0.137255 0.266667 0.364706 rg
0.75 w
[ 2.25 2.25] 0 d
q 1 0 0 1 0 0 cm
196.125 34.125 m 193.641 34.125 191.625 30.766 191.625 26.625 c 191.625
 24.637 192.098 22.727 192.945 21.324 c 193.785 19.914 194.934 19.125 196.125
 19.125 c 209.625 19.125 l 212.109 19.125 214.125 22.484 214.125 26.625 
c 214.125 30.766 212.109 34.125 209.625 34.125 c h
196.125 34.125 m S Q
[ 2.25 2.25] 0 d
q 0 -1 1 0 0 0 cm
-19.125 196.125 m -19.125 198.609 -22.484 200.625 -26.625 200.625 c -30.766
 200.625 -34.125 198.609 -34.125 196.125 c S Q
1 g
196.125 56.625 m 193.641 56.625 191.625 53.266 191.625 49.125 c 191.625
 47.137 192.098 45.227 192.945 43.824 c 193.785 42.414 194.934 41.625 196.125
 41.625 c 209.625 41.625 l 212.109 41.625 214.125 44.984 214.125 49.125 
c 214.125 53.266 212.109 56.625 209.625 56.625 c h
196.125 56.625 m f
0.137255 0.266667 0.364706 rg
[] 0.0 d
q 0 -1 1 0 0 0 cm
-56.625 196.125 m -56.625 193.641 -53.266 191.625 -49.125 191.625 c -47.137
 191.625 -45.227 192.098 -43.824 192.945 c -42.414 193.785 -41.625 194.934
 -41.625 196.125 c -41.625 209.625 l -41.625 212.109 -44.984 214.125 -49.125
 214.125 c -53.266 214.125 -56.625 212.109 -56.625 209.625 c h
-56.625 196.125 m S Q
q 0 -1 1 0 0 0 cm
-41.625 196.125 m -41.625 198.609 -44.984 200.625 -49.125 200.625 c -53.266
 200.625 -56.625 198.609 -56.625 196.125 c S Q
Q Q
showpage
%%Trailer
end
%%EOF
