%!PS-Adobe-3.0 EPSF-3.0
%%Creator: cairo 1.16.0 (https://cairographics.org)
%%CreationDate: Tue Jun 22 11:32:46 2021
%%Pages: 1
%%DocumentData: Clean7Bit
%%LanguageLevel: 2
%%BoundingBox: 0 0 198 198
%%EndComments
%%BeginProlog
50 dict begin
/q { gsave } bind def
/Q { grestore } bind def
/cm { 6 array astore concat } bind def
/w { setlinewidth } bind def
/J { setlinecap } bind def
/j { setlinejoin } bind def
/M { setmiterlimit } bind def
/d { setdash } bind def
/m { moveto } bind def
/l { lineto } bind def
/c { curveto } bind def
/h { closepath } bind def
/re { exch dup neg 3 1 roll 5 3 roll moveto 0 rlineto
      0 exch rlineto 0 rlineto closepath } bind def
/S { stroke } bind def
/f { fill } bind def
/f* { eofill } bind def
/n { newpath } bind def
/W { clip } bind def
/W* { eoclip } bind def
/BT { } bind def
/ET { } bind def
/BDC { mark 3 1 roll /BDC pdfmark } bind def
/EMC { mark /EMC pdfmark } bind def
/cairo_store_point { /cairo_point_y exch def /cairo_point_x exch def } def
/Tj { show currentpoint cairo_store_point } bind def
/TJ {
  {
    dup
    type /stringtype eq
    { show } { -0.001 mul 0 cairo_font_matrix dtransform rmoveto } ifelse
  } forall
  currentpoint cairo_store_point
} bind def
/cairo_selectfont { cairo_font_matrix aload pop pop pop 0 0 6 array astore
    cairo_font exch selectfont cairo_point_x cairo_point_y moveto } bind def
/Tf { pop /cairo_font exch def /cairo_font_matrix where
      { pop cairo_selectfont } if } bind def
/Td { matrix translate cairo_font_matrix matrix concatmatrix dup
      /cairo_font_matrix exch def dup 4 get exch 5 get cairo_store_point
      /cairo_font where { pop cairo_selectfont } if } bind def
/Tm { 2 copy 8 2 roll 6 array astore /cairo_font_matrix exch def
      cairo_store_point /cairo_font where { pop cairo_selectfont } if } bind def
/g { setgray } bind def
/rg { setrgbcolor } bind def
/d1 { setcachedevice } bind def
/cairo_data_source {
  CairoDataIndex CairoData length lt
    { CairoData CairoDataIndex get /CairoDataIndex CairoDataIndex 1 add def }
    { () } ifelse
} def
/cairo_flush_ascii85_file { cairo_ascii85_file status { cairo_ascii85_file flushfile } if } def
/cairo_image { image cairo_flush_ascii85_file } def
/cairo_imagemask { imagemask cairo_flush_ascii85_file } def
%%EndProlog
%%BeginSetup
%%EndSetup
%%Page: 1 1
%%BeginPageSetup
%%PageBoundingBox: 0 0 198 198
%%EndPageSetup
q 0 0 198 198 rectclip
1 0 0 -1 0 198 cm q
1 g
196.5 99 m 196.5 152.848 152.848 196.5 99 196.5 c 45.152 196.5 1.5 152.848
 1.5 99 c 1.5 45.152 45.152 1.5 99 1.5 c 152.848 1.5 196.5 45.152 196.5 
99 c h
196.5 99 m f
0 0.313726 0.45098 rg
3 w
0 J
0 j
[] 0.0 d
4 M q 1 0 0 1 0 0 cm
196.5 99 m 196.5 152.848 152.848 196.5 99 196.5 c 45.152 196.5 1.5 152.848
 1.5 99 c 1.5 45.152 45.152 1.5 99 1.5 c 152.848 1.5 196.5 45.152 196.5 
99 c h
196.5 99 m S Q
1 g
90 36.75 m 90 60 l 67.5 72.75 l 45 60 l 45 36.75 l 67.5 24 l h
90 36.75 m f
0 0.313726 0.45098 rg
10 M q 0 1 -1 0 0 0 cm
36.75 -90 m 60 -90 l 72.75 -67.5 l 60 -45 l 36.75 -45 l 24 -67.5 l h
36.75 -90 m S Q
58.664 38.934 m 76.344 38.934 l 76.688 38.934 76.949 39.195 76.949 39.539
 c 76.949 57.246 l 76.949 57.594 76.688 57.855 76.344 57.855 c 58.664 57.855
 l 58.32 57.855 58.059 57.594 58.059 57.246 c 58.059 39.539 l 58.059 39.195
 58.32 38.934 58.664 38.934 c h
60.711 35.25 m 60.711 37.926 l 58.664 37.926 l 57.781 37.926 57.051 38.656
 57.051 39.539 c 57.051 41.578 l 54.406 41.578 l 54.406 42.586 l 57.051 
42.586 l 57.051 44.73 l 54.406 44.73 l 54.406 45.742 l 57.051 45.742 l 57.051
 47.871 l 54.406 47.871 l 54.406 48.887 l 57.051 48.887 l 57.051 51.031 
l 54.406 51.031 l 54.406 52.035 l 57.051 52.035 l 57.051 54.156 l 54.406
 54.156 l 54.406 55.172 l 57.051 55.172 l 57.051 57.246 l 57.051 58.133 
57.781 58.859 58.664 58.859 c 60.711 58.859 l 60.711 61.5 l 61.719 61.5 
l 61.719 58.859 l 63.863 58.859 l 63.863 61.5 l 64.875 61.5 l 64.875 58.859
 l 67.02 58.859 l 67.02 61.5 l 68.023 61.5 l 68.023 58.859 l 70.176 58.859
 l 70.176 61.5 l 71.184 61.5 l 71.184 58.859 l 73.297 58.859 l 73.297 61.5
 l 74.309 61.5 l 74.309 58.859 l 76.344 58.859 l 77.227 58.859 77.953 58.133
 77.953 57.246 c 77.953 55.172 l 80.594 55.172 l 80.594 54.156 l 77.953 
54.156 l 77.953 52.035 l 80.594 52.035 l 80.594 51.031 l 77.953 51.031 l
 77.953 48.887 l 80.594 48.887 l 80.594 47.871 l 77.953 47.871 l 77.953 
45.742 l 80.594 45.742 l 80.594 44.73 l 77.953 44.73 l 77.953 42.586 l 80.594
 42.586 l 80.594 41.578 l 77.953 41.578 l 77.953 39.539 l 77.953 38.656 
77.227 37.926 76.344 37.926 c 74.309 37.926 l 74.309 35.25 l 73.297 35.25
 l 73.297 37.926 l 71.184 37.926 l 71.184 35.25 l 70.176 35.25 l 70.176 
37.926 l 68.023 37.926 l 68.023 35.25 l 67.02 35.25 l 67.02 37.926 l 64.875
 37.926 l 64.875 35.25 l 63.863 35.25 l 63.863 37.926 l 61.719 37.926 l 
61.719 35.25 l h
74.176 48.066 m 74.266 48.066 74.348 48.105 74.414 48.141 c 74.422 48.18
 74.453 48.246 74.445 48.344 c 74.438 48.473 74.379 48.57 74.387 48.562 
c 74.379 48.57 74.371 48.578 74.363 48.586 c 73.281 49.656 l 73.125 49.012
 l 73.996 48.113 l 73.996 48.113 74.07 48.059 74.176 48.059 c h
67.508 41.355 m 67.551 41.355 67.641 41.398 67.746 41.469 c 67.836 41.586
 67.824 41.766 67.734 41.871 c 66.891 42.758 l 66.203 42.594 l 67.32 41.453
 l 67.41 41.363 67.449 41.355 67.508 41.355 c h
74.242 41.25 m 74.387 41.258 74.445 41.297 74.477 41.309 c 74.617 41.543
 74.625 41.902 74.488 42.328 c 74.348 42.781 74.047 43.238 73.875 43.41 
c 73.867 43.41 73.875 43.41 73.875 43.41 c 71.543 45.594 l 71.414 45.719
 71.363 45.898 71.398 46.078 c 73.156 53.535 l 72.324 54.383 l 69.602 48.301
 l 69.531 48.156 69.406 48.047 69.238 48.016 c 69.082 47.984 68.918 48.031
 68.797 48.141 c 65.852 50.879 l 65.746 50.977 65.684 51.105 65.684 51.246
 c 65.664 54.727 l 65.371 55.035 l 64.41 51.75 l 64.363 51.586 64.238 51.457
 64.066 51.414 c 60.832 50.477 l 61.125 50.168 l 64.598 50.176 l 64.738 
50.176 64.875 50.113 64.973 50.012 c 67.656 47.078 l 67.762 46.957 67.809
 46.793 67.777 46.637 c 67.746 46.477 67.641 46.344 67.492 46.273 c 61.461
 43.531 l 62.266 42.703 l 69.781 44.469 l 69.961 44.504 70.141 44.453 70.266
 44.316 c 72.539 41.863 l 72.539 41.859 72.547 41.859 72.547 41.852 c 72.637
 41.746 73.133 41.453 73.605 41.324 c 73.844 41.266 74.078 41.242 74.242
 41.25 c h
74.301 40.246 m 73.988 40.223 73.664 40.273 73.359 40.352 c 72.727 40.516
 72.156 40.762 71.789 41.191 c 69.727 43.418 l 68.031 43.02 l 68.484 42.539
 l 68.488 42.531 68.496 42.523 68.504 42.516 c 68.918 42.031 68.961 41.25
 68.461 40.734 c 68.445 40.719 68.422 40.703 68.406 40.688 c 68.152 40.492
 67.852 40.359 67.523 40.352 c 67.191 40.344 66.863 40.484 66.613 40.734
 c 66.609 40.734 66.609 40.734 66.609 40.738 c 65.055 42.324 l 62.211 41.656
 l 62.039 41.617 61.859 41.672 61.734 41.797 c 60.246 43.344 l 60.137 43.461
 60.082 43.629 60.113 43.785 c 60.141 43.949 60.246 44.086 60.398 44.152
 c 66.441 46.906 l 64.379 49.164 l 60.898 49.156 l 60.766 49.156 60.629 
49.215 60.531 49.32 c 59.527 50.391 l 59.414 50.52 59.371 50.699 59.414 
50.871 c 59.461 51.039 59.594 51.172 59.762 51.219 c 63.523 52.305 l 64.637
 56.145 l 64.688 56.316 64.828 56.453 65.004 56.496 c 65.176 56.543 65.363
 56.488 65.484 56.355 c 66.523 55.289 l 66.613 55.199 66.668 55.074 66.668
 54.945 c 66.691 51.473 l 68.969 49.359 l 71.707 55.469 l 71.773 55.621 
71.918 55.727 72.074 55.754 c 72.238 55.785 72.414 55.734 72.523 55.613 
c 74.07 54.047 l 74.191 53.918 74.242 53.746 74.203 53.574 c 73.551 50.805
 l 75.074 49.297 l 75.051 49.32 l 75.344 49.066 75.434 48.719 75.449 48.406
 c 75.473 48.09 75.422 47.773 75.211 47.488 c 75.188 47.461 75.164 47.438
 75.141 47.414 c 74.863 47.16 74.512 47.055 74.184 47.055 c 73.852 47.055
 73.516 47.152 73.262 47.414 c 72.855 47.844 l 72.449 46.133 l 74.574 44.129
 l 74.574 44.129 74.578 44.129 74.578 44.121 c 74.926 43.785 75.246 43.254
 75.449 42.637 c 75.652 42.023 75.719 41.266 75.262 40.656 c 75.246 40.637
 75.234 40.621 75.219 40.598 c 74.953 40.344 74.617 40.262 74.301 40.246
 c h
74.301 40.246 m f
1 g
151.5 61.5 m 151.5 84.75 l 129 97.5 l 106.5 84.75 l 106.5 61.5 l 129 48.75
 l h
151.5 61.5 m f
0 0.313726 0.45098 rg
q 0 1 -1 0 0 0 cm
61.5 -151.5 m 84.75 -151.5 l 97.5 -129 l 84.75 -106.5 l 61.5 -106.5 l 48.75
 -129 l h
61.5 -151.5 m S Q
121.934 64.387 m 121.656 65.355 l 123.328 65.844 l 123.613 67.012 l 123.488
 67.141 123.449 67.328 123.504 67.5 c 125.504 73.852 l 125.574 74.062 125.766
 74.203 125.984 74.203 c 126.871 74.203 l 126.512 74.934 l 126.488 74.934
 126.465 74.934 126.441 74.934 c 125.484 74.934 124.688 75.719 124.688 76.68
 c 124.688 77.641 125.484 78.434 126.441 78.434 c 127.23 78.434 127.906 
77.902 128.113 77.176 c 131.672 77.176 l 131.879 77.902 132.555 78.434 133.352
 78.434 c 134.309 78.434 135.098 77.648 135.098 76.688 c 135.098 75.727 
134.309 74.934 133.352 74.934 c 132.562 74.934 131.895 75.457 131.676 76.172
 c 128.113 76.172 l 128.004 75.801 127.77 75.488 127.469 75.27 c 127.996
 74.203 l 133.629 74.203 l 133.844 74.203 134.039 74.062 134.109 73.852 
c 136.141 67.5 l 136.191 67.352 136.164 67.184 136.074 67.051 c 135.977 
66.922 135.824 66.848 135.66 66.848 c 124.613 66.848 l 124.238 65.316 l 
124.191 65.145 124.066 65.012 123.891 64.957 c h
124.672 67.852 m 134.969 67.852 l 133.262 73.199 l 126.359 73.199 l h
126.441 75.938 m 126.855 75.938 127.184 76.266 127.184 76.68 c 127.184 
77.102 126.855 77.422 126.441 77.422 c 126.023 77.422 125.699 77.102 125.699
 76.68 c 125.699 76.266 126.023 75.938 126.441 75.938 c h
133.352 75.945 m 133.762 75.945 134.094 76.273 134.094 76.688 c 134.094
 77.109 133.762 77.43 133.352 77.43 c 132.93 77.43 132.609 77.109 132.609
 76.688 c 132.609 76.273 132.93 75.945 133.352 75.945 c h
122.211 58.125 m 122.211 60.801 l 120.164 60.801 l 119.281 60.801 118.551
 61.531 118.551 62.414 c 118.551 64.453 l 115.906 64.453 l 115.906 65.461
 l 118.551 65.461 l 118.551 67.605 l 115.906 67.605 l 115.906 68.617 l 118.551
 68.617 l 118.551 70.746 l 115.906 70.746 l 115.906 71.762 l 118.551 71.762
 l 118.551 73.906 l 115.906 73.906 l 115.906 74.91 l 118.551 74.91 l 118.551
 77.031 l 115.906 77.031 l 115.906 78.047 l 118.551 78.047 l 118.551 80.121
 l 118.551 81.008 119.281 81.734 120.164 81.734 c 122.211 81.734 l 122.211
 84.375 l 123.219 84.375 l 123.219 81.734 l 125.363 81.734 l 125.363 84.375
 l 126.375 84.375 l 126.375 81.734 l 128.52 81.734 l 128.52 84.375 l 129.523
 84.375 l 129.523 81.734 l 131.676 81.734 l 131.676 84.375 l 132.684 84.375
 l 132.684 81.734 l 134.797 81.734 l 134.797 84.375 l 135.809 84.375 l 135.809
 81.734 l 137.844 81.734 l 138.727 81.734 139.453 81.008 139.453 80.121 
c 139.453 78.047 l 142.094 78.047 l 142.094 77.031 l 139.453 77.031 l 139.453
 74.91 l 142.094 74.91 l 142.094 73.906 l 139.453 73.906 l 139.453 71.762
 l 142.094 71.762 l 142.094 70.746 l 139.453 70.746 l 139.453 68.617 l 142.094
 68.617 l 142.094 67.605 l 139.453 67.605 l 139.453 65.461 l 142.094 65.461
 l 142.094 64.453 l 139.453 64.453 l 139.453 62.414 l 139.453 61.531 138.727
 60.801 137.844 60.801 c 135.809 60.801 l 135.809 58.125 l 134.797 58.125
 l 134.797 60.801 l 132.684 60.801 l 132.684 58.125 l 131.676 58.125 l 131.676
 60.801 l 129.523 60.801 l 129.523 58.125 l 128.52 58.125 l 128.52 60.801
 l 126.375 60.801 l 126.375 58.125 l 125.363 58.125 l 125.363 60.801 l 123.219
 60.801 l 123.219 58.125 l h
120.164 61.809 m 137.844 61.809 l 138.188 61.809 138.449 62.07 138.449 
62.414 c 138.449 80.121 l 138.449 80.469 138.188 80.73 137.844 80.73 c 120.164
 80.73 l 119.82 80.73 119.559 80.469 119.559 80.121 c 119.559 62.414 l 119.559
 62.07 119.82 61.809 120.164 61.809 c h
120.164 61.809 m f
1 g
120.562 62.25 16.875 16.5 re f
0 0.313726 0.45098 rg
132.953 67.379 m 132.953 68.672 132.195 69.719 131.273 69.719 c 130.344
 69.719 129.586 68.672 129.586 67.379 c 129.586 66.09 130.344 65.039 131.273
 65.039 c 132.195 65.039 132.953 66.09 132.953 67.379 c h
128.406 67.379 m 128.406 68.672 127.656 69.719 126.727 69.719 c 125.805
 69.719 125.047 68.672 125.047 67.379 c 125.047 66.09 125.805 65.039 126.727
 65.039 c 127.656 65.039 128.406 66.09 128.406 67.379 c h
131.859 75.961 m 131.859 73.777 l 131.859 72.766 131.242 71.766 130.727
 71.332 c 132.254 71.266 134.836 72.023 135.188 73.859 c 135.188 75.961 
l h
122.812 75.961 m 122.812 73.852 l 123.234 71.672 126.234 71.332 126.758
 71.332 c 127.449 71.332 130.273 71.852 130.656 73.816 c 130.656 75.961 
l h
122.812 75.961 m f
1 g
90 104.25 m 90 127.5 l 67.5 140.25 l 45 127.5 l 45 104.25 l 67.5 91.5 l
 h
90 104.25 m f
0 0.313726 0.45098 rg
q 0 1 -1 0 0 0 cm
104.25 -90 m 127.5 -90 l 140.25 -67.5 l 127.5 -45 l 104.25 -45 l 91.5 -67.5
 l h
104.25 -90 m S Q
60.434 109.012 m 60.156 109.98 l 61.828 110.469 l 62.113 111.637 l 61.988
 111.766 61.949 111.953 62.004 112.125 c 64.004 118.477 l 64.074 118.688
 64.266 118.828 64.484 118.828 c 65.371 118.828 l 65.012 119.559 l 64.988
 119.559 64.965 119.559 64.941 119.559 c 63.984 119.559 63.188 120.344 63.188
 121.305 c 63.188 122.266 63.984 123.059 64.941 123.059 c 65.73 123.059 
66.406 122.527 66.613 121.801 c 70.172 121.801 l 70.379 122.527 71.055 123.059
 71.852 123.059 c 72.809 123.059 73.598 122.273 73.598 121.312 c 73.598 
120.352 72.809 119.559 71.852 119.559 c 71.062 119.559 70.395 120.082 70.176
 120.797 c 66.613 120.797 l 66.504 120.426 66.27 120.113 65.969 119.895 
c 66.496 118.828 l 72.129 118.828 l 72.344 118.828 72.539 118.688 72.609
 118.477 c 74.641 112.125 l 74.691 111.977 74.664 111.809 74.574 111.676
 c 74.477 111.547 74.324 111.473 74.16 111.473 c 63.113 111.473 l 62.738
 109.941 l 62.691 109.77 62.566 109.637 62.391 109.582 c h
63.172 112.477 m 73.469 112.477 l 71.762 117.824 l 64.859 117.824 l h
64.941 120.562 m 65.355 120.562 65.684 120.891 65.684 121.305 c 65.684 
121.727 65.355 122.047 64.941 122.047 c 64.523 122.047 64.199 121.727 64.199
 121.305 c 64.199 120.891 64.523 120.562 64.941 120.562 c h
71.852 120.57 m 72.262 120.57 72.594 120.898 72.594 121.312 c 72.594 121.734
 72.262 122.055 71.852 122.055 c 71.43 122.055 71.109 121.734 71.109 121.312
 c 71.109 120.898 71.43 120.57 71.852 120.57 c h
60.711 102.75 m 60.711 105.426 l 58.664 105.426 l 57.781 105.426 57.051
 106.156 57.051 107.039 c 57.051 109.078 l 54.406 109.078 l 54.406 110.086
 l 57.051 110.086 l 57.051 112.23 l 54.406 112.23 l 54.406 113.242 l 57.051
 113.242 l 57.051 115.371 l 54.406 115.371 l 54.406 116.387 l 57.051 116.387
 l 57.051 118.531 l 54.406 118.531 l 54.406 119.535 l 57.051 119.535 l 57.051
 121.656 l 54.406 121.656 l 54.406 122.672 l 57.051 122.672 l 57.051 124.746
 l 57.051 125.633 57.781 126.359 58.664 126.359 c 60.711 126.359 l 60.711
 129 l 61.719 129 l 61.719 126.359 l 63.863 126.359 l 63.863 129 l 64.875
 129 l 64.875 126.359 l 67.02 126.359 l 67.02 129 l 68.023 129 l 68.023 
126.359 l 70.176 126.359 l 70.176 129 l 71.184 129 l 71.184 126.359 l 73.297
 126.359 l 73.297 129 l 74.309 129 l 74.309 126.359 l 76.344 126.359 l 77.227
 126.359 77.953 125.633 77.953 124.746 c 77.953 122.672 l 80.594 122.672
 l 80.594 121.656 l 77.953 121.656 l 77.953 119.535 l 80.594 119.535 l 80.594
 118.531 l 77.953 118.531 l 77.953 116.387 l 80.594 116.387 l 80.594 115.371
 l 77.953 115.371 l 77.953 113.242 l 80.594 113.242 l 80.594 112.23 l 77.953
 112.23 l 77.953 110.086 l 80.594 110.086 l 80.594 109.078 l 77.953 109.078
 l 77.953 107.039 l 77.953 106.156 77.227 105.426 76.344 105.426 c 74.309
 105.426 l 74.309 102.75 l 73.297 102.75 l 73.297 105.426 l 71.184 105.426
 l 71.184 102.75 l 70.176 102.75 l 70.176 105.426 l 68.023 105.426 l 68.023
 102.75 l 67.02 102.75 l 67.02 105.426 l 64.875 105.426 l 64.875 102.75 
l 63.863 102.75 l 63.863 105.426 l 61.719 105.426 l 61.719 102.75 l h
58.664 106.434 m 76.344 106.434 l 76.688 106.434 76.949 106.695 76.949 
107.039 c 76.949 124.746 l 76.949 125.094 76.688 125.355 76.344 125.355 
c 58.664 125.355 l 58.32 125.355 58.059 125.094 58.059 124.746 c 58.059 
107.039 l 58.059 106.695 58.32 106.434 58.664 106.434 c h
58.664 106.434 m f
1 g
151.5 134.25 m 151.5 157.5 l 129 170.25 l 106.5 157.5 l 106.5 134.25 l 
129 121.5 l h
151.5 134.25 m f
0 0.313726 0.45098 rg
q 0 1 -1 0 0 0 cm
134.25 -151.5 m 157.5 -151.5 l 170.25 -129 l 157.5 -106.5 l 134.25 -106.5
 l 121.5 -129 l h
134.25 -151.5 m S Q
121.934 139.012 m 121.656 139.98 l 123.328 140.469 l 123.613 141.637 l 
123.488 141.766 123.449 141.953 123.504 142.125 c 125.504 148.477 l 125.574
 148.688 125.766 148.828 125.984 148.828 c 126.871 148.828 l 126.512 149.559
 l 126.488 149.559 126.465 149.559 126.441 149.559 c 125.484 149.559 124.688
 150.344 124.688 151.305 c 124.688 152.266 125.484 153.059 126.441 153.059
 c 127.23 153.059 127.906 152.527 128.113 151.801 c 131.672 151.801 l 131.879
 152.527 132.555 153.059 133.352 153.059 c 134.309 153.059 135.098 152.273
 135.098 151.312 c 135.098 150.352 134.309 149.559 133.352 149.559 c 132.562
 149.559 131.895 150.082 131.676 150.797 c 128.113 150.797 l 128.004 150.426
 127.77 150.113 127.469 149.895 c 127.996 148.828 l 133.629 148.828 l 133.844
 148.828 134.039 148.688 134.109 148.477 c 136.141 142.125 l 136.191 141.977
 136.164 141.809 136.074 141.676 c 135.977 141.547 135.824 141.473 135.66
 141.473 c 124.613 141.473 l 124.238 139.941 l 124.191 139.77 124.066 139.637
 123.891 139.582 c h
124.672 142.477 m 134.969 142.477 l 133.262 147.824 l 126.359 147.824 l
 h
126.441 150.562 m 126.855 150.562 127.184 150.891 127.184 151.305 c 127.184
 151.727 126.855 152.047 126.441 152.047 c 126.023 152.047 125.699 151.727
 125.699 151.305 c 125.699 150.891 126.023 150.562 126.441 150.562 c h
133.352 150.57 m 133.762 150.57 134.094 150.898 134.094 151.312 c 134.094
 151.734 133.762 152.055 133.352 152.055 c 132.93 152.055 132.609 151.734
 132.609 151.312 c 132.609 150.898 132.93 150.57 133.352 150.57 c h
122.211 132.75 m 122.211 135.426 l 120.164 135.426 l 119.281 135.426 118.551
 136.156 118.551 137.039 c 118.551 139.078 l 115.906 139.078 l 115.906 140.086
 l 118.551 140.086 l 118.551 142.23 l 115.906 142.23 l 115.906 143.242 l
 118.551 143.242 l 118.551 145.371 l 115.906 145.371 l 115.906 146.387 l
 118.551 146.387 l 118.551 148.531 l 115.906 148.531 l 115.906 149.535 l
 118.551 149.535 l 118.551 151.656 l 115.906 151.656 l 115.906 152.672 l
 118.551 152.672 l 118.551 154.746 l 118.551 155.633 119.281 156.359 120.164
 156.359 c 122.211 156.359 l 122.211 159 l 123.219 159 l 123.219 156.359
 l 125.363 156.359 l 125.363 159 l 126.375 159 l 126.375 156.359 l 128.52
 156.359 l 128.52 159 l 129.523 159 l 129.523 156.359 l 131.676 156.359 
l 131.676 159 l 132.684 159 l 132.684 156.359 l 134.797 156.359 l 134.797
 159 l 135.809 159 l 135.809 156.359 l 137.844 156.359 l 138.727 156.359
 139.453 155.633 139.453 154.746 c 139.453 152.672 l 142.094 152.672 l 142.094
 151.656 l 139.453 151.656 l 139.453 149.535 l 142.094 149.535 l 142.094
 148.531 l 139.453 148.531 l 139.453 146.387 l 142.094 146.387 l 142.094
 145.371 l 139.453 145.371 l 139.453 143.242 l 142.094 143.242 l 142.094
 142.23 l 139.453 142.23 l 139.453 140.086 l 142.094 140.086 l 142.094 139.078
 l 139.453 139.078 l 139.453 137.039 l 139.453 136.156 138.727 135.426 137.844
 135.426 c 135.809 135.426 l 135.809 132.75 l 134.797 132.75 l 134.797 135.426
 l 132.684 135.426 l 132.684 132.75 l 131.676 132.75 l 131.676 135.426 l
 129.523 135.426 l 129.523 132.75 l 128.52 132.75 l 128.52 135.426 l 126.375
 135.426 l 126.375 132.75 l 125.363 132.75 l 125.363 135.426 l 123.219 135.426
 l 123.219 132.75 l h
120.164 136.434 m 137.844 136.434 l 138.188 136.434 138.449 136.695 138.449
 137.039 c 138.449 154.746 l 138.449 155.094 138.188 155.355 137.844 155.355
 c 120.164 155.355 l 119.82 155.355 119.559 155.094 119.559 154.746 c 119.559
 137.039 l 119.559 136.695 119.82 136.434 120.164 136.434 c h
120.164 136.434 m f
1 g
119.625 138.375 18.75 15 re f
0 0.313726 0.45098 rg
123.098 140.25 m 134.902 140.25 l 135.789 140.25 136.5 140.918 136.5 141.75
 c 136.5 150 l 136.5 150.832 135.789 151.5 134.902 151.5 c 123.098 151.5
 l 122.211 151.5 121.5 150.832 121.5 150 c 121.5 141.75 l 121.5 140.918 
122.211 140.25 123.098 140.25 c h
123.098 140.25 m f
1 g
122.953 145.844 m 135.039 145.844 l 135.039 150.137 l 122.953 150.137 l
 h
122.953 141.621 m 135.039 141.621 l 135.039 143.078 l 122.953 143.078 l
 h
122.953 141.621 m f
141.355 5.02 m 143.625 5.02 145.457 6.914 145.457 9.266 c 145.457 11.621
 143.625 13.516 141.355 13.516 c 139.082 13.516 137.254 11.621 137.254 9.266
 c 137.254 6.914 139.082 5.02 141.355 5.02 c h
141.355 5.02 m f
148.559 8.949 m 153.254 8.949 157.031 11.074 157.031 13.711 c 157.031 19.754
 l 157.031 22.395 153.254 24.52 148.559 24.52 c 143.863 24.52 140.086 22.395
 140.086 19.754 c 140.086 13.711 l 140.086 11.074 143.863 8.949 148.559 
8.949 c h
148.559 8.949 m f
161.559 23.074 m 162.109 23.074 162.551 24.125 162.551 25.43 c 162.551 
26.734 162.109 27.785 161.559 27.785 c 161.008 27.785 160.562 26.734 160.562
 25.43 c 160.562 24.125 161.008 23.074 161.559 23.074 c h
161.559 23.074 m f
158.777 18.43 m 160.66 18.43 162.172 20.203 162.172 22.406 c 162.172 24.605
 160.66 26.379 158.777 26.379 c 156.895 26.379 155.379 24.605 155.379 22.406
 c 155.379 20.203 156.895 18.43 158.777 18.43 c h
158.777 18.43 m f
0 0.313726 0.45098 rg
147.254 1.5 m 136.516 5.941 l 136.516 18.203 l 136.516 18.316 136.613 29.625
 147.254 29.625 c 148.828 29.648 150.391 29.34 151.844 28.734 c 151.363 
27.586 l 150.059 28.125 148.664 28.395 147.254 28.371 c 137.902 28.371 137.766
 18.613 137.766 18.203 c 137.766 6.781 l 147.254 2.859 l 156.727 6.781 l
 156.727 18.234 l 156.719 18.684 156.684 19.133 156.613 19.582 c 157.867
 19.754 l 157.941 19.254 157.98 18.742 157.996 18.234 c 157.996 5.941 l 
h
147.254 6.105 m 140.086 8.949 l 140.086 18.57 l 140.363 19.828 140.836 
21.039 141.473 22.156 c 142.875 24.602 144.879 25.852 147.254 25.852 c 149.633
 25.852 151.637 24.57 153.047 22.164 c 153.691 21.039 154.164 19.828 154.441
 18.57 c 154.441 8.949 l h
146.633 7.695 m 146.633 24.578 l 142.703 24.082 141.449 18.996 141.328 
18.406 c 141.328 9.797 l h
147.879 7.695 m 153.188 9.797 l 153.188 18.406 l 153.059 18.996 151.809
 24.082 147.879 24.578 c h
157.793 20.715 m 154.859 20.836 152.574 23.281 152.633 26.211 c 152.691
 29.145 155.086 31.492 158.016 31.5 c 160.996 31.5 163.41 29.086 163.418
 26.109 c 163.418 24.637 162.816 23.227 161.754 22.207 c 160.695 21.195 
159.262 20.648 157.793 20.715 c h
158.016 21.961 m 160.305 21.961 162.156 23.812 162.164 26.109 c 162.164
 28.395 160.305 30.246 158.016 30.246 c 155.73 30.246 153.871 28.395 153.871
 26.102 c 153.871 23.812 155.73 21.961 158.016 21.961 c h
157.387 23.121 m 157.387 25.477 l 155.039 25.477 l 155.039 26.73 l 157.387
 26.73 l 157.387 29.086 l 158.641 29.086 l 158.641 26.73 l 160.996 26.73
 l 160.996 25.477 l 158.641 25.477 l 158.641 23.121 l h
157.387 23.121 m f
Q Q
showpage
%%Trailer
end
%%EOF
