%!PS-Adobe-3.0 EPSF-3.0
%%Creator: cairo 1.16.0 (https://cairographics.org)
%%CreationDate: Tue Jun 22 08:38:54 2021
%%Pages: 1
%%DocumentData: Clean7Bit
%%LanguageLevel: 2
%%BoundingBox: 0 0 369 133
%%EndComments
%%BeginProlog
50 dict begin
/q { gsave } bind def
/Q { grestore } bind def
/cm { 6 array astore concat } bind def
/w { setlinewidth } bind def
/J { setlinecap } bind def
/j { setlinejoin } bind def
/M { setmiterlimit } bind def
/d { setdash } bind def
/m { moveto } bind def
/l { lineto } bind def
/c { curveto } bind def
/h { closepath } bind def
/re { exch dup neg 3 1 roll 5 3 roll moveto 0 rlineto
      0 exch rlineto 0 rlineto closepath } bind def
/S { stroke } bind def
/f { fill } bind def
/f* { eofill } bind def
/n { newpath } bind def
/W { clip } bind def
/W* { eoclip } bind def
/BT { } bind def
/ET { } bind def
/BDC { mark 3 1 roll /BDC pdfmark } bind def
/EMC { mark /EMC pdfmark } bind def
/cairo_store_point { /cairo_point_y exch def /cairo_point_x exch def } def
/Tj { show currentpoint cairo_store_point } bind def
/TJ {
  {
    dup
    type /stringtype eq
    { show } { -0.001 mul 0 cairo_font_matrix dtransform rmoveto } ifelse
  } forall
  currentpoint cairo_store_point
} bind def
/cairo_selectfont { cairo_font_matrix aload pop pop pop 0 0 6 array astore
    cairo_font exch selectfont cairo_point_x cairo_point_y moveto } bind def
/Tf { pop /cairo_font exch def /cairo_font_matrix where
      { pop cairo_selectfont } if } bind def
/Td { matrix translate cairo_font_matrix matrix concatmatrix dup
      /cairo_font_matrix exch def dup 4 get exch 5 get cairo_store_point
      /cairo_font where { pop cairo_selectfont } if } bind def
/Tm { 2 copy 8 2 roll 6 array astore /cairo_font_matrix exch def
      cairo_store_point /cairo_font where { pop cairo_selectfont } if } bind def
/g { setgray } bind def
/rg { setrgbcolor } bind def
/d1 { setcachedevice } bind def
/cairo_data_source {
  CairoDataIndex CairoData length lt
    { CairoData CairoDataIndex get /CairoDataIndex CairoDataIndex 1 add def }
    { () } ifelse
} def
/cairo_flush_ascii85_file { cairo_ascii85_file status { cairo_ascii85_file flushfile } if } def
/cairo_image { image cairo_flush_ascii85_file } def
/cairo_imagemask { imagemask cairo_flush_ascii85_file } def
%%EndProlog
%%BeginSetup
%%EndSetup
%%Page: 1 1
%%BeginPageSetup
%%PageBoundingBox: 0 0 369 133
%%EndPageSetup
q 0 0 369 133 rectclip
1 0 0 -1 0 133 cm q
1 g
71.414 39.789 m 71.414 53.25 60.5 64.164 47.039 64.164 c 33.578 64.164 
22.664 53.25 22.664 39.789 c 22.664 26.324 33.578 15.414 47.039 15.414 c
 60.5 15.414 71.414 26.324 71.414 39.789 c h
71.414 39.789 m f
0 0.313726 0.45098 rg
3 w
0 J
0 j
[] 0.0 d
4 M q 1 0 0 1 0 0 cm
71.414 39.789 m 71.414 53.25 60.5 64.164 47.039 64.164 c 33.578 64.164 
22.664 53.25 22.664 39.789 c 22.664 26.324 33.578 15.414 47.039 15.414 c
 60.5 15.414 71.414 26.324 71.414 39.789 c h
71.414 39.789 m S Q
1 g
168.914 39.789 m 168.914 53.25 158 64.164 144.539 64.164 c 131.078 64.164
 120.164 53.25 120.164 39.789 c 120.164 26.324 131.078 15.414 144.539 15.414
 c 158 15.414 168.914 26.324 168.914 39.789 c h
168.914 39.789 m f
0 0.313726 0.45098 rg
q 1 0 0 1 0 0 cm
168.914 39.789 m 168.914 53.25 158 64.164 144.539 64.164 c 131.078 64.164
 120.164 53.25 120.164 39.789 c 120.164 26.324 131.078 15.414 144.539 15.414
 c 158 15.414 168.914 26.324 168.914 39.789 c h
168.914 39.789 m S Q
1 g
266.414 39.789 m 266.414 53.25 255.5 64.164 242.039 64.164 c 228.578 64.164
 217.664 53.25 217.664 39.789 c 217.664 26.324 228.578 15.414 242.039 15.414
 c 255.5 15.414 266.414 26.324 266.414 39.789 c h
266.414 39.789 m f
0 0.313726 0.45098 rg
q 1 0 0 1 0 0 cm
266.414 39.789 m 266.414 53.25 255.5 64.164 242.039 64.164 c 228.578 64.164
 217.664 53.25 217.664 39.789 c 217.664 26.324 228.578 15.414 242.039 15.414
 c 255.5 15.414 266.414 26.324 266.414 39.789 c h
266.414 39.789 m S Q
1 g
120.164 92.289 m 120.164 105.75 109.25 116.664 95.789 116.664 c 82.328 
116.664 71.414 105.75 71.414 92.289 c 71.414 78.824 82.328 67.914 95.789
 67.914 c 109.25 67.914 120.164 78.824 120.164 92.289 c h
120.164 92.289 m f
0 0.313726 0.45098 rg
q 1 0 0 1 0 0 cm
120.164 92.289 m 120.164 105.75 109.25 116.664 95.789 116.664 c 82.328 
116.664 71.414 105.75 71.414 92.289 c 71.414 78.824 82.328 67.914 95.789
 67.914 c 109.25 67.914 120.164 78.824 120.164 92.289 c h
120.164 92.289 m S Q
1 g
217.664 92.289 m 217.664 105.75 206.75 116.664 193.289 116.664 c 179.828
 116.664 168.914 105.75 168.914 92.289 c 168.914 78.824 179.828 67.914 193.289
 67.914 c 206.75 67.914 217.664 78.824 217.664 92.289 c h
217.664 92.289 m f
0 0.313726 0.45098 rg
q 1 0 0 1 0 0 cm
217.664 92.289 m 217.664 105.75 206.75 116.664 193.289 116.664 c 179.828
 116.664 168.914 105.75 168.914 92.289 c 168.914 78.824 179.828 67.914 193.289
 67.914 c 206.75 67.914 217.664 78.824 217.664 92.289 c h
217.664 92.289 m S Q
0.137255 0.266667 0.364706 rg
0.75 w
10 M q 1 0 0 1 0 0 cm
63.473 57.789 m 75.922 70.957 l S Q
78.629 73.816 m 73.117 71.805 l 75.922 70.957 l 76.926 68.199 l h
78.629 73.816 m f
q 1 0 0 1 0 0 cm
78.629 73.816 m 73.117 71.805 l 75.922 70.957 l 76.926 68.199 l h
78.629 73.816 m S Q
q 1 0 0 1 0 0 cm
112.223 74.289 m 124.672 61.117 l S Q
127.379 58.262 m 125.676 63.879 l 124.672 61.117 l 121.867 60.27 l h
127.379 58.262 m f
q 1 0 0 1 0 0 cm
127.379 58.262 m 125.676 63.879 l 124.672 61.117 l 121.867 60.27 l h
127.379 58.262 m S Q
q 1 0 0 1 0 0 cm
160.973 57.789 m 173.422 70.957 l S Q
176.129 73.816 m 170.617 71.805 l 173.422 70.957 l 174.426 68.199 l h
176.129 73.816 m f
q 1 0 0 1 0 0 cm
176.129 73.816 m 170.617 71.805 l 173.422 70.957 l 174.426 68.199 l h
176.129 73.816 m S Q
q 1 0 0 1 0 0 cm
209.723 74.289 m 222.172 61.117 l S Q
224.879 58.262 m 223.176 63.879 l 222.172 61.117 l 219.367 60.27 l h
224.879 58.262 m f
q 1 0 0 1 0 0 cm
224.879 58.262 m 223.176 63.879 l 222.172 61.117 l 219.367 60.27 l h
224.879 58.262 m S Q
1 g
364.117 39.789 m 364.117 53.25 353.203 64.164 339.742 64.164 c 326.277 
64.164 315.367 53.25 315.367 39.789 c 315.367 26.324 326.277 15.414 339.742
 15.414 c 353.203 15.414 364.117 26.324 364.117 39.789 c h
364.117 39.789 m f
0 0.313726 0.45098 rg
3 w
4 M q 1 0 0 1 0 0 cm
364.117 39.789 m 364.117 53.25 353.203 64.164 339.742 64.164 c 326.277 
64.164 315.367 53.25 315.367 39.789 c 315.367 26.324 326.277 15.414 339.742
 15.414 c 353.203 15.414 364.117 26.324 364.117 39.789 c h
364.117 39.789 m S Q
1 g
315.367 92.289 m 315.367 105.75 304.453 116.664 290.992 116.664 c 277.527
 116.664 266.617 105.75 266.617 92.289 c 266.617 78.824 277.527 67.914 290.992
 67.914 c 304.453 67.914 315.367 78.824 315.367 92.289 c h
315.367 92.289 m f
0 0.313726 0.45098 rg
q 1 0 0 1 0 0 cm
315.367 92.289 m 315.367 105.75 304.453 116.664 290.992 116.664 c 277.527
 116.664 266.617 105.75 266.617 92.289 c 266.617 78.824 277.527 67.914 290.992
 67.914 c 304.453 67.914 315.367 78.824 315.367 92.289 c h
315.367 92.289 m S Q
0.137255 0.266667 0.364706 rg
0.75 w
10 M q 1 0 0 1 0 0 cm
258.914 57.57 m 271.297 70.801 l S Q
273.98 73.672 m 268.477 71.633 l 271.297 70.801 l 272.309 68.047 l h
273.98 73.672 m f
q 1 0 0 1 0 0 cm
273.98 73.672 m 268.477 71.633 l 271.297 70.801 l 272.309 68.047 l h
273.98 73.672 m S Q
q 1 0 0 1 0 0 cm
307.422 74.289 m 319.875 61.117 l S Q
322.582 58.262 m 320.879 63.879 l 319.875 61.117 l 317.07 60.27 l h
322.582 58.262 m f
q 1 0 0 1 0 0 cm
322.582 58.262 m 320.879 63.879 l 319.875 61.117 l 317.07 60.27 l h
322.582 58.262 m S Q
1 g
9.512 0.414 m 84.566 0.414 l 89.605 0.414 93.664 3.758 93.664 7.914 c 93.664
 12.066 89.605 15.414 84.566 15.414 c 9.512 15.414 l 4.469 15.414 0.414 
12.066 0.414 7.914 c 0.414 3.758 4.469 0.414 9.512 0.414 c h
9.512 0.414 m f
0 0.313726 0.45098 rg
0.826027 w
4 M q 1 0 0 1 0 0 cm
9.512 0.414 m 84.566 0.414 l 89.605 0.414 93.664 3.758 93.664 7.914 c 93.664
 12.066 89.605 15.414 84.566 15.414 c 9.512 15.414 l 4.469 15.414 0.414 
12.066 0.414 7.914 c 0.414 3.758 4.469 0.414 9.512 0.414 c h
9.512 0.414 m S Q
1 g
61.238 116.664 m 130.34 116.664 l 135.281 116.664 139.258 120.008 139.258
 124.164 c 139.258 128.316 135.281 131.664 130.34 131.664 c 61.238 131.664
 l 56.297 131.664 52.32 128.316 52.32 124.164 c 52.32 120.008 56.297 116.664
 61.238 116.664 c h
61.238 116.664 m f
0 0.313726 0.45098 rg
0.81777 w
q 1 0 0 1 0 0 cm
61.238 116.664 m 130.34 116.664 l 135.281 116.664 139.258 120.008 139.258
 124.164 c 139.258 128.316 135.281 131.664 130.34 131.664 c 61.238 131.664
 l 56.297 131.664 52.32 128.316 52.32 124.164 c 52.32 120.008 56.297 116.664
 61.238 116.664 c h
61.238 116.664 m S Q
1 g
122.512 0.414 m 166.574 0.414 l 170.73 0.414 174.074 3.758 174.074 7.914
 c 174.074 12.066 170.73 15.414 166.574 15.414 c 122.512 15.414 l 118.355
 15.414 115.012 12.066 115.012 7.914 c 115.012 3.758 118.355 0.414 122.512
 0.414 c h
122.512 0.414 m f
0 0.313726 0.45098 rg
0.75 w
q 1 0 0 1 0 0 cm
122.512 0.414 m 166.574 0.414 l 170.73 0.414 174.074 3.758 174.074 7.914
 c 174.074 12.066 170.73 15.414 166.574 15.414 c 122.512 15.414 l 118.355
 15.414 115.012 12.066 115.012 7.914 c 115.012 3.758 118.355 0.414 122.512
 0.414 c h
122.512 0.414 m S Q
1 g
161.668 116.664 m 224.91 116.664 l 230.102 116.664 234.281 120.008 234.281
 124.164 c 234.281 128.316 230.102 131.664 224.91 131.664 c 161.668 131.664
 l 156.477 131.664 152.297 128.316 152.297 124.164 c 152.297 120.008 156.477
 116.664 161.668 116.664 c h
161.668 116.664 m f
0 0.313726 0.45098 rg
0.838267 w
q 1 0 0 1 0 0 cm
161.668 116.664 m 224.91 116.664 l 230.102 116.664 234.281 120.008 234.281
 124.164 c 234.281 128.316 230.102 131.664 224.91 131.664 c 161.668 131.664
 l 156.477 131.664 152.297 128.316 152.297 124.164 c 152.297 120.008 156.477
 116.664 161.668 116.664 c h
161.668 116.664 m S Q
1 g
215.477 0.414 m 268.602 0.414 l 273.309 0.414 277.098 3.758 277.098 7.914
 c 277.098 12.066 273.309 15.414 268.602 15.414 c 215.477 15.414 l 210.77
 15.414 206.977 12.066 206.977 7.914 c 206.977 3.758 210.77 0.414 215.477
 0.414 c h
215.477 0.414 m f
0 0.313726 0.45098 rg
0.79842 w
q 1 0 0 1 0 0 cm
215.477 0.414 m 268.602 0.414 l 273.309 0.414 277.098 3.758 277.098 7.914
 c 277.098 12.066 273.309 15.414 268.602 15.414 c 215.477 15.414 l 210.77
 15.414 206.977 12.066 206.977 7.914 c 206.977 3.758 210.77 0.414 215.477
 0.414 c h
215.477 0.414 m S Q
1 g
279.102 116.664 m 302.883 116.664 l 307.949 116.664 312.027 120.008 312.027
 124.164 c 312.027 128.316 307.949 131.664 302.883 131.664 c 279.102 131.664
 l 274.031 131.664 269.953 128.316 269.953 124.164 c 269.953 120.008 274.031
 116.664 279.102 116.664 c h
279.102 116.664 m f
0 0.313726 0.45098 rg
0.828262 w
q 1 0 0 1 0 0 cm
279.102 116.664 m 302.883 116.664 l 307.949 116.664 312.027 120.008 312.027
 124.164 c 312.027 128.316 307.949 131.664 302.883 131.664 c 279.102 131.664
 l 274.031 131.664 269.953 128.316 269.953 124.164 c 269.953 120.008 274.031
 116.664 279.102 116.664 c h
279.102 116.664 m S Q
1 g
320.633 0.414 m 358.84 0.414 l 363.855 0.414 367.891 3.758 367.891 7.914
 c 367.891 12.066 363.855 15.414 358.84 15.414 c 320.633 15.414 l 315.621
 15.414 311.586 12.066 311.586 7.914 c 311.586 3.758 315.621 0.414 320.633
 0.414 c h
320.633 0.414 m f
0 0.313726 0.45098 rg
0.823763 w
q 1 0 0 1 0 0 cm
320.633 0.414 m 358.84 0.414 l 363.855 0.414 367.891 3.758 367.891 7.914
 c 367.891 12.066 363.855 15.414 358.84 15.414 c 320.633 15.414 l 315.621
 15.414 311.586 12.066 311.586 7.914 c 311.586 3.758 315.621 0.414 320.633
 0.414 c h
320.633 0.414 m S Q
Q Q
showpage
%%Trailer
end
%%EOF
