%!PS-Adobe-3.0 EPSF-3.0
%%Creator: cairo 1.16.0 (https://cairographics.org)
%%CreationDate: Thu Jun 17 09:55:53 2021
%%Pages: 1
%%DocumentData: Clean7Bit
%%LanguageLevel: 2
%%BoundingBox: 0 0 331 151
%%EndComments
%%BeginProlog
50 dict begin
/q { gsave } bind def
/Q { grestore } bind def
/cm { 6 array astore concat } bind def
/w { setlinewidth } bind def
/J { setlinecap } bind def
/j { setlinejoin } bind def
/M { setmiterlimit } bind def
/d { setdash } bind def
/m { moveto } bind def
/l { lineto } bind def
/c { curveto } bind def
/h { closepath } bind def
/re { exch dup neg 3 1 roll 5 3 roll moveto 0 rlineto
      0 exch rlineto 0 rlineto closepath } bind def
/S { stroke } bind def
/f { fill } bind def
/f* { eofill } bind def
/n { newpath } bind def
/W { clip } bind def
/W* { eoclip } bind def
/BT { } bind def
/ET { } bind def
/BDC { mark 3 1 roll /BDC pdfmark } bind def
/EMC { mark /EMC pdfmark } bind def
/cairo_store_point { /cairo_point_y exch def /cairo_point_x exch def } def
/Tj { show currentpoint cairo_store_point } bind def
/TJ {
  {
    dup
    type /stringtype eq
    { show } { -0.001 mul 0 cairo_font_matrix dtransform rmoveto } ifelse
  } forall
  currentpoint cairo_store_point
} bind def
/cairo_selectfont { cairo_font_matrix aload pop pop pop 0 0 6 array astore
    cairo_font exch selectfont cairo_point_x cairo_point_y moveto } bind def
/Tf { pop /cairo_font exch def /cairo_font_matrix where
      { pop cairo_selectfont } if } bind def
/Td { matrix translate cairo_font_matrix matrix concatmatrix dup
      /cairo_font_matrix exch def dup 4 get exch 5 get cairo_store_point
      /cairo_font where { pop cairo_selectfont } if } bind def
/Tm { 2 copy 8 2 roll 6 array astore /cairo_font_matrix exch def
      cairo_store_point /cairo_font where { pop cairo_selectfont } if } bind def
/g { setgray } bind def
/rg { setrgbcolor } bind def
/d1 { setcachedevice } bind def
/cairo_data_source {
  CairoDataIndex CairoData length lt
    { CairoData CairoDataIndex get /CairoDataIndex CairoDataIndex 1 add def }
    { () } ifelse
} def
/cairo_flush_ascii85_file { cairo_ascii85_file status { cairo_ascii85_file flushfile } if } def
/cairo_image { image cairo_flush_ascii85_file } def
/cairo_imagemask { imagemask cairo_flush_ascii85_file } def
%%EndProlog
%%BeginSetup
%%EndSetup
%%Page: 1 1
%%BeginPageSetup
%%PageBoundingBox: 0 0 331 151
%%EndPageSetup
q 0 0 331 151 rectclip
1 0 0 -1 0 151 cm q
1 g
4.875 60.375 m 85.875 60.375 l 88.367 60.375 90.375 62.383 90.375 64.875
 c 90.375 85.875 l 90.375 88.367 88.367 90.375 85.875 90.375 c 4.875 90.375
 l 2.383 90.375 0.375 88.367 0.375 85.875 c 0.375 64.875 l 0.375 62.383 
2.383 60.375 4.875 60.375 c h
4.875 60.375 m f
0 0.313726 0.45098 rg
0.75 w
0 J
0 j
[] 0.0 d
4 M q 1 0 0 1 0 0 cm
4.875 60.375 m 85.875 60.375 l 88.367 60.375 90.375 62.383 90.375 64.875
 c 90.375 85.875 l 90.375 88.367 88.367 90.375 85.875 90.375 c 4.875 90.375
 l 2.383 90.375 0.375 88.367 0.375 85.875 c 0.375 64.875 l 0.375 62.383 
2.383 60.375 4.875 60.375 c h
4.875 60.375 m S Q
1 g
64.875 120.375 m 145.875 120.375 l 148.367 120.375 150.375 122.383 150.375
 124.875 c 150.375 145.875 l 150.375 148.367 148.367 150.375 145.875 150.375
 c 64.875 150.375 l 62.383 150.375 60.375 148.367 60.375 145.875 c 60.375
 124.875 l 60.375 122.383 62.383 120.375 64.875 120.375 c h
64.875 120.375 m f
0 0.313726 0.45098 rg
q 1 0 0 1 0 0 cm
64.875 120.375 m 145.875 120.375 l 148.367 120.375 150.375 122.383 150.375
 124.875 c 150.375 145.875 l 150.375 148.367 148.367 150.375 145.875 150.375
 c 64.875 150.375 l 62.383 150.375 60.375 148.367 60.375 145.875 c 60.375
 124.875 l 60.375 122.383 62.383 120.375 64.875 120.375 c h
64.875 120.375 m S Q
1 g
244.875 60.375 m 325.875 60.375 l 328.367 60.375 330.375 62.383 330.375
 64.875 c 330.375 85.875 l 330.375 88.367 328.367 90.375 325.875 90.375 
c 244.875 90.375 l 242.383 90.375 240.375 88.367 240.375 85.875 c 240.375
 64.875 l 240.375 62.383 242.383 60.375 244.875 60.375 c h
244.875 60.375 m f
0 0.313726 0.45098 rg
q 1 0 0 1 0 0 cm
244.875 60.375 m 325.875 60.375 l 328.367 60.375 330.375 62.383 330.375
 64.875 c 330.375 85.875 l 330.375 88.367 328.367 90.375 325.875 90.375 
c 244.875 90.375 l 242.383 90.375 240.375 88.367 240.375 85.875 c 240.375
 64.875 l 240.375 62.383 242.383 60.375 244.875 60.375 c h
244.875 60.375 m S Q
1 g
184.875 120.375 m 265.875 120.375 l 268.367 120.375 270.375 122.383 270.375
 124.875 c 270.375 145.875 l 270.375 148.367 268.367 150.375 265.875 150.375
 c 184.875 150.375 l 182.383 150.375 180.375 148.367 180.375 145.875 c 180.375
 124.875 l 180.375 122.383 182.383 120.375 184.875 120.375 c h
184.875 120.375 m f
0 0.313726 0.45098 rg
q 1 0 0 1 0 0 cm
184.875 120.375 m 265.875 120.375 l 268.367 120.375 270.375 122.383 270.375
 124.875 c 270.375 145.875 l 270.375 148.367 268.367 150.375 265.875 150.375
 c 184.875 150.375 l 182.383 150.375 180.375 148.367 180.375 145.875 c 180.375
 124.875 l 180.375 122.383 182.383 120.375 184.875 120.375 c h
184.875 120.375 m S Q
1 g
124.875 0.375 m 205.875 0.375 l 208.367 0.375 210.375 2.383 210.375 4.875
 c 210.375 25.875 l 210.375 28.367 208.367 30.375 205.875 30.375 c 124.875
 30.375 l 122.383 30.375 120.375 28.367 120.375 25.875 c 120.375 4.875 l
 120.375 2.383 122.383 0.375 124.875 0.375 c h
124.875 0.375 m f
0 0.313726 0.45098 rg
q 1 0 0 1 0 0 cm
124.875 0.375 m 205.875 0.375 l 208.367 0.375 210.375 2.383 210.375 4.875
 c 210.375 25.875 l 210.375 28.367 208.367 30.375 205.875 30.375 c 124.875
 30.375 l 122.383 30.375 120.375 28.367 120.375 25.875 c 120.375 4.875 l
 120.375 2.383 122.383 0.375 124.875 0.375 c h
124.875 0.375 m S Q
0.137255 0.266667 0.364706 rg
10 M q 1 0 0 1 0 0 cm
45.375 90.375 m 45.375 127.875 l 45.375 132.875 47.078 135.375 50.488 135.375
 c 55.598 135.375 l S Q
59.535 135.375 m 54.285 138 l 55.598 135.375 l 54.285 132.75 l h
59.535 135.375 m f
q 1 0 0 1 0 0 cm
59.535 135.375 m 54.285 138 l 55.598 135.375 l 54.285 132.75 l h
59.535 135.375 m S Q
q 1 0 0 1 0 0 cm
45.375 60.375 m 45.375 22.875 l 45.375 17.875 47.875 15.375 52.875 15.375
 c 115.598 15.375 l S Q
119.535 15.375 m 114.285 18 l 115.598 15.375 l 114.285 12.75 l h
119.535 15.375 m f
q 1 0 0 1 0 0 cm
119.535 15.375 m 114.285 18 l 115.598 15.375 l 114.285 12.75 l h
119.535 15.375 m S Q
q 1 0 0 1 0 0 cm
150.375 135.375 m 175.598 135.375 l S Q
179.535 135.375 m 174.285 138 l 175.598 135.375 l 174.285 132.75 l h
179.535 135.375 m f
q 1 0 0 1 0 0 cm
179.535 135.375 m 174.285 138 l 175.598 135.375 l 174.285 132.75 l h
179.535 135.375 m S Q
q 1 0 0 1 0 0 cm
210.375 15.375 m 277.875 15.375 l 282.875 15.375 285.375 17.875 285.375
 22.875 c 285.375 55.598 l S Q
285.375 59.535 m 282.75 54.285 l 285.375 55.598 l 288 54.285 l h
285.375 59.535 m f
q 1 0 0 1 0 0 cm
285.375 59.535 m 282.75 54.285 l 285.375 55.598 l 288 54.285 l h
285.375 59.535 m S Q
q 1 0 0 1 0 0 cm
270.375 135.375 m 277.875 135.375 l 282.875 135.375 285.375 132.875 285.375
 127.875 c 285.375 95.152 l S Q
285.375 91.215 m 288 96.465 l 285.375 95.152 l 282.75 96.465 l h
285.375 91.215 m f
q 1 0 0 1 0 0 cm
285.375 91.215 m 288 96.465 l 285.375 95.152 l 282.75 96.465 l h
285.375 91.215 m S Q
Q Q
showpage
%%Trailer
end
%%EOF
