%!PS-Adobe-3.0 EPSF-3.0
%%Creator: cairo 1.17.4 (https://cairographics.org)
%%CreationDate: Fri Jul  9 10:40:26 2021
%%Pages: 1
%%DocumentData: Clean7Bit
%%LanguageLevel: 2
%%BoundingBox: 0 0 312 191
%%EndComments
%%BeginProlog
50 dict begin
/q { gsave } bind def
/Q { grestore } bind def
/cm { 6 array astore concat } bind def
/w { setlinewidth } bind def
/J { setlinecap } bind def
/j { setlinejoin } bind def
/M { setmiterlimit } bind def
/d { setdash } bind def
/m { moveto } bind def
/l { lineto } bind def
/c { curveto } bind def
/h { closepath } bind def
/re { exch dup neg 3 1 roll 5 3 roll moveto 0 rlineto
      0 exch rlineto 0 rlineto closepath } bind def
/S { stroke } bind def
/f { fill } bind def
/f* { eofill } bind def
/n { newpath } bind def
/W { clip } bind def
/W* { eoclip } bind def
/BT { } bind def
/ET { } bind def
/BDC { mark 3 1 roll /BDC pdfmark } bind def
/EMC { mark /EMC pdfmark } bind def
/cairo_store_point { /cairo_point_y exch def /cairo_point_x exch def } def
/Tj { show currentpoint cairo_store_point } bind def
/TJ {
  {
    dup
    type /stringtype eq
    { show } { -0.001 mul 0 cairo_font_matrix dtransform rmoveto } ifelse
  } forall
  currentpoint cairo_store_point
} bind def
/cairo_selectfont { cairo_font_matrix aload pop pop pop 0 0 6 array astore
    cairo_font exch selectfont cairo_point_x cairo_point_y moveto } bind def
/Tf { pop /cairo_font exch def /cairo_font_matrix where
      { pop cairo_selectfont } if } bind def
/Td { matrix translate cairo_font_matrix matrix concatmatrix dup
      /cairo_font_matrix exch def dup 4 get exch 5 get cairo_store_point
      /cairo_font where { pop cairo_selectfont } if } bind def
/Tm { 2 copy 8 2 roll 6 array astore /cairo_font_matrix exch def
      cairo_store_point /cairo_font where { pop cairo_selectfont } if } bind def
/g { setgray } bind def
/rg { setrgbcolor } bind def
/d1 { setcachedevice } bind def
/cairo_data_source {
  CairoDataIndex CairoData length lt
    { CairoData CairoDataIndex get /CairoDataIndex CairoDataIndex 1 add def }
    { () } ifelse
} def
/cairo_flush_ascii85_file { cairo_ascii85_file status { cairo_ascii85_file flushfile } if } def
/cairo_image { image cairo_flush_ascii85_file } def
/cairo_imagemask { imagemask cairo_flush_ascii85_file } def
%%EndProlog
%%BeginSetup
%%EndSetup
%%Page: 1 1
%%BeginPageSetup
%%PageBoundingBox: 0 0 312 191
%%EndPageSetup
q 0 0 312 191 rectclip
1 0 0 -1 0 191 cm q
0 0.313726 0.45098 rg
33.887 81.801 m 29.953 82.484 24.238 83.062 19.32 83.062 c 14.887 83.102
 9.344 82.664 4.41 81.848 c 4.484 84.293 5.281 86.379 6.621 88.184 c 7.844
 96.668 14.031 100.875 18.879 100.875 c 25.074 100.875 30.465 96.156 31.641
 88.164 c 32.895 86.574 33.879 84.121 33.887 81.801 c h
12.637 85.074 m 12.465 85.59 12.547 86.113 13.004 86.559 c 13.605 87.137
 14.324 87.113 14.895 86.664 c 15.277 86.348 15.555 85.875 15.422 85.328
 c 15.676 85.395 15.848 85.516 15.977 85.656 c 16.184 85.859 16.164 86.113
 16.102 86.438 c 15.988 86.941 15.457 87.676 14.641 87.809 c 13.176 88.059
 12.547 87.465 11.977 86.984 c 11.641 86.609 11.301 86.094 11.391 85.566
 c 11.453 85.23 12.188 85.109 12.637 85.074 c h
25.637 85.066 m 26.219 85.117 26.656 85.223 26.895 85.484 c 27.031 85.996
 26.766 86.512 26.203 87.074 c 25.328 87.816 24.734 88.02 23.586 87.809 
c 23.07 87.691 22.418 87.234 22.215 86.504 c 22.156 86.301 22.059 85.922
 22.254 85.734 c 22.434 85.523 22.605 85.402 22.867 85.336 c 22.77 85.809
 22.906 86.219 23.355 86.648 c 23.812 87.039 24.621 87.211 25.23 86.602 
c 25.605 86.242 25.906 85.629 25.637 85.066 c h
8.805 87.652 m 9.855 88.703 11.391 89.656 13.074 90.27 c 14.578 90.848 
15.84 90.938 17.039 89.941 c 17.633 89.469 18.031 89.031 18.496 88.574 c
 18.887 88.172 19.199 88.148 19.621 88.508 c 20.203 89.078 20.715 89.586
 21.188 89.918 c 22.566 91.012 23.664 90.84 25.785 90.039 c 27.172 89.488
 28.672 88.453 29.504 87.66 c 29.109 90.578 28.23 92.844 26.199 95.289 c
 24.496 97.191 22.164 98.641 19.066 98.641 c 16.238 98.641 13.738 97.176
 11.918 95.113 c 10.246 93.09 9.211 90.773 8.805 87.652 c h
17.551 92.902 m 16.809 93.285 16.223 93.645 16.223 94.273 c 16.23 94.754
 16.695 94.891 17.469 94.98 c 18.48 95.07 19.5 95.055 20.512 94.996 c 21.211
 94.957 21.879 94.934 22.086 94.32 c 22.215 93.863 21.555 93.285 21.039 
93.059 c 19.934 92.496 18.523 92.527 17.551 92.902 c h
2.574 80.25 m 1.359 80.039 0.375 79.207 0.422 77.844 c 0.473 76.922 1.125
 76.043 2.641 75.773 c 4.066 75.516 5.961 75.227 7.777 75.023 c 8.227 72.816
 8.648 70.523 8.918 67.746 c 8.902 66.422 9.188 65.324 10.484 64.641 c 11.309
 64.254 12.676 64.176 14.062 64.641 c 16.816 65.738 21.148 65.852 24.391
 64.637 c 25.387 64.305 26.535 64.125 27.684 64.605 c 28.941 65.176 29.387
 66.234 29.348 67.281 c 29.535 70.184 29.992 72.914 30.473 75.023 c 32.371
 75.277 34.336 75.496 36.008 75.863 c 37.254 76.172 37.875 77.004 37.875
 77.961 c 37.875 79.184 36.996 79.883 36.262 80.109 c 32.34 80.941 26.934
 81.863 19.207 81.863 c 13.426 81.863 7.809 81.285 2.574 80.25 c h
2.574 80.25 m f
0.137255 0.266667 0.364706 rg
0.75 w
0 J
0 j
[] 0.0 d
10 M q 1 0 0 1 0 0 cm
48 80.625 m 133.223 80.625 l S Q
137.16 80.625 m 131.91 83.25 l 133.223 80.625 l 131.91 78 l h
137.16 80.625 m f
q 1 0 0 1 0 0 cm
137.16 80.625 m 131.91 83.25 l 133.223 80.625 l 131.91 78 l h
137.16 80.625 m S Q
q 1 0 0 1 0 0 cm
48.375 65.625 m 133.598 65.625 l S Q
137.535 65.625 m 132.285 68.25 l 133.598 65.625 l 132.285 63 l h
137.535 65.625 m f
q 1 0 0 1 0 0 cm
137.535 65.625 m 132.285 68.25 l 133.598 65.625 l 132.285 63 l h
137.535 65.625 m S Q
q 1 0 0 1 0 0 cm
48.375 94.875 m 133.598 94.875 l S Q
137.535 94.875 m 132.285 97.5 l 133.598 94.875 l 132.285 92.25 l h
137.535 94.875 m f
q 1 0 0 1 0 0 cm
137.535 94.875 m 132.285 97.5 l 133.598 94.875 l 132.285 92.25 l h
137.535 94.875 m S Q
q 1 0 0 1 0 0 cm
48.375 50.625 m 133.598 50.625 l S Q
137.535 50.625 m 132.285 53.25 l 133.598 50.625 l 132.285 48 l h
137.535 50.625 m f
q 1 0 0 1 0 0 cm
137.535 50.625 m 132.285 53.25 l 133.598 50.625 l 132.285 48 l h
137.535 50.625 m S Q
q 1 0 0 1 0 0 cm
48.375 110.25 m 133.598 110.25 l S Q
137.535 110.25 m 132.285 112.875 l 133.598 110.25 l 132.285 107.625 l h
137.535 110.25 m f
q 1 0 0 1 0 0 cm
137.535 110.25 m 132.285 112.875 l 133.598 110.25 l 132.285 107.625 l h
137.535 110.25 m S Q
229.809 40.852 m 227.117 46.062 l 226.629 43.176 l 224.02 41.828 l h
229.809 40.852 m f
q 1 0 0 1 0 0 cm
229.809 40.852 m 227.117 46.062 l 226.629 43.176 l 224.02 41.828 l h
229.809 40.852 m S Q
1 g
272.25 14.625 m 272.25 37.875 l 249.75 50.625 l 227.25 37.875 l 227.25 
14.625 l 249.75 1.875 l h
272.25 14.625 m f
0 0.313726 0.45098 rg
3 w
q 0 1 -1 0 0 0 cm
14.625 -272.25 m 37.875 -272.25 l 50.625 -249.75 l 37.875 -227.25 l 14.625
 -227.25 l 1.875 -249.75 l h
14.625 -272.25 m S Q
0.137255 0.266667 0.364706 rg
229.734 124.129 m 223.945 123.156 l 226.555 121.805 l 227.043 118.918 l
 h
229.734 124.129 m f
0.75 w
q 1 0 0 1 0 0 cm
229.734 124.129 m 223.945 123.156 l 226.555 121.805 l 227.043 118.918 l
 h
229.734 124.129 m S Q
1 g
272.25 127.125 m 272.25 150.375 l 249.75 163.125 l 227.25 150.375 l 227.25
 127.125 l 249.75 114.375 l h
272.25 127.125 m f
0 0.313726 0.45098 rg
3 w
q 0 1 -1 0 0 0 cm
127.125 -272.25 m 150.375 -272.25 l 163.125 -249.75 l 150.375 -227.25 l
 127.125 -227.25 l 114.375 -249.75 l h
127.125 -272.25 m S Q
0.137255 0.266667 0.364706 rg
263.141 82.5 m 257.891 85.125 l 259.203 82.5 l 257.891 79.875 l h
263.141 82.5 m f
0.75 w
q 1 0 0 1 0 0 cm
263.141 82.5 m 257.891 85.125 l 259.203 82.5 l 257.891 79.875 l h
263.141 82.5 m S Q
1 g
309.75 70.875 m 309.75 94.125 l 287.25 106.875 l 264.75 94.125 l 264.75
 70.875 l 287.25 58.125 l h
309.75 70.875 m f
0 0.313726 0.45098 rg
3 w
q 0 1 -1 0 0 0 cm
70.875 -309.75 m 94.125 -309.75 l 106.875 -287.25 l 94.125 -264.75 l 70.875
 -264.75 l 58.125 -287.25 l h
70.875 -309.75 m S Q
0.137255 0.266667 0.364706 rg
0.75 w
q 1 0 0 1 0 0 cm
191.648 68.762 m 227.121 42.809 l S Q
q 1 0 0 1 0 0 cm
195.375 82.5 m 259.973 82.5 l S Q
q 1 0 0 1 0 0 cm
191.648 96.238 m 227.121 122.191 l S Q
q 1 0 0 1 0 0 cm
166.262 102.879 m 166.379 138.629 l S Q
176.754 106.836 m 179.43 112.059 l 176.789 110.773 l 174.18 112.109 l h
176.754 106.836 m f
q 1 0 0 1 0 0 cm
176.754 106.836 m 179.43 112.059 l 176.789 110.773 l 174.18 112.109 l h
176.754 106.836 m S Q
1 g
195.375 70.875 m 195.375 94.125 l 172.875 106.875 l 150.375 94.125 l 150.375
 70.875 l 172.875 58.125 l h
195.375 70.875 m f
0 0.313726 0.45098 rg
3 w
q 1 0 0 1 0 0 cm
195.375 70.875 m 195.375 94.125 l 172.875 106.875 l 150.375 94.125 l 150.375
 70.875 l 172.875 58.125 l h
195.375 70.875 m S Q
1 g
158.746 70.312 m 157.934 70.312 157.273 70.98 157.273 71.797 c 157.273 
93.203 l 157.273 94.02 157.934 94.688 158.746 94.688 c 187.004 94.688 l 
187.816 94.688 188.477 94.02 188.477 93.203 c 188.477 71.797 l 188.477 70.98
 187.816 70.312 187.004 70.312 c h
158.746 70.312 m f
0 0.313726 0.45098 rg
178.109 91.328 m 179.047 89.887 l 173.707 86.316 l 174.262 85.469 l 179.602
 89.039 l 180.496 87.676 l 182.379 91.574 l h
178.074 73.711 m 179.012 75.141 l 173.676 78.711 l 174.234 79.559 l 179.566
 75.988 l 180.465 77.355 l 182.34 73.453 l h
180.719 80.273 m 180.719 81.996 l 174.316 81.996 l 174.316 83.016 l 180.719
 83.016 l 180.719 84.652 l 184.418 82.449 l h
167.707 80.273 m 167.707 81.996 l 161.309 81.996 l 161.309 83.016 l 167.707
 83.016 l 167.707 84.652 l 171.406 82.449 l h
158.746 70.312 m 157.934 70.312 157.273 70.98 157.273 71.797 c 157.273 
93.203 l 157.273 94.02 157.934 94.688 158.746 94.688 c 187.004 94.688 l 
187.816 94.688 188.477 94.02 188.477 93.203 c 188.477 71.797 l 188.477 70.98
 187.816 70.312 187.004 70.312 c h
158.746 70.988 m 187.004 70.988 l 187.453 70.988 187.809 71.34 187.809 
71.797 c 187.809 93.203 l 187.809 93.66 187.453 94.012 187.004 94.012 c 
158.746 94.012 l 158.297 94.012 157.941 93.66 157.941 93.203 c 157.941 71.797
 l 157.941 71.34 158.297 70.988 158.746 70.988 c h
158.746 70.988 m f
1 g
2.25 w
4 M q 1 0 0 1 0 0 cm
157.996 70.688 m 187.305 70.688 l 187.703 70.688 188.023 71.008 188.023
 71.406 c 188.023 93.969 l 188.023 94.367 187.703 94.688 187.305 94.688 
c 157.996 94.688 l 157.598 94.688 157.273 94.367 157.273 93.969 c 157.273
 71.406 l 157.273 71.008 157.598 70.688 157.996 70.688 c h
157.996 70.688 m S Q
0.137255 0.266667 0.364706 rg
0.75 w
10 M q 1 0 0 1 0 0 cm
177.105 143.012 m 176.789 109.605 l S Q
166.395 142.566 m 163.746 137.324 l 166.379 138.629 l 168.996 137.309 l
 h
166.395 142.566 m f
q 1 0 0 1 0 0 cm
166.395 142.566 m 163.746 137.324 l 166.379 138.629 l 168.996 137.309 l
 h
166.395 142.566 m S Q
1 g
195.375 153.375 m 195.375 176.625 l 172.875 189.375 l 150.375 176.625 l
 150.375 153.375 l 172.875 140.625 l h
195.375 153.375 m f
0 0.313726 0.45098 rg
3 w
q 1 0 0 1 0 0 cm
195.375 153.375 m 195.375 176.625 l 172.875 189.375 l 150.375 176.625 l
 150.375 153.375 l 172.875 140.625 l h
195.375 153.375 m S Q
178.516 163.711 m 178.516 159.27 l 179.641 159.27 l 179.641 163.711 l h
176.078 163.711 m 176.078 161.488 l 177.211 161.488 l 177.211 163.711 l
 h
173.684 163.711 m 173.684 160.336 l 174.801 160.336 l 174.801 163.711 l
 h
176.574 167.004 m 180.156 167.004 182.586 164.496 182.586 161.672 c 182.586
 158.762 180.352 156.316 176.559 156.316 c 173.746 156.316 170.73 158.297
 170.73 161.602 c 170.73 164.836 173.656 167.004 176.574 167.004 c h
164.355 174.977 m 163.484 175.695 162.375 175.875 161.488 175.086 c 160.688
 174.285 160.996 173.297 161.559 172.793 c 165.594 168.977 l 166.297 168.309
 167.52 167.453 168.758 166.934 c 169.359 166.637 169.754 166.289 169.371
 165.512 c 168.781 164.379 168.316 163.32 168.316 161.324 c 168.316 157.469
 172.102 154.125 176.617 154.125 c 182.086 154.125 185.062 158.355 185.062
 161.73 c 185.062 165.531 181.418 169.191 176.871 169.191 c 175.727 169.191
 174.309 168.824 173.316 168.488 c 172.344 168.172 171.238 168.141 170.438
 169.207 c 169.957 169.738 169.41 170.766 167.934 172.043 c h
164.355 174.977 m f
Q Q
showpage
%%Trailer
end
%%EOF
