%!PS-Adobe-3.0 EPSF-3.0
%%Creator: cairo 1.17.4 (https://cairographics.org)
%%CreationDate: Fri Aug  6 14:13:52 2021
%%Pages: 1
%%DocumentData: Clean7Bit
%%LanguageLevel: 2
%%BoundingBox: 3 0 195 169
%%EndComments
%%BeginProlog
50 dict begin
/q { gsave } bind def
/Q { grestore } bind def
/cm { 6 array astore concat } bind def
/w { setlinewidth } bind def
/J { setlinecap } bind def
/j { setlinejoin } bind def
/M { setmiterlimit } bind def
/d { setdash } bind def
/m { moveto } bind def
/l { lineto } bind def
/c { curveto } bind def
/h { closepath } bind def
/re { exch dup neg 3 1 roll 5 3 roll moveto 0 rlineto
      0 exch rlineto 0 rlineto closepath } bind def
/S { stroke } bind def
/f { fill } bind def
/f* { eofill } bind def
/n { newpath } bind def
/W { clip } bind def
/W* { eoclip } bind def
/BT { } bind def
/ET { } bind def
/BDC { mark 3 1 roll /BDC pdfmark } bind def
/EMC { mark /EMC pdfmark } bind def
/cairo_store_point { /cairo_point_y exch def /cairo_point_x exch def } def
/Tj { show currentpoint cairo_store_point } bind def
/TJ {
  {
    dup
    type /stringtype eq
    { show } { -0.001 mul 0 cairo_font_matrix dtransform rmoveto } ifelse
  } forall
  currentpoint cairo_store_point
} bind def
/cairo_selectfont { cairo_font_matrix aload pop pop pop 0 0 6 array astore
    cairo_font exch selectfont cairo_point_x cairo_point_y moveto } bind def
/Tf { pop /cairo_font exch def /cairo_font_matrix where
      { pop cairo_selectfont } if } bind def
/Td { matrix translate cairo_font_matrix matrix concatmatrix dup
      /cairo_font_matrix exch def dup 4 get exch 5 get cairo_store_point
      /cairo_font where { pop cairo_selectfont } if } bind def
/Tm { 2 copy 8 2 roll 6 array astore /cairo_font_matrix exch def
      cairo_store_point /cairo_font where { pop cairo_selectfont } if } bind def
/g { setgray } bind def
/rg { setrgbcolor } bind def
/d1 { setcachedevice } bind def
/cairo_data_source {
  CairoDataIndex CairoData length lt
    { CairoData CairoDataIndex get /CairoDataIndex CairoDataIndex 1 add def }
    { () } ifelse
} def
/cairo_flush_ascii85_file { cairo_ascii85_file status { cairo_ascii85_file flushfile } if } def
/cairo_image { image cairo_flush_ascii85_file } def
/cairo_imagemask { imagemask cairo_flush_ascii85_file } def
%%EndProlog
%%BeginSetup
%%EndSetup
%%Page: 1 1
%%BeginPageSetup
%%PageBoundingBox: 3 0 195 169
%%EndPageSetup
q 3 0 192 169 rectclip
1 0 0 -1 0 169 cm q
1 g
193.5 18 m 193.5 41.25 l 171 54 l 148.5 41.25 l 148.5 18 l 171 5.25 l h
193.5 18 m f
0 0.313726 0.45098 rg
3 w
0 J
0 j
[] 0.0 d
10 M q 0 1 -1 0 0 0 cm
18 -193.5 m 41.25 -193.5 l 54 -171 l 41.25 -148.5 l 18 -148.5 l 5.25 -171
 l h
18 -193.5 m S Q
1 g
120.375 74.625 m 120.375 97.875 l 97.875 110.625 l 75.375 97.875 l 75.375
 74.625 l 97.875 61.875 l h
120.375 74.625 m f
0 0.313726 0.45098 rg
q 0 1 -1 0 0 0 cm
74.625 -120.375 m 97.875 -120.375 l 110.625 -97.875 l 97.875 -75.375 l 
74.625 -75.375 l 61.875 -97.875 l h
74.625 -120.375 m S Q
1 g
192.562 130.5 m 192.562 153.75 l 170.062 166.5 l 147.562 153.75 l 147.562
 130.5 l 170.062 117.75 l h
192.562 130.5 m f
0 0.313726 0.45098 rg
q 0 1 -1 0 0 0 cm
130.5 -192.562 m 153.75 -192.562 l 166.5 -170.062 l 153.75 -147.562 l 130.5
 -147.562 l 117.75 -170.062 l h
130.5 -192.562 m S Q
174.098 132.504 m 172.922 132.504 171.855 133.223 171.414 134.309 c 171
 134.086 170.543 133.973 170.078 133.973 c 169.613 133.973 169.156 134.086
 168.742 134.301 c 168.293 133.23 167.242 132.523 166.074 132.523 c 165.328
 132.523 164.641 132.809 164.129 133.266 c 162.047 134.953 l 161.984 134.949
 161.918 134.949 161.859 134.949 c 161.047 134.949 160.297 135.195 159.676
 135.609 c 155.766 138.57 l 154.184 139.949 153.188 141.977 153.188 144.219
 c 153.188 148.359 156.586 151.738 160.738 151.738 c 164.438 151.738 167.527
 149.07 168.172 145.574 c 168.734 145.824 169.352 145.957 169.98 145.957
 c 170.664 145.957 171.328 145.801 171.945 145.5 c 172.566 149.023 175.672
 151.727 179.387 151.727 c 183.539 151.727 186.938 148.344 186.938 144.203
 c 186.938 141.871 185.863 139.785 184.184 138.406 c 180.906 135.637 l 180.254
 135.148 179.445 134.859 178.566 134.859 c 178.289 134.859 178.02 134.887
 177.766 134.949 c 176.102 133.312 l 175.574 132.809 174.871 132.504 174.098
 132.504 c h
179.387 139.199 m 182.168 139.199 184.402 141.426 184.402 144.203 c 184.402
 146.977 182.168 149.199 179.387 149.199 c 176.594 149.199 174.367 146.977
 174.367 144.203 c 174.367 141.426 176.594 139.199 179.387 139.199 c h
160.738 139.223 m 163.531 139.223 165.758 141.441 165.758 144.219 c 165.758
 147 163.531 149.219 160.738 149.219 c 157.957 149.219 155.723 147 155.723
 144.219 c 155.723 141.441 157.957 139.223 160.738 139.223 c h
170.004 140.086 m 171.098 140.086 171.984 140.961 171.984 142.059 c 171.984
 143.145 171.098 144.023 170.004 144.023 c 168.906 144.031 168.023 143.145
 168.023 142.059 c 168.023 140.961 168.906 140.086 170.004 140.086 c h
157.777 142.156 m 156.871 143.438 156.496 145.336 158.297 147.066 c 160.109
 148.621 162.414 147.984 163.582 146.648 c 161.797 146.953 160.461 146.672
 159.434 145.844 c 158.34 144.953 157.785 143.805 157.777 142.156 c h
176.422 142.176 m 175.516 143.461 175.148 145.352 176.941 147.09 c 178.754
 148.641 181.066 148.004 182.227 146.672 c 180.449 146.977 179.113 146.691
 178.078 145.867 c 176.992 144.977 176.43 143.828 176.422 142.176 c h
176.422 142.176 m f
0.137255 0.266667 0.364706 rg
0.75 w
q 1 0 0 1 0 0 cm
23.25 53.281 m 23.266 114.531 l S Q
23.266 118.469 m 20.641 113.219 l 23.266 114.531 l 25.891 113.219 l h
23.266 118.469 m f
q 1 0 0 1 0 0 cm
23.266 118.469 m 20.641 113.219 l 23.266 114.531 l 25.891 113.219 l h
23.266 118.469 m S Q
1 g
49.5 130.5 m 49.5 153.75 l 27 166.5 l 4.5 153.75 l 4.5 130.5 l 27 117.75
 l h
49.5 130.5 m f
0 0.313726 0.45098 rg
3 w
q 0 1 -1 0 0 0 cm
130.5 -49.5 m 153.75 -49.5 l 166.5 -27 l 153.75 -4.5 l 130.5 -4.5 l 117.75
 -27 l h
130.5 -49.5 m S Q
32.641 140.836 m 32.641 136.395 l 33.766 136.395 l 33.766 140.836 l h
30.203 140.836 m 30.203 138.613 l 31.336 138.613 l 31.336 140.836 l h
27.809 140.836 m 27.809 137.461 l 28.926 137.461 l 28.926 140.836 l h
30.699 144.129 m 34.281 144.129 36.711 141.621 36.711 138.797 c 36.711 
135.887 34.477 133.441 30.684 133.441 c 27.871 133.441 24.855 135.422 24.855
 138.727 c 24.855 141.961 27.781 144.129 30.699 144.129 c h
18.48 152.102 m 17.609 152.82 16.5 153 15.613 152.211 c 14.812 151.41 15.121
 150.422 15.684 149.918 c 19.719 146.102 l 20.422 145.434 21.645 144.578
 22.883 144.059 c 23.484 143.762 23.879 143.414 23.496 142.637 c 22.906 
141.504 22.441 140.445 22.441 138.449 c 22.441 134.594 26.227 131.25 30.742
 131.25 c 36.211 131.25 39.188 135.48 39.188 138.855 c 39.188 142.656 35.543
 146.316 30.996 146.316 c 29.852 146.316 28.434 145.949 27.441 145.613 c
 26.469 145.297 25.363 145.266 24.562 146.332 c 24.082 146.863 23.535 147.891
 22.059 149.168 c h
18.48 152.102 m f
0.137255 0.266667 0.364706 rg
0.75 w
q 1 0 0 1 0 0 cm
30.238 118.281 m 30.531 57.652 l S Q
30.547 53.715 m 33.148 58.973 l 30.531 57.652 l 27.898 58.949 l h
30.547 53.715 m f
q 1 0 0 1 0 0 cm
30.547 53.715 m 33.148 58.973 l 30.531 57.652 l 27.898 58.949 l h
30.547 53.715 m S Q
q 1 0 0 1 0 0 cm
44.527 43.852 m 76.23 69.051 l S Q
79.312 71.496 m 73.566 70.289 l 76.23 69.051 l 76.836 66.18 l h
79.312 71.496 m f
q 1 0 0 1 0 0 cm
79.312 71.496 m 73.566 70.289 l 76.23 69.051 l 76.836 66.18 l h
79.312 71.496 m S Q
q 1 0 0 1 0 0 cm
151.883 128.055 m 119.836 103.246 l S Q
116.723 100.836 m 122.477 101.969 l 119.836 103.246 l 119.266 106.125 l
 h
116.723 100.836 m f
q 1 0 0 1 0 0 cm
116.723 100.836 m 122.477 101.969 l 119.836 103.246 l 119.266 106.125 l
 h
116.723 100.836 m S Q
1 g
49.5 18 m 49.5 41.25 l 27 54 l 4.5 41.25 l 4.5 18 l 27 5.25 l h
49.5 18 m f
0 0.313726 0.45098 rg
3 w
q 0 1 -1 0 0 0 cm
18 -49.5 m 41.25 -49.5 l 54 -27 l 41.25 -4.5 l 18 -4.5 l 5.25 -27 l h
18 -49.5 m S Q
1 g
112.516 67.738 m 112.516 70.133 110.645 72.074 108.336 72.074 c 106.027
 72.074 104.156 70.133 104.156 67.738 c 104.156 65.344 106.027 63.402 108.336
 63.402 c 110.645 63.402 112.516 65.344 112.516 67.738 c h
112.516 67.738 m f
101.523 60.797 m 117.508 70.191 l 114.961 74.523 l 98.977 65.129 l h
101.523 60.797 m f
0 0.313726 0.45098 rg
108.309 69.094 m 107.215 69.086 106.812 68.207 106.816 67.66 c 106.82 66.676
 107.613 66.191 108.316 66.195 c 108.902 66.199 109.703 66.715 109.695 67.676
 c 109.691 68.305 109.164 69.098 108.309 69.094 c h
108.297 71.523 m 110.344 71.531 112.078 69.809 112.09 67.688 c 112.102 
65.227 110.086 63.777 108.336 63.766 c 106.141 63.754 104.398 65.457 104.387
 67.645 c 104.375 69.812 106.066 71.512 108.297 71.523 c h
100.355 71.352 m 99.613 68.535 l 101.902 67.625 l 101.898 67.176 101.977
 66.59 102.105 66.09 c 100.113 64.637 l 101.535 62.164 l 103.734 63.121 
l 104.121 62.746 104.535 62.402 105.008 62.121 c 104.668 59.742 l 107.477
 59.031 l 108.328 61.277 l 108.859 61.281 109.387 61.328 109.895 61.48 c
 111.309 59.559 l 113.773 60.984 l 112.816 63.137 l 113.199 63.551 113.535
 63.98 113.809 64.441 c 116.129 64.109 l 116.871 66.895 l 114.684 67.746
 l 114.672 68.293 114.609 68.824 114.457 69.344 c 116.309 70.73 l 114.895
 73.215 l 112.746 72.258 l 112.371 72.66 111.949 72.938 111.527 73.195 c
 111.891 75.547 l 109.082 76.289 l 108.207 74.07 l 107.668 74.074 107.113
 74.004 106.617 73.867 c 105.207 75.809 l 102.73 74.387 l 103.688 72.172
 l 103.344 71.809 103.023 71.418 102.758 70.961 c h
100.355 71.352 m f
1 g
30.75 3.473 m 46.828 12.75 l 42.723 19.859 l 26.645 10.582 l h
30.75 3.473 m f
0 0.313726 0.45098 rg
46.004 9.391 m 44.039 9.742 41.184 10.035 38.723 10.035 c 36.512 10.059
 33.734 9.832 31.266 9.414 c 31.305 10.664 31.703 11.73 32.379 12.652 c 
32.984 16.98 36.082 19.125 38.496 19.125 c 41.594 19.125 44.297 16.719 44.887
 12.637 c 45.512 11.828 46.004 10.574 46.004 9.391 c h
35.379 11.062 m 35.297 11.324 35.332 11.594 35.566 11.82 c 35.863 12.113
 36.227 12.105 36.512 11.871 c 36.703 11.715 36.84 11.477 36.773 11.191 
c 36.898 11.227 36.988 11.289 37.051 11.363 c 37.156 11.469 37.141 11.594
 37.109 11.762 c 37.059 12.016 36.797 12.391 36.383 12.457 c 35.656 12.586
 35.34 12.285 35.055 12.039 c 34.883 11.852 34.711 11.578 34.762 11.316 
c 34.785 11.145 35.152 11.086 35.379 11.062 c h
41.879 11.055 m 42.172 11.086 42.391 11.137 42.512 11.273 c 42.578 11.535
 42.449 11.797 42.164 12.082 c 41.723 12.465 41.43 12.562 40.859 12.457 
c 40.598 12.398 40.266 12.164 40.172 11.797 c 40.141 11.691 40.094 11.496
 40.184 11.398 c 40.281 11.297 40.363 11.227 40.492 11.199 c 40.449 11.438
 40.516 11.648 40.738 11.863 c 40.973 12.066 41.379 12.148 41.676 11.844
 c 41.863 11.664 42.016 11.348 41.879 11.055 c h
33.465 12.383 m 33.988 12.914 34.762 13.402 35.594 13.711 c 36.352 14.012
 36.984 14.055 37.582 13.547 c 37.883 13.305 38.078 13.078 38.309 12.848
 c 38.504 12.645 38.664 12.629 38.871 12.816 c 39.164 13.102 39.422 13.363
 39.66 13.539 c 40.344 14.094 40.898 14.004 41.953 13.598 c 42.652 13.312
 43.395 12.789 43.816 12.383 c 43.621 13.875 43.176 15.031 42.156 16.273
 c 41.309 17.25 40.148 17.984 38.594 17.984 c 37.184 17.984 35.934 17.242
 35.016 16.184 c 34.184 15.148 33.668 13.973 33.465 12.383 c h
37.836 15.059 m 37.461 15.254 37.176 15.434 37.176 15.758 c 37.176 15.996
 37.41 16.074 37.793 16.117 c 38.301 16.164 38.812 16.156 39.324 16.125 
c 39.668 16.102 40.004 16.094 40.102 15.781 c 40.172 15.547 39.84 15.254
 39.586 15.137 c 39.031 14.852 38.324 14.863 37.836 15.059 c h
30.344 8.602 m 29.738 8.488 29.25 8.07 29.273 7.371 c 29.301 6.906 29.625
 6.449 30.383 6.324 c 31.094 6.188 32.047 6.039 32.949 5.934 c 33.172 4.809
 33.391 3.637 33.523 2.227 c 33.516 1.547 33.652 0.988 34.305 0.637 c 34.719
 0.434 35.398 0.398 36.09 0.637 c 37.469 1.199 39.637 1.254 41.258 0.637
 c 41.762 0.465 42.328 0.375 42.906 0.621 c 43.531 0.914 43.754 1.449 43.734
 1.988 c 43.828 3.465 44.062 4.859 44.301 5.934 c 45.246 6.066 46.23 6.172
 47.07 6.359 c 47.691 6.516 48 6.945 48 7.434 c 48 8.062 47.566 8.414 47.191
 8.527 c 45.234 8.953 42.523 9.426 38.672 9.426 c 35.773 9.426 32.961 9.129
 30.344 8.602 c h
30.344 8.602 m f
Q Q
showpage
%%Trailer
end
%%EOF
