%!PS-Adobe-3.0 EPSF-3.0
%%Creator: cairo 1.17.4 (https://cairographics.org)
%%CreationDate: Thu Jul  8 09:33:12 2021
%%Pages: 1
%%DocumentData: Clean7Bit
%%LanguageLevel: 2
%%BoundingBox: 0 0 48 52
%%EndComments
%%BeginProlog
50 dict begin
/q { gsave } bind def
/Q { grestore } bind def
/cm { 6 array astore concat } bind def
/w { setlinewidth } bind def
/J { setlinecap } bind def
/j { setlinejoin } bind def
/M { setmiterlimit } bind def
/d { setdash } bind def
/m { moveto } bind def
/l { lineto } bind def
/c { curveto } bind def
/h { closepath } bind def
/re { exch dup neg 3 1 roll 5 3 roll moveto 0 rlineto
      0 exch rlineto 0 rlineto closepath } bind def
/S { stroke } bind def
/f { fill } bind def
/f* { eofill } bind def
/n { newpath } bind def
/W { clip } bind def
/W* { eoclip } bind def
/BT { } bind def
/ET { } bind def
/BDC { mark 3 1 roll /BDC pdfmark } bind def
/EMC { mark /EMC pdfmark } bind def
/cairo_store_point { /cairo_point_y exch def /cairo_point_x exch def } def
/Tj { show currentpoint cairo_store_point } bind def
/TJ {
  {
    dup
    type /stringtype eq
    { show } { -0.001 mul 0 cairo_font_matrix dtransform rmoveto } ifelse
  } forall
  currentpoint cairo_store_point
} bind def
/cairo_selectfont { cairo_font_matrix aload pop pop pop 0 0 6 array astore
    cairo_font exch selectfont cairo_point_x cairo_point_y moveto } bind def
/Tf { pop /cairo_font exch def /cairo_font_matrix where
      { pop cairo_selectfont } if } bind def
/Td { matrix translate cairo_font_matrix matrix concatmatrix dup
      /cairo_font_matrix exch def dup 4 get exch 5 get cairo_store_point
      /cairo_font where { pop cairo_selectfont } if } bind def
/Tm { 2 copy 8 2 roll 6 array astore /cairo_font_matrix exch def
      cairo_store_point /cairo_font where { pop cairo_selectfont } if } bind def
/g { setgray } bind def
/rg { setrgbcolor } bind def
/d1 { setcachedevice } bind def
/cairo_data_source {
  CairoDataIndex CairoData length lt
    { CairoData CairoDataIndex get /CairoDataIndex CairoDataIndex 1 add def }
    { () } ifelse
} def
/cairo_flush_ascii85_file { cairo_ascii85_file status { cairo_ascii85_file flushfile } if } def
/cairo_image { image cairo_flush_ascii85_file } def
/cairo_imagemask { imagemask cairo_flush_ascii85_file } def
%%EndProlog
%%BeginSetup
%%EndSetup
%%Page: 1 1
%%BeginPageSetup
%%PageBoundingBox: 0 0 48 52
%%EndPageSetup
q 0 0 48 52 rectclip
1 0 0 -1 0 52 cm q
1 g
46.875 14.625 m 46.875 37.875 l 24.375 50.625 l 1.875 37.875 l 1.875 14.625
 l 24.375 1.875 l h
46.875 14.625 m f
0 0.313726 0.45098 rg
3 w
0 J
0 j
[] 0.0 d
10 M q 0 1 -1 0 0 0 cm
14.625 -46.875 m 37.875 -46.875 l 50.625 -24.375 l 37.875 -1.875 l 14.625
 -1.875 l 1.875 -24.375 l h
14.625 -46.875 m S Q
30.016 24.961 m 30.016 20.52 l 31.141 20.52 l 31.141 24.961 l h
27.578 24.961 m 27.578 22.738 l 28.711 22.738 l 28.711 24.961 l h
25.184 24.961 m 25.184 21.586 l 26.301 21.586 l 26.301 24.961 l h
28.074 28.254 m 31.656 28.254 34.086 25.746 34.086 22.922 c 34.086 20.012
 31.852 17.566 28.059 17.566 c 25.246 17.566 22.23 19.547 22.23 22.852 c
 22.23 26.086 25.156 28.254 28.074 28.254 c h
15.855 36.227 m 14.984 36.945 13.875 37.125 12.988 36.336 c 12.188 35.535
 12.496 34.547 13.059 34.043 c 17.094 30.227 l 17.797 29.559 19.02 28.703
 20.258 28.184 c 20.859 27.887 21.254 27.539 20.871 26.762 c 20.281 25.629
 19.816 24.57 19.816 22.574 c 19.816 18.719 23.602 15.375 28.117 15.375 
c 33.586 15.375 36.562 19.605 36.562 22.98 c 36.562 26.781 32.918 30.441
 28.371 30.441 c 27.227 30.441 25.809 30.074 24.816 29.738 c 23.844 29.422
 22.738 29.391 21.938 30.457 c 21.457 30.988 20.91 32.016 19.434 33.293 
c h
15.855 36.227 m f
Q Q
showpage
%%Trailer
end
%%EOF
