%!PS-Adobe-3.0 EPSF-3.0
%%Creator: cairo 1.17.4 (https://cairographics.org)
%%CreationDate: Fri Sep  3 13:54:33 2021
%%Pages: 1
%%DocumentData: Clean7Bit
%%LanguageLevel: 2
%%BoundingBox: 56 38 1409 763
%%EndComments
%%BeginProlog
50 dict begin
/q { gsave } bind def
/Q { grestore } bind def
/cm { 6 array astore concat } bind def
/w { setlinewidth } bind def
/J { setlinecap } bind def
/j { setlinejoin } bind def
/M { setmiterlimit } bind def
/d { setdash } bind def
/m { moveto } bind def
/l { lineto } bind def
/c { curveto } bind def
/h { closepath } bind def
/re { exch dup neg 3 1 roll 5 3 roll moveto 0 rlineto
      0 exch rlineto 0 rlineto closepath } bind def
/S { stroke } bind def
/f { fill } bind def
/f* { eofill } bind def
/n { newpath } bind def
/W { clip } bind def
/W* { eoclip } bind def
/BT { } bind def
/ET { } bind def
/BDC { mark 3 1 roll /BDC pdfmark } bind def
/EMC { mark /EMC pdfmark } bind def
/cairo_store_point { /cairo_point_y exch def /cairo_point_x exch def } def
/Tj { show currentpoint cairo_store_point } bind def
/TJ {
  {
    dup
    type /stringtype eq
    { show } { -0.001 mul 0 cairo_font_matrix dtransform rmoveto } ifelse
  } forall
  currentpoint cairo_store_point
} bind def
/cairo_selectfont { cairo_font_matrix aload pop pop pop 0 0 6 array astore
    cairo_font exch selectfont cairo_point_x cairo_point_y moveto } bind def
/Tf { pop /cairo_font exch def /cairo_font_matrix where
      { pop cairo_selectfont } if } bind def
/Td { matrix translate cairo_font_matrix matrix concatmatrix dup
      /cairo_font_matrix exch def dup 4 get exch 5 get cairo_store_point
      /cairo_font where { pop cairo_selectfont } if } bind def
/Tm { 2 copy 8 2 roll 6 array astore /cairo_font_matrix exch def
      cairo_store_point /cairo_font where { pop cairo_selectfont } if } bind def
/g { setgray } bind def
/rg { setrgbcolor } bind def
/d1 { setcachedevice } bind def
/cairo_data_source {
  CairoDataIndex CairoData length lt
    { CairoData CairoDataIndex get /CairoDataIndex CairoDataIndex 1 add def }
    { () } ifelse
} def
/cairo_flush_ascii85_file { cairo_ascii85_file status { cairo_ascii85_file flushfile } if } def
/cairo_image { image cairo_flush_ascii85_file } def
/cairo_imagemask { imagemask cairo_flush_ascii85_file } def
%%EndProlog
%%BeginSetup
%%EndSetup
%%Page: 1 1
%%BeginPageSetup
%%PageBoundingBox: 56 38 1409 763
%%EndPageSetup
q 56 38 1353 725 rectclip
1 0 0 -1 0 804 cm q
Q q
629.039 414.254 m 857.039 414.254 l 861.039 414.254 863.039 416.254 863.039
 420.254 c 863.039 541.754 l 863.039 545.754 861.039 547.754 857.039 547.754
 c 629.039 547.754 l 625.039 547.754 623.039 545.754 623.039 541.754 c 623.039
 420.254 l 623.039 416.254 625.039 414.254 629.039 414.254 c -6756.961 -7018.996
 m 8243.039 -7018.996 l 8243.039 7981.004 l -6756.961 7981.004 l W n
q
0 0 1446 804 re W n
  q
0.2 g
1.5 w
1 J
0 j
[] 0.0 d
4 M q 1 0 0 1 0 0 cm
723.742 481.004 m 705.484 342.367 659.844 273.047 586.816 273.047 c S Q
  Q
Q
Q q
0.137255 g
0.75 w
1 J
0 j
[] 0.0 d
4 M q 1 0 0 1 0 0 cm
427.066 273.047 m 417.316 273.047 l 417.316 227.859 l 417.316 223.859 415.316
 221.859 411.316 221.859 c 406.816 221.859 l S Q
q 1 0 0 1 0 0 cm
382.066 221.859 m 372.316 221.859 l 372.316 151.734 l 372.316 147.734 370.316
 145.734 366.316 145.734 c 361.816 145.734 l S Q
q 1 0 0 1 0 0 cm
315.316 145.734 m 305.566 145.734 l 305.566 140.109 l 305.566 136.109 303.566
 134.109 299.566 134.109 c 295.816 134.109 l S Q
q 1 0 0 1 0 0 cm
315.316 145.734 m 305.566 145.734 l 305.566 151.359 l 305.566 155.359 303.566
 157.359 299.566 157.359 c 295.816 157.359 l S Q
q 1 0 0 1 0 0 cm
382.066 221.859 m 372.316 221.859 l 372.316 180.234 l 372.316 176.234 370.316
 174.234 366.316 174.234 c 361.816 174.234 l S Q
q 1 0 0 1 0 0 cm
382.066 221.859 m 372.316 221.859 l 372.316 224.859 l 372.316 228.859 370.316
 230.859 366.316 230.859 c 361.816 230.859 l S Q
q 1 0 0 1 0 0 cm
314.566 230.859 m 304.816 230.859 l 304.816 213.609 l 304.816 209.609 302.816
 207.609 298.816 207.609 c 295.066 207.609 l S Q
q 1 0 0 1 0 0 cm
314.566 230.859 m 304.816 230.859 l 304.816 230.859 302.816 230.859 298.816
 230.859 c 295.066 230.859 l S Q
q 1 0 0 1 0 0 cm
314.566 230.859 m 304.816 230.859 l 304.816 248.109 l 304.816 252.109 302.816
 254.109 298.816 254.109 c 295.066 254.109 l S Q
q 1 0 0 1 0 0 cm
382.066 221.859 m 372.316 221.859 l 372.316 264.984 l 372.316 268.984 370.316
 270.984 366.316 270.984 c 361.816 270.984 l S Q
q 1 0 0 1 0 0 cm
382.066 221.859 m 372.316 221.859 l 372.316 291.984 l 372.316 295.984 370.316
 297.984 366.316 297.984 c 361.816 297.984 l S Q
q 1 0 0 1 0 0 cm
427.066 273.047 m 417.316 273.047 l 417.316 318.234 l 417.316 322.234 415.316
 324.234 411.316 324.234 c 406.816 324.234 l S Q
Q q
629.039 414.254 m 857.039 414.254 l 861.039 414.254 863.039 416.254 863.039
 420.254 c 863.039 541.754 l 863.039 545.754 861.039 547.754 857.039 547.754
 c 629.039 547.754 l 625.039 547.754 623.039 545.754 623.039 541.754 c 623.039
 420.254 l 623.039 416.254 625.039 414.254 629.039 414.254 c -6756.961 -7018.996
 m 8243.039 -7018.996 l 8243.039 7981.004 l -6756.961 7981.004 l W n
q
0 0 1446 804 re W n
  q
0.2 g
1.5 w
1 J
0 j
[] 0.0 d
4 M q 1 0 0 1 0 0 cm
762.336 481.004 m 785.883 342.367 844.75 273.047 938.938 273.047 c S Q
  Q
Q
Q q
0.137255 g
0.75 w
1 J
0 j
[] 0.0 d
4 M q 1 0 0 1 0 0 cm
1057.438 273.047 m 1067.188 273.047 l 1067.188 138.234 l 1067.188 134.234
 1069.188 132.234 1073.188 132.234 c 1077.688 132.234 l S Q
q 1 0 0 1 0 0 cm
1057.438 273.047 m 1067.188 273.047 l 1067.188 225.047 l 1067.188 221.047
 1069.188 219.047 1073.188 219.047 c 1077.688 219.047 l S Q
q 1 0 0 1 0 0 cm
1137.688 219.047 m 1147.438 219.047 l 1147.438 182.484 l 1147.438 178.484
 1149.438 176.484 1153.438 176.484 c 1157.938 176.484 l S Q
q 1 0 0 1 0 0 cm
1193.938 176.484 m 1203.688 176.484 l 1203.688 170.859 l 1203.688 166.859
 1205.688 164.859 1209.688 164.859 c 1213.438 164.859 l S Q
q 1 0 0 1 0 0 cm
1193.938 176.484 m 1203.688 176.484 l 1203.688 182.109 l 1203.688 186.109
 1205.688 188.109 1209.688 188.109 c 1213.438 188.109 l S Q
q 1 0 0 1 0 0 cm
1137.688 219.047 m 1147.438 219.047 l 1147.438 210.984 l 1147.438 206.984
 1149.438 204.984 1153.438 204.984 c 1157.938 204.984 l S Q
q 1 0 0 1 0 0 cm
1137.688 219.047 m 1147.438 219.047 l 1147.438 255.609 l 1147.438 259.609
 1149.438 261.609 1153.438 261.609 c 1157.938 261.609 l S Q
q 1 0 0 1 0 0 cm
1231.438 261.609 m 1241.188 261.609 l 1241.188 244.359 l 1241.188 240.359
 1243.188 238.359 1247.188 238.359 c 1250.938 238.359 l S Q
q 1 0 0 1 0 0 cm
1231.438 261.609 m 1241.188 261.609 l 1241.188 261.609 1243.188 261.609
 1247.188 261.609 c 1250.938 261.609 l S Q
q 1 0 0 1 0 0 cm
1231.438 261.609 m 1241.188 261.609 l 1241.188 278.859 l 1241.188 282.859
 1243.188 284.859 1247.188 284.859 c 1250.938 284.859 l S Q
q 1 0 0 1 0 0 cm
1057.438 273.047 m 1067.188 273.047 l 1067.188 407.859 l 1067.188 411.859
 1069.188 413.859 1073.188 413.859 c 1077.688 413.859 l S Q
q 1 0 0 1 0 0 cm
1148.188 413.859 m 1157.938 413.859 l 1157.938 336.609 l 1157.938 332.609
 1159.938 330.609 1163.938 330.609 c 1168.438 330.609 l S Q
q 1 0 0 1 0 0 cm
1239.688 330.609 m 1249.438 330.609 l 1249.438 313.359 l 1249.438 309.359
 1251.438 307.359 1255.438 307.359 c 1259.188 307.359 l S Q
q 1 0 0 1 0 0 cm
1239.688 330.609 m 1249.438 330.609 l 1249.438 330.609 1251.438 330.609
 1255.438 330.609 c 1259.188 330.609 l S Q
q 1 0 0 1 0 0 cm
1239.688 330.609 m 1249.438 330.609 l 1249.438 347.859 l 1249.438 351.859
 1251.438 353.859 1255.438 353.859 c 1259.188 353.859 l S Q
q 1 0 0 1 0 0 cm
1148.188 413.859 m 1157.938 413.859 l 1157.938 406.359 l 1157.938 402.359
 1159.938 400.359 1163.938 400.359 c 1168.438 400.359 l S Q
q 1 0 0 1 0 0 cm
1239.688 400.359 m 1249.438 400.359 l 1249.438 383.109 l 1249.438 379.109
 1251.438 377.109 1255.438 377.109 c 1259.188 377.109 l S Q
q 1 0 0 1 0 0 cm
1239.688 400.359 m 1249.438 400.359 l 1249.438 400.359 1251.438 400.359
 1255.438 400.359 c 1259.188 400.359 l S Q
q 1 0 0 1 0 0 cm
1239.688 400.359 m 1249.438 400.359 l 1249.438 417.609 l 1249.438 421.609
 1251.438 423.609 1255.438 423.609 c 1259.188 423.609 l S Q
q 1 0 0 1 0 0 cm
1148.188 413.859 m 1157.938 413.859 l 1157.938 434.484 l 1157.938 438.484
 1159.938 440.484 1163.938 440.484 c 1168.438 440.484 l S Q
q 1 0 0 1 0 0 cm
1148.188 413.859 m 1157.938 413.859 l 1157.938 491.109 l 1157.938 495.109
 1159.938 497.109 1163.938 497.109 c 1168.438 497.109 l S Q
q 1 0 0 1 0 0 cm
1248.688 497.109 m 1258.438 497.109 l 1258.438 479.859 l 1258.438 475.859
 1260.438 473.859 1264.438 473.859 c 1268.188 473.859 l S Q
q 1 0 0 1 0 0 cm
1248.688 497.109 m 1258.438 497.109 l 1258.438 497.109 1260.438 497.109
 1264.438 497.109 c 1268.188 497.109 l S Q
q 1 0 0 1 0 0 cm
1248.688 497.109 m 1258.438 497.109 l 1258.438 514.359 l 1258.438 518.359
 1260.438 520.359 1264.438 520.359 c 1268.188 520.359 l S Q
Q q
629.039 414.254 m 857.039 414.254 l 861.039 414.254 863.039 416.254 863.039
 420.254 c 863.039 541.754 l 863.039 545.754 861.039 547.754 857.039 547.754
 c 629.039 547.754 l 625.039 547.754 623.039 545.754 623.039 541.754 c 623.039
 420.254 l 623.039 416.254 625.039 414.254 629.039 414.254 c -6756.961 -7018.996
 m 8243.039 -7018.996 l 8243.039 7981.004 l -6756.961 7981.004 l W n
q
0 0 1446 804 re W n
  q
0.2 g
1.5 w
1 J
0 j
[] 0.0 d
4 M q 1 0 0 1 0 0 cm
761.102 481.004 m 784.914 627.648 844.441 700.969 939.688 700.969 c S Q
  Q
Q
Q q
0.137255 g
0.75 w
1 J
0 j
[] 0.0 d
4 M q 1 0 0 1 0 0 cm
1045.438 700.969 m 1055.188 700.969 l 1055.188 652.781 l 1055.188 648.781
 1057.188 646.781 1061.188 646.781 c 1065.688 646.781 l S Q
q 1 0 0 1 0 0 cm
1120.438 646.781 m 1130.188 646.781 l 1130.188 572.156 l 1130.188 568.156
 1132.188 566.156 1136.188 566.156 c 1140.688 566.156 l S Q
q 1 0 0 1 0 0 cm
1120.438 646.781 m 1130.188 646.781 l 1130.188 628.781 l 1130.188 624.781
 1132.188 622.781 1136.188 622.781 c 1140.688 622.781 l S Q
q 1 0 0 1 0 0 cm
1175.938 622.781 m 1185.688 622.781 l 1185.688 605.531 l 1185.688 601.531
 1187.688 599.531 1191.688 599.531 c 1195.438 599.531 l S Q
q 1 0 0 1 0 0 cm
1175.938 622.781 m 1185.688 622.781 l 1185.688 622.781 1187.688 622.781
 1191.688 622.781 c 1195.438 622.781 l S Q
q 1 0 0 1 0 0 cm
1175.938 622.781 m 1185.688 622.781 l 1185.688 640.031 l 1185.688 644.031
 1187.688 646.031 1191.688 646.031 c 1195.438 646.031 l S Q
q 1 0 0 1 0 0 cm
1120.438 646.781 m 1130.188 646.781 l 1130.188 674.906 l 1130.188 678.906
 1132.188 680.906 1136.188 680.906 c 1140.688 680.906 l S Q
q 1 0 0 1 0 0 cm
1183.438 680.906 m 1193.188 680.906 l 1193.188 675.281 l 1193.188 671.281
 1195.188 669.281 1199.188 669.281 c 1202.938 669.281 l S Q
q 1 0 0 1 0 0 cm
1183.438 680.906 m 1193.188 680.906 l 1193.188 686.531 l 1193.188 690.531
 1195.188 692.531 1199.188 692.531 c 1202.938 692.531 l S Q
q 1 0 0 1 0 0 cm
1120.438 646.781 m 1130.188 646.781 l 1130.188 721.406 l 1130.188 725.406
 1132.188 727.406 1136.188 727.406 c 1140.688 727.406 l S Q
q 1 0 0 1 0 0 cm
1178.938 727.406 m 1188.688 727.406 l 1188.688 721.781 l 1188.688 717.781
 1190.688 715.781 1194.688 715.781 c 1198.438 715.781 l S Q
q 1 0 0 1 0 0 cm
1178.938 727.406 m 1188.688 727.406 l 1188.688 733.031 l 1188.688 737.031
 1190.688 739.031 1194.688 739.031 c 1198.438 739.031 l S Q
q 1 0 0 1 0 0 cm
1045.438 700.969 m 1055.188 700.969 l 1055.188 749.156 l 1055.188 753.156
 1057.188 755.156 1061.188 755.156 c 1065.688 755.156 l S Q
Q q
629.039 414.254 m 857.039 414.254 l 861.039 414.254 863.039 416.254 863.039
 420.254 c 863.039 541.754 l 863.039 545.754 861.039 547.754 857.039 547.754
 c 629.039 547.754 l 625.039 547.754 623.039 545.754 623.039 541.754 c 623.039
 420.254 l 623.039 416.254 625.039 414.254 629.039 414.254 c -6756.961 -7018.996
 m 8243.039 -7018.996 l 8243.039 7981.004 l -6756.961 7981.004 l W n
q
0 0 1446 804 re W n
  q
0.2 g
1.5 w
1 J
0 j
[] 0.0 d
4 M q 1 0 0 1 0 0 cm
724.977 481.004 m 706.855 627.648 661.551 700.969 589.066 700.969 c S Q
  Q
Q
Q q
0.137255 g
0.75 w
1 J
0 j
[] 0.0 d
4 M q 1 0 0 1 0 0 cm
394.816 700.969 m 385.066 700.969 l 385.066 656.156 l 385.066 652.156 383.066
 650.156 379.066 650.156 c 374.566 650.156 l S Q
q 1 0 0 1 0 0 cm
321.316 650.156 m 311.566 650.156 l 311.566 607.031 l 311.566 603.031 309.566
 601.031 305.566 601.031 c 301.066 601.031 l S Q
q 1 0 0 1 0 0 cm
234.316 601.031 m 224.566 601.031 l 224.566 595.406 l 224.566 591.406 222.566
 589.406 218.566 589.406 c 214.816 589.406 l S Q
q 1 0 0 1 0 0 cm
234.316 601.031 m 224.566 601.031 l 224.566 606.656 l 224.566 610.656 222.566
 612.656 218.566 612.656 c 214.816 612.656 l S Q
q 1 0 0 1 0 0 cm
321.316 650.156 m 311.566 650.156 l 311.566 653.156 l 311.566 657.156 309.566
 659.156 305.566 659.156 c 301.066 659.156 l S Q
q 1 0 0 1 0 0 cm
262.066 659.156 m 252.316 659.156 l 252.316 641.906 l 252.316 637.906 250.316
 635.906 246.316 635.906 c 242.566 635.906 l S Q
q 1 0 0 1 0 0 cm
262.066 659.156 m 252.316 659.156 l 252.316 659.156 250.316 659.156 246.316
 659.156 c 242.566 659.156 l S Q
q 1 0 0 1 0 0 cm
262.066 659.156 m 252.316 659.156 l 252.316 676.406 l 252.316 680.406 250.316
 682.406 246.316 682.406 c 242.566 682.406 l S Q
q 1 0 0 1 0 0 cm
321.316 650.156 m 311.566 650.156 l 311.566 693.281 l 311.566 697.281 309.566
 699.281 305.566 699.281 c 301.066 699.281 l S Q
q 1 0 0 1 0 0 cm
394.816 700.969 m 385.066 700.969 l 385.066 719.531 l 385.066 723.531 383.066
 725.531 379.066 725.531 c 374.566 725.531 l S Q
q 1 0 0 1 0 0 cm
394.816 700.969 m 385.066 700.969 l 385.066 745.781 l 385.066 749.781 383.066
 751.781 379.066 751.781 c 374.566 751.781 l S Q
0 0.313726 0.45098 rg
629.039 414.254 m 857.039 414.254 l 861.039 414.254 863.039 416.254 863.039
 420.254 c 863.039 541.754 l 863.039 545.754 861.039 547.754 857.039 547.754
 c 629.039 547.754 l 625.039 547.754 623.039 545.754 623.039 541.754 c 623.039
 420.254 l 623.039 416.254 625.039 414.254 629.039 414.254 c f
0 0.537255 0.8 rg
433.441 257.297 m 581.566 257.297 l 585.566 257.297 587.566 259.297 587.566
 263.297 c 587.566 283.172 l 587.566 287.172 585.566 289.172 581.566 289.172
 c 433.441 289.172 l 429.441 289.172 427.441 287.172 427.441 283.172 c 427.441
 263.297 l 427.441 259.297 429.441 257.297 433.441 257.297 c f
0.2 g
0 J
q 1 0 0 1 0 0 cm
433.441 257.297 m 581.566 257.297 l 585.566 257.297 587.566 259.297 587.566
 263.297 c 587.566 283.172 l 587.566 287.172 585.566 289.172 581.566 289.172
 c 433.441 289.172 l 429.441 289.172 427.441 287.172 427.441 283.172 c 427.441
 263.297 l 427.441 259.297 429.441 257.297 433.441 257.297 c S Q
0 0.537255 0.8 rg
388.066 211.359 m 401.566 211.359 l 405.566 211.359 407.566 213.359 407.566
 217.359 c 407.566 226.359 l 407.566 230.359 405.566 232.359 401.566 232.359
 c 388.066 232.359 l 384.066 232.359 382.066 230.359 382.066 226.359 c 382.066
 217.359 l 382.066 213.359 384.066 211.359 388.066 211.359 c f
321.316 135.234 m 356.566 135.234 l 360.566 135.234 362.566 137.234 362.566
 141.234 c 362.566 150.234 l 362.566 154.234 360.566 156.234 356.566 156.234
 c 321.316 156.234 l 317.316 156.234 315.316 154.234 315.316 150.234 c 315.316
 141.234 l 315.316 137.234 317.316 135.234 321.316 135.234 c f
0.137255 g
q 1 0 0 1 0 0 cm
207.316 134.109 m 295.816 134.109 l h
207.316 134.109 m S Q
q 1 0 0 1 0 0 cm
133.816 157.359 m 295.816 157.359 l h
133.816 157.359 m S Q
0 0.537255 0.8 rg
310.066 163.734 m 356.566 163.734 l 360.566 163.734 362.566 165.734 362.566
 169.734 c 362.566 178.734 l 362.566 182.734 360.566 184.734 356.566 184.734
 c 310.066 184.734 l 306.066 184.734 304.066 182.734 304.066 178.734 c 304.066
 169.734 l 304.066 165.734 306.066 163.734 310.066 163.734 c f
320.566 220.359 m 356.566 220.359 l 360.566 220.359 362.566 222.359 362.566
 226.359 c 362.566 235.359 l 362.566 239.359 360.566 241.359 356.566 241.359
 c 320.566 241.359 l 316.566 241.359 314.566 239.359 314.566 235.359 c 314.566
 226.359 l 314.566 222.359 316.566 220.359 320.566 220.359 c f
0.137255 g
q 1 0 0 1 0 0 cm
211.816 207.609 m 295.066 207.609 l h
211.816 207.609 m S Q
q 1 0 0 1 0 0 cm
211.816 230.859 m 295.066 230.859 l h
211.816 230.859 m S Q
q 1 0 0 1 0 0 cm
178.066 254.109 m 295.066 254.109 l h
178.066 254.109 m S Q
0 0.537255 0.8 rg
294.316 260.484 m 356.566 260.484 l 360.566 260.484 362.566 262.484 362.566
 266.484 c 362.566 275.484 l 362.566 279.484 360.566 281.484 356.566 281.484
 c 294.316 281.484 l 290.316 281.484 288.316 279.484 288.316 275.484 c 288.316
 266.484 l 288.316 262.484 290.316 260.484 294.316 260.484 c f
320.566 287.484 m 356.566 287.484 l 360.566 287.484 362.566 289.484 362.566
 293.484 c 362.566 302.484 l 362.566 306.484 360.566 308.484 356.566 308.484
 c 320.566 308.484 l 316.566 308.484 314.566 306.484 314.566 302.484 c 314.566
 293.484 l 314.566 289.484 316.566 287.484 320.566 287.484 c f
311.566 313.734 m 401.566 313.734 l 405.566 313.734 407.566 315.734 407.566
 319.734 c 407.566 328.734 l 407.566 332.734 405.566 334.734 401.566 334.734
 c 311.566 334.734 l 307.566 334.734 305.566 332.734 305.566 328.734 c 305.566
 319.734 l 305.566 315.734 307.566 313.734 311.566 313.734 c f
944.562 257.297 m 1051.438 257.297 l 1055.438 257.297 1057.438 259.297 
1057.438 263.297 c 1057.438 283.172 l 1057.438 287.172 1055.438 289.172 
1051.438 289.172 c 944.562 289.172 l 940.562 289.172 938.562 287.172 938.562
 283.172 c 938.562 263.297 l 938.562 259.297 940.562 257.297 944.562 257.297
 c f
0.2 g
q 1 0 0 1 0 0 cm
944.562 257.297 m 1051.438 257.297 l 1055.438 257.297 1057.438 259.297 
1057.438 263.297 c 1057.438 283.172 l 1057.438 287.172 1055.438 289.172 
1051.438 289.172 c 944.562 289.172 l 940.562 289.172 938.562 287.172 938.562
 283.172 c 938.562 263.297 l 938.562 259.297 940.562 257.297 944.562 257.297
 c S Q
0 0.537255 0.8 rg
1082.938 121.734 m 1150.438 121.734 l 1154.438 121.734 1156.438 123.734
 1156.438 127.734 c 1156.438 136.734 l 1156.438 140.734 1154.438 142.734
 1150.438 142.734 c 1082.938 142.734 l 1078.938 142.734 1076.938 140.734
 1076.938 136.734 c 1076.938 127.734 l 1076.938 123.734 1078.938 121.734
 1082.938 121.734 c f
1082.938 208.547 m 1131.688 208.547 l 1135.688 208.547 1137.688 210.547
 1137.688 214.547 c 1137.688 223.547 l 1137.688 227.547 1135.688 229.547
 1131.688 229.547 c 1082.938 229.547 l 1078.938 229.547 1076.938 227.547
 1076.938 223.547 c 1076.938 214.547 l 1076.938 210.547 1078.938 208.547
 1082.938 208.547 c f
1163.188 165.984 m 1187.938 165.984 l 1191.938 165.984 1193.938 167.984
 1193.938 171.984 c 1193.938 180.984 l 1193.938 184.984 1191.938 186.984
 1187.938 186.984 c 1163.188 186.984 l 1159.188 186.984 1157.188 184.984
 1157.188 180.984 c 1157.188 171.984 l 1157.188 167.984 1159.188 165.984
 1163.188 165.984 c f
0.137255 g
q 1 0 0 1 0 0 cm
1213.438 164.859 m 1329.688 164.859 l h
1213.438 164.859 m S Q
q 1 0 0 1 0 0 cm
1213.438 188.109 m 1337.188 188.109 l h
1213.438 188.109 m S Q
0 0.537255 0.8 rg
1163.188 194.484 m 1211.938 194.484 l 1215.938 194.484 1217.938 196.484
 1217.938 200.484 c 1217.938 209.484 l 1217.938 213.484 1215.938 215.484
 1211.938 215.484 c 1163.188 215.484 l 1159.188 215.484 1157.188 213.484
 1157.188 209.484 c 1157.188 200.484 l 1157.188 196.484 1159.188 194.484
 1163.188 194.484 c f
1163.188 251.109 m 1225.438 251.109 l 1229.438 251.109 1231.438 253.109
 1231.438 257.109 c 1231.438 266.109 l 1231.438 270.109 1229.438 272.109
 1225.438 272.109 c 1163.188 272.109 l 1159.188 272.109 1157.188 270.109
 1157.188 266.109 c 1157.188 257.109 l 1157.188 253.109 1159.188 251.109
 1163.188 251.109 c f
0.137255 g
q 1 0 0 1 0 0 cm
1250.938 238.359 m 1321.438 238.359 l h
1250.938 238.359 m S Q
q 1 0 0 1 0 0 cm
1250.938 261.609 m 1374.688 261.609 l h
1250.938 261.609 m S Q
q 1 0 0 1 0 0 cm
1250.938 284.859 m 1378.438 284.859 l h
1250.938 284.859 m S Q
0 0.537255 0.8 rg
1082.938 403.359 m 1142.188 403.359 l 1146.188 403.359 1148.188 405.359
 1148.188 409.359 c 1148.188 418.359 l 1148.188 422.359 1146.188 424.359
 1142.188 424.359 c 1082.938 424.359 l 1078.938 424.359 1076.938 422.359
 1076.938 418.359 c 1076.938 409.359 l 1076.938 405.359 1078.938 403.359
 1082.938 403.359 c f
1173.688 320.109 m 1233.688 320.109 l 1237.688 320.109 1239.688 322.109
 1239.688 326.109 c 1239.688 335.109 l 1239.688 339.109 1237.688 341.109
 1233.688 341.109 c 1173.688 341.109 l 1169.688 341.109 1167.688 339.109
 1167.688 335.109 c 1167.688 326.109 l 1167.688 322.109 1169.688 320.109
 1173.688 320.109 c f
0.137255 g
q 1 0 0 1 0 0 cm
1259.188 307.359 m 1285.438 307.359 l h
1259.188 307.359 m S Q
q 1 0 0 1 0 0 cm
1259.188 330.609 m 1363.438 330.609 l h
1259.188 330.609 m S Q
q 1 0 0 1 0 0 cm
1259.188 353.859 m 1379.938 353.859 l h
1259.188 353.859 m S Q
0 0.537255 0.8 rg
1173.688 389.859 m 1233.688 389.859 l 1237.688 389.859 1239.688 391.859
 1239.688 395.859 c 1239.688 404.859 l 1239.688 408.859 1237.688 410.859
 1233.688 410.859 c 1173.688 410.859 l 1169.688 410.859 1167.688 408.859
 1167.688 404.859 c 1167.688 395.859 l 1167.688 391.859 1169.688 389.859
 1173.688 389.859 c f
0.137255 g
q 1 0 0 1 0 0 cm
1259.188 377.109 m 1371.688 377.109 l h
1259.188 377.109 m S Q
q 1 0 0 1 0 0 cm
1259.188 400.359 m 1342.438 400.359 l h
1259.188 400.359 m S Q
q 1 0 0 1 0 0 cm
1259.188 423.609 m 1408.438 423.609 l h
1259.188 423.609 m S Q
0 0.537255 0.8 rg
1173.688 429.984 m 1223.938 429.984 l 1227.938 429.984 1229.938 431.984
 1229.938 435.984 c 1229.938 444.984 l 1229.938 448.984 1227.938 450.984
 1223.938 450.984 c 1173.688 450.984 l 1169.688 450.984 1167.688 448.984
 1167.688 444.984 c 1167.688 435.984 l 1167.688 431.984 1169.688 429.984
 1173.688 429.984 c f
1173.688 486.609 m 1242.688 486.609 l 1246.688 486.609 1248.688 488.609
 1248.688 492.609 c 1248.688 501.609 l 1248.688 505.609 1246.688 507.609
 1242.688 507.609 c 1173.688 507.609 l 1169.688 507.609 1167.688 505.609
 1167.688 501.609 c 1167.688 492.609 l 1167.688 488.609 1169.688 486.609
 1173.688 486.609 c f
0.137255 g
q 1 0 0 1 0 0 cm
1268.188 473.859 m 1385.188 473.859 l h
1268.188 473.859 m S Q
q 1 0 0 1 0 0 cm
1268.188 497.109 m 1364.188 497.109 l h
1268.188 497.109 m S Q
q 1 0 0 1 0 0 cm
1268.188 520.359 m 1316.938 520.359 l h
1268.188 520.359 m S Q
0 0.537255 0.8 rg
945.312 685.219 m 1039.438 685.219 l 1043.438 685.219 1045.438 687.219 
1045.438 691.219 c 1045.438 711.094 l 1045.438 715.094 1043.438 717.094 
1039.438 717.094 c 945.312 717.094 l 941.312 717.094 939.312 715.094 939.312
 711.094 c 939.312 691.219 l 939.312 687.219 941.312 685.219 945.312 685.219
 c f
0.2 g
q 1 0 0 1 0 0 cm
945.312 685.219 m 1039.438 685.219 l 1043.438 685.219 1045.438 687.219 
1045.438 691.219 c 1045.438 711.094 l 1045.438 715.094 1043.438 717.094 
1039.438 717.094 c 945.312 717.094 l 941.312 717.094 939.312 715.094 939.312
 711.094 c 939.312 691.219 l 939.312 687.219 941.312 685.219 945.312 685.219
 c S Q
0 0.537255 0.8 rg
1070.938 636.281 m 1114.438 636.281 l 1118.438 636.281 1120.438 638.281
 1120.438 642.281 c 1120.438 651.281 l 1120.438 655.281 1118.438 657.281
 1114.438 657.281 c 1070.938 657.281 l 1066.938 657.281 1064.938 655.281
 1064.938 651.281 c 1064.938 642.281 l 1064.938 638.281 1066.938 636.281
 1070.938 636.281 c f
1145.938 555.656 m 1172.188 555.656 l 1176.188 555.656 1178.188 557.656
 1178.188 561.656 c 1178.188 570.656 l 1178.188 574.656 1176.188 576.656
 1172.188 576.656 c 1145.938 576.656 l 1141.938 576.656 1139.938 574.656
 1139.938 570.656 c 1139.938 561.656 l 1139.938 557.656 1141.938 555.656
 1145.938 555.656 c f
1145.938 612.281 m 1169.938 612.281 l 1173.938 612.281 1175.938 614.281
 1175.938 618.281 c 1175.938 627.281 l 1175.938 631.281 1173.938 633.281
 1169.938 633.281 c 1145.938 633.281 l 1141.938 633.281 1139.938 631.281
 1139.938 627.281 c 1139.938 618.281 l 1139.938 614.281 1141.938 612.281
 1145.938 612.281 c f
0.137255 g
q 1 0 0 1 0 0 cm
1195.438 599.531 m 1328.938 599.531 l h
1195.438 599.531 m S Q
q 1 0 0 1 0 0 cm
1195.438 622.781 m 1288.438 622.781 l h
1195.438 622.781 m S Q
q 1 0 0 1 0 0 cm
1195.438 646.031 m 1283.938 646.031 l h
1195.438 646.031 m S Q
0 0.537255 0.8 rg
1145.938 670.406 m 1177.438 670.406 l 1181.438 670.406 1183.438 672.406
 1183.438 676.406 c 1183.438 685.406 l 1183.438 689.406 1181.438 691.406
 1177.438 691.406 c 1145.938 691.406 l 1141.938 691.406 1139.938 689.406
 1139.938 685.406 c 1139.938 676.406 l 1139.938 672.406 1141.938 670.406
 1145.938 670.406 c f
0.137255 g
q 1 0 0 1 0 0 cm
1202.938 669.281 m 1317.688 669.281 l h
1202.938 669.281 m S Q
q 1 0 0 1 0 0 cm
1202.938 692.531 m 1295.188 692.531 l h
1202.938 692.531 m S Q
0 0.537255 0.8 rg
1145.938 716.906 m 1172.938 716.906 l 1176.938 716.906 1178.938 718.906
 1178.938 722.906 c 1178.938 731.906 l 1178.938 735.906 1176.938 737.906
 1172.938 737.906 c 1145.938 737.906 l 1141.938 737.906 1139.938 735.906
 1139.938 731.906 c 1139.938 722.906 l 1139.938 718.906 1141.938 716.906
 1145.938 716.906 c f
0.137255 g
q 1 0 0 1 0 0 cm
1198.438 715.781 m 1348.438 715.781 l h
1198.438 715.781 m S Q
q 1 0 0 1 0 0 cm
1198.438 739.031 m 1396.438 739.031 l h
1198.438 739.031 m S Q
0 0.537255 0.8 rg
1070.938 744.656 m 1184.188 744.656 l 1188.188 744.656 1190.188 746.656
 1190.188 750.656 c 1190.188 759.656 l 1190.188 763.656 1188.188 765.656
 1184.188 765.656 c 1070.938 765.656 l 1066.938 765.656 1064.938 763.656
 1064.938 759.656 c 1064.938 750.656 l 1064.938 746.656 1066.938 744.656
 1070.938 744.656 c f
401.191 685.219 m 583.816 685.219 l 587.816 685.219 589.816 687.219 589.816
 691.219 c 589.816 711.094 l 589.816 715.094 587.816 717.094 583.816 717.094
 c 401.191 717.094 l 397.191 717.094 395.191 715.094 395.191 711.094 c 395.191
 691.219 l 395.191 687.219 397.191 685.219 401.191 685.219 c f
0.2 g
q 1 0 0 1 0 0 cm
401.191 685.219 m 583.816 685.219 l 587.816 685.219 589.816 687.219 589.816
 691.219 c 589.816 711.094 l 589.816 715.094 587.816 717.094 583.816 717.094
 c 401.191 717.094 l 397.191 717.094 395.191 715.094 395.191 711.094 c 395.191
 691.219 l 395.191 687.219 397.191 685.219 401.191 685.219 c S Q
0 0.537255 0.8 rg
327.316 639.656 m 369.316 639.656 l 373.316 639.656 375.316 641.656 375.316
 645.656 c 375.316 654.656 l 375.316 658.656 373.316 660.656 369.316 660.656
 c 327.316 660.656 l 323.316 660.656 321.316 658.656 321.316 654.656 c 321.316
 645.656 l 321.316 641.656 323.316 639.656 327.316 639.656 c f
240.316 590.531 m 295.816 590.531 l 299.816 590.531 301.816 592.531 301.816
 596.531 c 301.816 605.531 l 301.816 609.531 299.816 611.531 295.816 611.531
 c 240.316 611.531 l 236.316 611.531 234.316 609.531 234.316 605.531 c 234.316
 596.531 l 234.316 592.531 236.316 590.531 240.316 590.531 c f
0.137255 g
q 1 0 0 1 0 0 cm
187.066 589.406 m 214.816 589.406 l h
187.066 589.406 m S Q
q 1 0 0 1 0 0 cm
137.566 612.656 m 214.816 612.656 l h
137.566 612.656 m S Q
0 0.537255 0.8 rg
268.066 648.656 m 295.816 648.656 l 299.816 648.656 301.816 650.656 301.816
 654.656 c 301.816 663.656 l 301.816 667.656 299.816 669.656 295.816 669.656
 c 268.066 669.656 l 264.066 669.656 262.066 667.656 262.066 663.656 c 262.066
 654.656 l 262.066 650.656 264.066 648.656 268.066 648.656 c f
0.137255 g
q 1 0 0 1 0 0 cm
160.816 635.906 m 242.566 635.906 l h
160.816 635.906 m S Q
q 1 0 0 1 0 0 cm
138.316 659.156 m 242.566 659.156 l h
138.316 659.156 m S Q
q 1 0 0 1 0 0 cm
144.316 682.406 m 242.566 682.406 l h
144.316 682.406 m S Q
0 0.537255 0.8 rg
218.566 688.781 m 295.816 688.781 l 299.816 688.781 301.816 690.781 301.816
 694.781 c 301.816 703.781 l 301.816 707.781 299.816 709.781 295.816 709.781
 c 218.566 709.781 l 214.566 709.781 212.566 707.781 212.566 703.781 c 212.566
 694.781 l 212.566 690.781 214.566 688.781 218.566 688.781 c f
295.066 715.031 m 369.316 715.031 l 373.316 715.031 375.316 717.031 375.316
 721.031 c 375.316 730.031 l 375.316 734.031 373.316 736.031 369.316 736.031
 c 295.066 736.031 l 291.066 736.031 289.066 734.031 289.066 730.031 c 289.066
 721.031 l 289.066 717.031 291.066 715.031 295.066 715.031 c f
238.816 741.281 m 369.316 741.281 l 373.316 741.281 375.316 743.281 375.316
 747.281 c 375.316 756.281 l 375.316 760.281 373.316 762.281 369.316 762.281
 c 238.816 762.281 l 234.816 762.281 232.816 760.281 232.816 756.281 c 232.816
 747.281 l 232.816 743.281 234.816 741.281 238.816 741.281 c f
0.164706 0.478431 0.760784 rg
1.5 w
[ 6.75 2.25] 0 d
q 1 0 0 1 0 0 cm
332.297 244.035 m 327.051 254.43 349.082 237.973 338.191 253.168 c S Q
[ 6.75 2.25] 0 d
q 1 0 0 1 0 0 cm
301.07 175 m 113.109 179.297 57.77 286.957 279.332 273.93 c S Q
[ 6.75 2.25] 0 d
q 1 0 0 1 0 0 cm
312.605 152.934 m 3.672 238.07 170.27 279.945 279.332 273.898 c S Q
[ 6.75 2.25] 0 d
q 1 0 0 1 0 0 cm
999.492 292.531 m 1017.617 483.109 1029.852 520.125 997.531 676.039 c S Q
[ 6.75 2.25] 0 d
q 1 0 0 1 0 0 cm
1141.504 715.441 m 880.867 543.332 478.098 723.031 505.891 298.523 c S Q
[ 6.75 2.25] 0 d
q 1 0 0 1 0 0 cm
1141.059 715.57 m 925.672 575.961 706.602 688.809 599.176 694.938 c S Q
[ 6.75 2.25] 0 d
q 1 0 0 1 0 0 cm
1120.156 742.023 m 1021.395 561.348 434.266 746.402 503.605 298.434 c S Q
[ 6.75 2.25] 0 d
q 1 0 0 1 0 0 cm
1093.066 206.547 m 859.91 -1.586 639.918 4.969 367.965 132.047 c S Q
[ 6.75 2.25] 0 d
q 1 0 0 1 0 0 cm
1092.414 206.605 m 861.859 11.074 539.219 33.602 355.449 214.051 c S Q
[ 6.75 2.25] 0 d
q 1 0 0 1 0 0 cm
1092.367 401.801 m 913.859 293.551 545.438 152.082 371.562 146.566 c S Q
[ 6.75 2.25] 0 d
q 1 0 0 1 0 0 cm
1092.363 401.805 m 960.613 322.051 437.918 129.805 355.332 213.934 c S Q
[ 6.75 2.25] 0 d
q 1 0 0 1 0 0 cm
346.918 713.098 m 478.297 602.121 471.277 439.312 501.602 298.336 c S Q
[ 6.75 2.25] 0 d
q 1 0 0 1 0 0 cm
350.215 663.625 m 354.234 690.504 330.004 683.723 331.273 706.047 c S Q
[ 6.75 2.25] 0 d
q 1 0 0 1 0 0 cm
312.98 283.602 m 98.168 498.258 559.469 498.258 348.984 708.668 c S Q
[ 6.75 2.25] 0 d
q 1 0 0 1 0 0 cm
229.82 756.023 m -16.82 769.41 -9.547 -93.246 316.137 130.141 c S Q
342.375 252.473 m 336.445 255.605 l 337.496 248.98 l f
276.148 271.125 m 282.328 273.738 l 276.531 277.113 l f
276.148 271.094 m 282.324 273.711 l 276.527 277.082 l f
1001.094 673.734 m 996.902 678.973 l 995.227 672.477 l f
502.727 301.352 m 506.059 295.531 l 508.719 301.688 l f
602.34 697.762 m 596.184 695.105 l 602.004 691.773 l f
500.203 300.969 m 504.039 295.465 l 506.137 301.836 l f
371.957 133.48 m 365.25 133.324 l 369.398 128.051 l f
359.691 214.062 m 353.324 216.168 l 355.461 209.809 l f
374.484 149.641 m 368.562 146.488 l 374.641 143.645 l f
359.578 213.914 m 353.223 216.066 l 355.312 209.691 l f
498.016 300.602 m 502.262 295.41 l 503.867 301.922 l f
334.129 702.91 m 331.414 709.043 l 328.137 703.191 l f
353.227 708.66 m 346.867 710.793 l 348.977 704.426 l f
315.352 125.973 m 318.613 131.836 l 311.965 130.926 l f
Q Q
showpage
%%Trailer
end
%%EOF
