%!PS-Adobe-3.0 EPSF-3.0
%%Creator: cairo 1.17.4 (https://cairographics.org)
%%CreationDate: Tue Jul 20 10:20:38 2021
%%Pages: 1
%%DocumentData: Clean7Bit
%%LanguageLevel: 2
%%BoundingBox: 0 0 175 147
%%EndComments
%%BeginProlog
50 dict begin
/q { gsave } bind def
/Q { grestore } bind def
/cm { 6 array astore concat } bind def
/w { setlinewidth } bind def
/J { setlinecap } bind def
/j { setlinejoin } bind def
/M { setmiterlimit } bind def
/d { setdash } bind def
/m { moveto } bind def
/l { lineto } bind def
/c { curveto } bind def
/h { closepath } bind def
/re { exch dup neg 3 1 roll 5 3 roll moveto 0 rlineto
      0 exch rlineto 0 rlineto closepath } bind def
/S { stroke } bind def
/f { fill } bind def
/f* { eofill } bind def
/n { newpath } bind def
/W { clip } bind def
/W* { eoclip } bind def
/BT { } bind def
/ET { } bind def
/BDC { mark 3 1 roll /BDC pdfmark } bind def
/EMC { mark /EMC pdfmark } bind def
/cairo_store_point { /cairo_point_y exch def /cairo_point_x exch def } def
/Tj { show currentpoint cairo_store_point } bind def
/TJ {
  {
    dup
    type /stringtype eq
    { show } { -0.001 mul 0 cairo_font_matrix dtransform rmoveto } ifelse
  } forall
  currentpoint cairo_store_point
} bind def
/cairo_selectfont { cairo_font_matrix aload pop pop pop 0 0 6 array astore
    cairo_font exch selectfont cairo_point_x cairo_point_y moveto } bind def
/Tf { pop /cairo_font exch def /cairo_font_matrix where
      { pop cairo_selectfont } if } bind def
/Td { matrix translate cairo_font_matrix matrix concatmatrix dup
      /cairo_font_matrix exch def dup 4 get exch 5 get cairo_store_point
      /cairo_font where { pop cairo_selectfont } if } bind def
/Tm { 2 copy 8 2 roll 6 array astore /cairo_font_matrix exch def
      cairo_store_point /cairo_font where { pop cairo_selectfont } if } bind def
/g { setgray } bind def
/rg { setrgbcolor } bind def
/d1 { setcachedevice } bind def
/cairo_data_source {
  CairoDataIndex CairoData length lt
    { CairoData CairoDataIndex get /CairoDataIndex CairoDataIndex 1 add def }
    { () } ifelse
} def
/cairo_flush_ascii85_file { cairo_ascii85_file status { cairo_ascii85_file flushfile } if } def
/cairo_image { image cairo_flush_ascii85_file } def
/cairo_imagemask { imagemask cairo_flush_ascii85_file } def
%%EndProlog
%%BeginSetup
%%EndSetup
%%Page: 1 1
%%BeginPageSetup
%%PageBoundingBox: 0 0 175 147
%%EndPageSetup
q 0 0 175 147 rectclip
1 0 0 -1 0 147 cm q
1 g
1.125 1.125 172.5 144 re f
2.25 w
0 J
0 j
[] 0.0 d
4 M q 1 0 0 1 0 0 cm
1.125 1.125 172.5 144 re S Q
166.125 22.875 m 166.125 46.125 l 143.625 58.875 l 121.125 46.125 l 121.125
 22.875 l 143.625 10.125 l h
166.125 22.875 m f
0 0.313726 0.45098 rg
3 w
10 M q 0 1 -1 0 0 0 cm
22.875 -166.125 m 46.125 -166.125 l 58.875 -143.625 l 46.125 -121.125 l
 22.875 -121.125 l 10.125 -143.625 l h
22.875 -166.125 m S Q
149.266 33.211 m 149.266 28.77 l 150.391 28.77 l 150.391 33.211 l h
146.828 33.211 m 146.828 30.988 l 147.961 30.988 l 147.961 33.211 l h
144.434 33.211 m 144.434 29.836 l 145.551 29.836 l 145.551 33.211 l h
147.324 36.504 m 150.906 36.504 153.336 33.996 153.336 31.172 c 153.336
 28.262 151.102 25.816 147.309 25.816 c 144.496 25.816 141.48 27.797 141.48
 31.102 c 141.48 34.336 144.406 36.504 147.324 36.504 c h
135.105 44.477 m 134.234 45.195 133.125 45.375 132.238 44.586 c 131.438
 43.785 131.746 42.797 132.309 42.293 c 136.344 38.477 l 137.047 37.809 
138.27 36.953 139.508 36.434 c 140.109 36.137 140.504 35.789 140.121 35.012
 c 139.531 33.879 139.066 32.82 139.066 30.824 c 139.066 26.969 142.852 
23.625 147.367 23.625 c 152.836 23.625 155.812 27.855 155.812 31.23 c 155.812
 35.031 152.168 38.691 147.621 38.691 c 146.477 38.691 145.059 38.324 144.066
 37.988 c 143.094 37.672 141.988 37.641 141.188 38.707 c 140.707 39.238 
140.16 40.266 138.684 41.543 c h
135.105 44.477 m f
56.199 33.801 m 52.266 34.484 46.551 35.062 41.633 35.062 c 37.199 35.102
 31.656 34.664 26.723 33.848 c 26.797 36.293 27.594 38.379 28.934 40.184
 c 30.156 48.668 36.344 52.875 41.191 52.875 c 47.387 52.875 52.777 48.156
 53.953 40.164 c 55.207 38.574 56.191 36.121 56.199 33.801 c h
34.949 37.074 m 34.777 37.59 34.859 38.113 35.316 38.559 c 35.918 39.137
 36.637 39.113 37.207 38.664 c 37.59 38.348 37.867 37.875 37.734 37.328 
c 37.988 37.395 38.16 37.516 38.289 37.656 c 38.496 37.859 38.477 38.113
 38.414 38.438 c 38.301 38.941 37.77 39.676 36.953 39.809 c 35.488 40.059
 34.859 39.465 34.289 38.984 c 33.953 38.609 33.613 38.094 33.703 37.566
 c 33.766 37.23 34.5 37.109 34.949 37.074 c h
47.949 37.066 m 48.531 37.117 48.969 37.223 49.207 37.484 c 49.344 37.996
 49.078 38.512 48.516 39.074 c 47.641 39.816 47.047 40.02 45.898 39.809 
c 45.383 39.691 44.73 39.234 44.527 38.504 c 44.469 38.301 44.371 37.922
 44.566 37.734 c 44.746 37.523 44.918 37.402 45.18 37.336 c 45.082 37.809
 45.219 38.219 45.668 38.648 c 46.125 39.039 46.934 39.211 47.543 38.602
 c 47.918 38.242 48.219 37.629 47.949 37.066 c h
31.117 39.652 m 32.168 40.703 33.703 41.656 35.387 42.27 c 36.891 42.848
 38.152 42.938 39.352 41.941 c 39.945 41.469 40.344 41.031 40.809 40.574
 c 41.199 40.172 41.512 40.148 41.934 40.508 c 42.516 41.078 43.027 41.586
 43.5 41.918 c 44.879 43.012 45.977 42.84 48.098 42.039 c 49.484 41.488 
50.984 40.453 51.816 39.66 c 51.422 42.578 50.543 44.844 48.512 47.289 c
 46.809 49.191 44.477 50.641 41.379 50.641 c 38.551 50.641 36.051 49.176
 34.23 47.113 c 32.559 45.09 31.523 42.773 31.117 39.652 c h
39.863 44.902 m 39.121 45.285 38.535 45.645 38.535 46.273 c 38.543 46.754
 39.008 46.891 39.781 46.98 c 40.793 47.07 41.812 47.055 42.824 46.996 c
 43.523 46.957 44.191 46.934 44.398 46.32 c 44.527 45.863 43.867 45.285 
43.352 45.059 c 42.246 44.496 40.836 44.527 39.863 44.902 c h
24.887 32.25 m 23.672 32.039 22.688 31.207 22.734 29.844 c 22.785 28.922
 23.438 28.043 24.953 27.773 c 26.379 27.516 28.273 27.227 30.09 27.023 
c 30.539 24.816 30.961 22.523 31.23 19.746 c 31.215 18.422 31.5 17.324 32.797
 16.641 c 33.621 16.254 34.988 16.176 36.375 16.641 c 39.129 17.738 43.461
 17.852 46.703 16.637 c 47.699 16.305 48.848 16.125 49.996 16.605 c 51.254
 17.176 51.699 18.234 51.66 19.281 c 51.848 22.184 52.305 24.914 52.785 
27.023 c 54.684 27.277 56.648 27.496 58.32 27.863 c 59.566 28.172 60.188
 29.004 60.188 29.961 c 60.188 31.184 59.309 31.883 58.574 32.109 c 54.652
 32.941 49.246 33.863 41.52 33.863 c 35.738 33.863 30.121 33.285 24.887 
32.25 c h
24.887 32.25 m f
1 g
166.125 105.375 m 166.125 128.625 l 143.625 141.375 l 121.125 128.625 l
 121.125 105.375 l 143.625 92.625 l h
166.125 105.375 m f
0 0.313726 0.45098 rg
q 0 1 -1 0 0 0 cm
105.375 -166.125 m 128.625 -166.125 l 141.375 -143.625 l 128.625 -121.125
 l 105.375 -121.125 l 92.625 -143.625 l h
105.375 -166.125 m S Q
147.66 107.379 m 146.484 107.379 145.418 108.098 144.977 109.184 c 144.562
 108.961 144.105 108.848 143.641 108.848 c 143.176 108.848 142.719 108.961
 142.305 109.176 c 141.855 108.105 140.805 107.398 139.637 107.398 c 138.891
 107.398 138.203 107.684 137.691 108.141 c 135.609 109.828 l 135.547 109.824
 135.48 109.824 135.422 109.824 c 134.609 109.824 133.859 110.07 133.238
 110.484 c 129.328 113.445 l 127.746 114.824 126.75 116.852 126.75 119.094
 c 126.75 123.234 130.148 126.613 134.301 126.613 c 138 126.613 141.09 123.945
 141.734 120.449 c 142.297 120.699 142.914 120.832 143.543 120.832 c 144.227
 120.832 144.891 120.676 145.508 120.375 c 146.129 123.898 149.234 126.602
 152.949 126.602 c 157.102 126.602 160.5 123.219 160.5 119.078 c 160.5 116.746
 159.426 114.66 157.746 113.281 c 154.469 110.512 l 153.816 110.023 153.008
 109.734 152.129 109.734 c 151.852 109.734 151.582 109.762 151.328 109.824
 c 149.664 108.188 l 149.137 107.684 148.434 107.379 147.66 107.379 c h
152.949 114.074 m 155.73 114.074 157.965 116.301 157.965 119.078 c 157.965
 121.852 155.73 124.074 152.949 124.074 c 150.156 124.074 147.93 121.852
 147.93 119.078 c 147.93 116.301 150.156 114.074 152.949 114.074 c h
134.301 114.098 m 137.094 114.098 139.32 116.316 139.32 119.094 c 139.32
 121.875 137.094 124.094 134.301 124.094 c 131.52 124.094 129.285 121.875
 129.285 119.094 c 129.285 116.316 131.52 114.098 134.301 114.098 c h
143.566 114.961 m 144.66 114.961 145.547 115.836 145.547 116.934 c 145.547
 118.02 144.66 118.898 143.566 118.898 c 142.469 118.906 141.586 118.02 
141.586 116.934 c 141.586 115.836 142.469 114.961 143.566 114.961 c h
131.34 117.031 m 130.434 118.312 130.059 120.211 131.859 121.941 c 133.672
 123.496 135.977 122.859 137.145 121.523 c 135.359 121.828 134.023 121.547
 132.996 120.719 c 131.902 119.828 131.348 118.68 131.34 117.031 c h
149.984 117.051 m 149.078 118.336 148.711 120.227 150.504 121.965 c 152.316
 123.516 154.629 122.879 155.789 121.547 c 154.012 121.852 152.676 121.566
 151.641 120.742 c 150.555 119.852 149.992 118.703 149.984 117.051 c h
149.984 117.051 m f
1 g
63.938 105.375 m 63.938 128.625 l 41.438 141.375 l 18.938 128.625 l 18.938
 105.375 l 41.438 92.625 l h
63.938 105.375 m f
0 0.313726 0.45098 rg
q 1 0 0 1 0 0 cm
63.938 105.375 m 63.938 128.625 l 41.438 141.375 l 18.938 128.625 l 18.938
 105.375 l 41.438 92.625 l h
63.938 105.375 m S Q
41.551 119.176 m 39.891 119.176 39.27 117.848 39.27 117.008 c 39.27 115.516
 40.461 114.781 41.543 114.781 c 42.426 114.781 43.648 115.547 43.648 117.008
 c 43.648 117.969 42.848 119.176 41.551 119.176 c h
41.551 122.879 m 44.672 122.879 47.297 120.238 47.297 117.008 c 47.297 
113.273 44.211 111.082 41.551 111.082 c 38.211 111.082 35.574 113.676 35.574
 117.008 c 35.574 120.309 38.168 122.879 41.551 122.879 c h
29.461 122.676 m 28.312 118.402 l 31.793 117 l 31.785 116.316 31.898 115.426
 32.086 114.66 c 29.047 112.469 l 31.184 108.691 l 34.547 110.129 l 35.129
 109.551 35.754 109.035 36.473 108.609 c 35.941 104.984 l 40.207 103.875
 l 41.52 107.289 l 42.328 107.289 43.125 107.355 43.898 107.578 c 46.035
 104.648 l 49.809 106.793 l 48.367 110.078 l 48.945 110.715 49.461 111.367
 49.891 112.066 c 53.414 111.531 l 54.562 115.762 l 51.238 117.082 l 51.234
 117.906 51.137 118.727 50.91 119.512 c 53.746 121.613 l 51.609 125.391 
l 48.328 123.961 l 47.762 124.582 47.121 125.004 46.477 125.391 c 47.055
 128.969 l 42.789 130.125 l 41.438 126.758 l 40.621 126.766 39.773 126.668
 39.016 126.465 c 36.887 129.426 l 33.105 127.289 l 34.547 123.906 l 34.02
 123.359 33.531 122.762 33.113 122.062 c h
29.461 122.676 m f
0.137255 0.266667 0.364706 rg
0.75 w
q 1 0 0 1 0 0 cm
60.188 28.133 m 80.812 21.129 99.609 20.352 116.578 25.809 c S Q
120.328 27.016 m 114.523 27.906 l 116.578 25.809 l 116.129 22.906 l h
120.328 27.016 m f
q 1 0 0 1 0 0 cm
120.328 27.016 m 114.523 27.906 l 116.578 25.809 l 116.129 22.906 l h
120.328 27.016 m S Q
q 1 0 0 1 0 0 cm
121.125 40.125 m 101.125 45.125 82.352 45.309 64.809 40.672 c S Q
60.996 39.668 m 66.742 38.469 l 64.809 40.672 l 65.398 43.547 l h
60.996 39.668 m f
q 1 0 0 1 0 0 cm
60.996 39.668 m 66.742 38.469 l 64.809 40.672 l 65.398 43.547 l h
60.996 39.668 m S Q
q 1 0 0 1 0 0 cm
32.25 52.875 m 26.5 64.375 26.457 77.578 32.121 92.484 c S Q
33.516 96.156 m 29.199 92.184 l 32.121 92.484 l 34.109 90.324 l h
33.516 96.156 m f
q 1 0 0 1 0 0 cm
33.516 96.156 m 29.199 92.184 l 32.121 92.484 l 34.109 90.324 l h
33.516 96.156 m S Q
q 1 0 0 1 0 0 cm
63.938 122.941 m 82.062 127.73 99.578 128.012 116.488 123.781 c S Q
120.316 122.828 m 115.852 126.645 l 116.488 123.781 l 114.586 121.551 l
 h
120.316 122.828 m f
q 1 0 0 1 0 0 cm
120.316 122.828 m 115.852 126.645 l 116.488 123.781 l 114.586 121.551 l
 h
120.316 122.828 m S Q
Q Q
showpage
%%Trailer
end
%%EOF
