%!PS-Adobe-3.0 EPSF-3.0
%%Creator: cairo 1.16.0 (https://cairographics.org)
%%CreationDate: Fri Jun 18 18:01:45 2021
%%Pages: 1
%%DocumentData: Clean7Bit
%%LanguageLevel: 2
%%BoundingBox: 0 0 301 91
%%EndComments
%%BeginProlog
50 dict begin
/q { gsave } bind def
/Q { grestore } bind def
/cm { 6 array astore concat } bind def
/w { setlinewidth } bind def
/J { setlinecap } bind def
/j { setlinejoin } bind def
/M { setmiterlimit } bind def
/d { setdash } bind def
/m { moveto } bind def
/l { lineto } bind def
/c { curveto } bind def
/h { closepath } bind def
/re { exch dup neg 3 1 roll 5 3 roll moveto 0 rlineto
      0 exch rlineto 0 rlineto closepath } bind def
/S { stroke } bind def
/f { fill } bind def
/f* { eofill } bind def
/n { newpath } bind def
/W { clip } bind def
/W* { eoclip } bind def
/BT { } bind def
/ET { } bind def
/BDC { mark 3 1 roll /BDC pdfmark } bind def
/EMC { mark /EMC pdfmark } bind def
/cairo_store_point { /cairo_point_y exch def /cairo_point_x exch def } def
/Tj { show currentpoint cairo_store_point } bind def
/TJ {
  {
    dup
    type /stringtype eq
    { show } { -0.001 mul 0 cairo_font_matrix dtransform rmoveto } ifelse
  } forall
  currentpoint cairo_store_point
} bind def
/cairo_selectfont { cairo_font_matrix aload pop pop pop 0 0 6 array astore
    cairo_font exch selectfont cairo_point_x cairo_point_y moveto } bind def
/Tf { pop /cairo_font exch def /cairo_font_matrix where
      { pop cairo_selectfont } if } bind def
/Td { matrix translate cairo_font_matrix matrix concatmatrix dup
      /cairo_font_matrix exch def dup 4 get exch 5 get cairo_store_point
      /cairo_font where { pop cairo_selectfont } if } bind def
/Tm { 2 copy 8 2 roll 6 array astore /cairo_font_matrix exch def
      cairo_store_point /cairo_font where { pop cairo_selectfont } if } bind def
/g { setgray } bind def
/rg { setrgbcolor } bind def
/d1 { setcachedevice } bind def
/cairo_data_source {
  CairoDataIndex CairoData length lt
    { CairoData CairoDataIndex get /CairoDataIndex CairoDataIndex 1 add def }
    { () } ifelse
} def
/cairo_flush_ascii85_file { cairo_ascii85_file status { cairo_ascii85_file flushfile } if } def
/cairo_image { image cairo_flush_ascii85_file } def
/cairo_imagemask { imagemask cairo_flush_ascii85_file } def
%%EndProlog
%%BeginSetup
%%EndSetup
%%Page: 1 1
%%BeginPageSetup
%%PageBoundingBox: 0 0 301 91
%%EndPageSetup
q 0 0 301 91 rectclip
1 0 0 -1 0 91 cm q
1 g
4.875 30.375 m 85.875 30.375 l 88.367 30.375 90.375 32.383 90.375 34.875
 c 90.375 55.875 l 90.375 58.367 88.367 60.375 85.875 60.375 c 4.875 60.375
 l 2.383 60.375 0.375 58.367 0.375 55.875 c 0.375 34.875 l 0.375 32.383 
2.383 30.375 4.875 30.375 c h
4.875 30.375 m f
0 0.313726 0.45098 rg
0.75 w
0 J
0 j
[] 0.0 d
4 M q 1 0 0 1 0 0 cm
4.875 30.375 m 85.875 30.375 l 88.367 30.375 90.375 32.383 90.375 34.875
 c 90.375 55.875 l 90.375 58.367 88.367 60.375 85.875 60.375 c 4.875 60.375
 l 2.383 60.375 0.375 58.367 0.375 55.875 c 0.375 34.875 l 0.375 32.383 
2.383 30.375 4.875 30.375 c h
4.875 30.375 m S Q
1 g
109.875 60.375 m 190.875 60.375 l 193.367 60.375 195.375 62.383 195.375
 64.875 c 195.375 85.875 l 195.375 88.367 193.367 90.375 190.875 90.375 
c 109.875 90.375 l 107.383 90.375 105.375 88.367 105.375 85.875 c 105.375
 64.875 l 105.375 62.383 107.383 60.375 109.875 60.375 c h
109.875 60.375 m f
0 0.313726 0.45098 rg
q 1 0 0 1 0 0 cm
109.875 60.375 m 190.875 60.375 l 193.367 60.375 195.375 62.383 195.375
 64.875 c 195.375 85.875 l 195.375 88.367 193.367 90.375 190.875 90.375 
c 109.875 90.375 l 107.383 90.375 105.375 88.367 105.375 85.875 c 105.375
 64.875 l 105.375 62.383 107.383 60.375 109.875 60.375 c h
109.875 60.375 m S Q
1 g
109.875 0.375 m 190.875 0.375 l 193.367 0.375 195.375 2.383 195.375 4.875
 c 195.375 25.875 l 195.375 28.367 193.367 30.375 190.875 30.375 c 109.875
 30.375 l 107.383 30.375 105.375 28.367 105.375 25.875 c 105.375 4.875 l
 105.375 2.383 107.383 0.375 109.875 0.375 c h
109.875 0.375 m f
0 0.313726 0.45098 rg
q 1 0 0 1 0 0 cm
109.875 0.375 m 190.875 0.375 l 193.367 0.375 195.375 2.383 195.375 4.875
 c 195.375 25.875 l 195.375 28.367 193.367 30.375 190.875 30.375 c 109.875
 30.375 l 107.383 30.375 105.375 28.367 105.375 25.875 c 105.375 4.875 l
 105.375 2.383 107.383 0.375 109.875 0.375 c h
109.875 0.375 m S Q
1 g
214.875 30.375 m 295.875 30.375 l 298.367 30.375 300.375 32.383 300.375
 34.875 c 300.375 55.875 l 300.375 58.367 298.367 60.375 295.875 60.375 
c 214.875 60.375 l 212.383 60.375 210.375 58.367 210.375 55.875 c 210.375
 34.875 l 210.375 32.383 212.383 30.375 214.875 30.375 c h
214.875 30.375 m f
0 0.313726 0.45098 rg
q 1 0 0 1 0 0 cm
214.875 30.375 m 295.875 30.375 l 298.367 30.375 300.375 32.383 300.375
 34.875 c 300.375 55.875 l 300.375 58.367 298.367 60.375 295.875 60.375 
c 214.875 60.375 l 212.383 60.375 210.375 58.367 210.375 55.875 c 210.375
 34.875 l 210.375 32.383 212.383 30.375 214.875 30.375 c h
214.875 30.375 m S Q
0.137255 0.266667 0.364706 rg
10 M q 1 0 0 1 0 0 cm
45.375 60.375 m 45.375 67.875 l 45.375 72.875 47.875 75.375 52.875 75.375
 c 100.598 75.375 l S Q
104.535 75.375 m 99.285 78 l 100.598 75.375 l 99.285 72.75 l h
104.535 75.375 m f
q 1 0 0 1 0 0 cm
104.535 75.375 m 99.285 78 l 100.598 75.375 l 99.285 72.75 l h
104.535 75.375 m S Q
q 1 0 0 1 0 0 cm
45.375 30.375 m 45.375 22.875 l 45.375 17.875 47.875 15.375 52.875 15.375
 c 100.598 15.375 l S Q
104.535 15.375 m 99.285 18 l 100.598 15.375 l 99.285 12.75 l h
104.535 15.375 m f
q 1 0 0 1 0 0 cm
104.535 15.375 m 99.285 18 l 100.598 15.375 l 99.285 12.75 l h
104.535 15.375 m S Q
q 1 0 0 1 0 0 cm
172.875 30.375 m 172.875 37.875 l 172.875 42.875 175.375 45.375 180.375
 45.375 c 205.598 45.375 l S Q
209.535 45.375 m 204.285 48 l 205.598 45.375 l 204.285 42.75 l h
209.535 45.375 m f
q 1 0 0 1 0 0 cm
209.535 45.375 m 204.285 48 l 205.598 45.375 l 204.285 42.75 l h
209.535 45.375 m S Q
q 1 0 0 1 0 0 cm
172.875 60.375 m 172.875 52.875 l 172.875 47.875 175.375 45.375 180.375
 45.375 c 205.598 45.375 l S Q
209.535 45.375 m 204.285 48 l 205.598 45.375 l 204.285 42.75 l h
209.535 45.375 m f
q 1 0 0 1 0 0 cm
209.535 45.375 m 204.285 48 l 205.598 45.375 l 204.285 42.75 l h
209.535 45.375 m S Q
Q Q
showpage
%%Trailer
end
%%EOF
