%!PS-Adobe-3.0 EPSF-3.0
%%Creator: cairo 1.16.0 (https://cairographics.org)
%%CreationDate: Fri Jun 18 11:03:23 2021
%%Pages: 1
%%DocumentData: Clean7Bit
%%LanguageLevel: 2
%%BoundingBox: 0 0 348 512
%%EndComments
%%BeginProlog
50 dict begin
/q { gsave } bind def
/Q { grestore } bind def
/cm { 6 array astore concat } bind def
/w { setlinewidth } bind def
/J { setlinecap } bind def
/j { setlinejoin } bind def
/M { setmiterlimit } bind def
/d { setdash } bind def
/m { moveto } bind def
/l { lineto } bind def
/c { curveto } bind def
/h { closepath } bind def
/re { exch dup neg 3 1 roll 5 3 roll moveto 0 rlineto
      0 exch rlineto 0 rlineto closepath } bind def
/S { stroke } bind def
/f { fill } bind def
/f* { eofill } bind def
/n { newpath } bind def
/W { clip } bind def
/W* { eoclip } bind def
/BT { } bind def
/ET { } bind def
/BDC { mark 3 1 roll /BDC pdfmark } bind def
/EMC { mark /EMC pdfmark } bind def
/cairo_store_point { /cairo_point_y exch def /cairo_point_x exch def } def
/Tj { show currentpoint cairo_store_point } bind def
/TJ {
  {
    dup
    type /stringtype eq
    { show } { -0.001 mul 0 cairo_font_matrix dtransform rmoveto } ifelse
  } forall
  currentpoint cairo_store_point
} bind def
/cairo_selectfont { cairo_font_matrix aload pop pop pop 0 0 6 array astore
    cairo_font exch selectfont cairo_point_x cairo_point_y moveto } bind def
/Tf { pop /cairo_font exch def /cairo_font_matrix where
      { pop cairo_selectfont } if } bind def
/Td { matrix translate cairo_font_matrix matrix concatmatrix dup
      /cairo_font_matrix exch def dup 4 get exch 5 get cairo_store_point
      /cairo_font where { pop cairo_selectfont } if } bind def
/Tm { 2 copy 8 2 roll 6 array astore /cairo_font_matrix exch def
      cairo_store_point /cairo_font where { pop cairo_selectfont } if } bind def
/g { setgray } bind def
/rg { setrgbcolor } bind def
/d1 { setcachedevice } bind def
/cairo_data_source {
  CairoDataIndex CairoData length lt
    { CairoData CairoDataIndex get /CairoDataIndex CairoDataIndex 1 add def }
    { () } ifelse
} def
/cairo_flush_ascii85_file { cairo_ascii85_file status { cairo_ascii85_file flushfile } if } def
/cairo_image { image cairo_flush_ascii85_file } def
/cairo_imagemask { imagemask cairo_flush_ascii85_file } def
%%EndProlog
%%BeginSetup
%%EndSetup
%%Page: 1 1
%%BeginPageSetup
%%PageBoundingBox: 0 0 348 512
%%EndPageSetup
q 0 0 348 512 rectclip
1 0 0 -1 0 526 cm q
1 g
188.66 315 m 275.66 315 l 280.645 315 284.66 319.016 284.66 324 c 284.66
 366 l 284.66 370.984 280.645 375 275.66 375 c 188.66 375 l 183.672 375 
179.66 370.984 179.66 366 c 179.66 324 l 179.66 319.016 183.672 315 188.66
 315 c h
188.66 315 m f
0.137255 0.266667 0.364706 rg
3 w
0 J
0 j
[ 9 9] 0 d
4 M q 1 0 0 1 0 0 cm
188.66 315 m 275.66 315 l 280.645 315 284.66 319.016 284.66 324 c 284.66
 366 l 284.66 370.984 280.645 375 275.66 375 c 188.66 375 l 183.672 375 
179.66 370.984 179.66 366 c 179.66 324 l 179.66 319.016 183.672 315 188.66
 315 c h
188.66 315 m S Q
0.75 w
[] 0.0 d
10 M q 1 0 0 1 0 0 cm
152.305 345 m 181.258 345 l S Q
0.613387 w
q 1 0 0 1 0 0 cm
161.781 435 m 181.145 435 l S Q
1 g
257 180 m 330.5 180 l 339.227 180 346.25 187.023 346.25 195.75 c 346.25
 284.25 l 346.25 292.977 339.227 300 330.5 300 c 257 300 l 248.277 300 241.25
 292.977 241.25 284.25 c 241.25 195.75 l 241.25 187.023 248.277 180 257 
180 c h
257 180 m f
0.137255 0.266667 0.364706 rg
3 w
[ 9 9] 0 d
4 M q 1 0 0 1 0 0 cm
257 180 m 330.5 180 l 339.227 180 346.25 187.023 346.25 195.75 c 346.25
 284.25 l 346.25 292.977 339.227 300 330.5 300 c 257 300 l 248.277 300 241.25
 292.977 241.25 284.25 c 241.25 195.75 l 241.25 187.023 248.277 180 257 
180 c h
257 180 m S Q
1 g
14.934 80.832 m 212.934 80.832 l 220.414 80.832 226.434 86.328 226.434 
93.156 c 226.434 287.617 l 226.434 294.445 220.414 299.941 212.934 299.941
 c 14.934 299.941 l 7.453 299.941 1.434 294.445 1.434 287.617 c 1.434 93.156
 l 1.434 86.328 7.453 80.832 14.934 80.832 c h
14.934 80.832 m f
0.137255 0.266667 0.364706 rg
2.86647 w
[ 9 9] 0 d
q 1 0 0 1 0 0 cm
14.934 80.832 m 212.934 80.832 l 220.414 80.832 226.434 86.328 226.434 
93.156 c 226.434 287.617 l 226.434 294.445 220.414 299.941 212.934 299.941
 c 14.934 299.941 l 7.453 299.941 1.434 294.445 1.434 287.617 c 1.434 93.156
 l 1.434 86.328 7.453 80.832 14.934 80.832 c h
14.934 80.832 m S Q
0.75 w
[] 0.0 d
10 M q 1 0 0 1 0 0 cm
113.75 45 m 113.781 108.824 l 113.785 113.824 116.289 116.324 121.289 116.324
 c 164.414 116.324 l 169.414 116.324 171.91 117.84 171.898 120.875 c 171.891
 129.176 l S Q
1 g
69.125 16.215 m 158.375 16.215 l 162.738 16.215 166.25 19.727 166.25 24.09
 c 166.25 60.84 l 166.25 65.203 162.738 68.715 158.375 68.715 c 69.125 68.715
 l 64.762 68.715 61.25 65.203 61.25 60.84 c 61.25 24.09 l 61.25 19.727 64.762
 16.215 69.125 16.215 c h
69.125 16.215 m f
0.137255 0.266667 0.364706 rg
3 w
[ 9 9] 0 d
4 M q 1 0 0 1 0 0 cm
69.125 16.215 m 158.375 16.215 l 162.738 16.215 166.25 19.727 166.25 24.09
 c 166.25 60.84 l 166.25 65.203 162.738 68.715 158.375 68.715 c 69.125 68.715
 l 64.762 68.715 61.25 65.203 61.25 60.84 c 61.25 24.09 l 61.25 19.727 64.762
 16.215 69.125 16.215 c h
69.125 16.215 m S Q
0.75 w
[] 0.0 d
10 M q 1 0 0 1 0 0 cm
171.914 164.906 m 171.914 170.754 l 171.914 175.754 169.414 178.254 164.414
 178.254 c 121.289 178.254 l 116.289 178.254 113.785 180.754 113.781 185.754
 c S Q
q 1 0 0 1 0 0 cm
113.789 45 m 113.789 108.824 l 113.789 113.824 111.289 116.324 106.289 
116.324 c 63.164 116.324 l 58.164 116.324 55.66 117.84 55.648 120.875 c 
55.641 129.176 l S Q
1 g
73.25 31.215 m 154.25 31.215 l 156.746 31.215 158.75 33.223 158.75 35.715
 c 158.75 56.715 l 158.75 59.207 156.746 61.215 154.25 61.215 c 73.25 61.215
 l 70.758 61.215 68.75 59.207 68.75 56.715 c 68.75 35.715 l 68.75 33.223
 70.758 31.215 73.25 31.215 c h
73.25 31.215 m f
0 0.313726 0.45098 rg
4 M q 1 0 0 1 0 0 cm
73.25 31.215 m 154.25 31.215 l 156.746 31.215 158.75 33.223 158.75 35.715
 c 158.75 56.715 l 158.75 59.207 156.746 61.215 154.25 61.215 c 73.25 61.215
 l 70.758 61.215 68.75 59.207 68.75 56.715 c 68.75 35.715 l 68.75 33.223
 70.758 31.215 73.25 31.215 c h
73.25 31.215 m S Q
1 g
15.125 195 m 96.125 195 l 98.621 195 100.625 197.008 100.625 199.5 c 100.625
 220.5 l 100.625 222.992 98.621 225 96.125 225 c 15.125 225 l 12.633 225
 10.625 222.992 10.625 220.5 c 10.625 199.5 l 10.625 197.008 12.633 195 
15.125 195 c h
15.125 195 m f
0 0.313726 0.45098 rg
q 1 0 0 1 0 0 cm
15.125 195 m 96.125 195 l 98.621 195 100.625 197.008 100.625 199.5 c 100.625
 220.5 l 100.625 222.992 98.621 225 96.125 225 c 15.125 225 l 12.633 225
 10.625 222.992 10.625 220.5 c 10.625 199.5 l 10.625 197.008 12.633 195 
15.125 195 c h
15.125 195 m S Q
1 g
131.375 195 m 212.375 195 l 214.871 195 216.875 197.008 216.875 199.5 c
 216.875 220.5 l 216.875 222.992 214.871 225 212.375 225 c 131.375 225 l
 128.883 225 126.875 222.992 126.875 220.5 c 126.875 199.5 l 126.875 197.008
 128.883 195 131.375 195 c h
131.375 195 m f
0 0.313726 0.45098 rg
q 1 0 0 1 0 0 cm
131.375 195 m 212.375 195 l 214.871 195 216.875 197.008 216.875 199.5 c
 216.875 220.5 l 216.875 222.992 214.871 225 212.375 225 c 131.375 225 l
 128.883 225 126.875 222.992 126.875 220.5 c 126.875 199.5 l 126.875 197.008
 128.883 195 131.375 195 c h
131.375 195 m S Q
0.137255 0.266667 0.364706 rg
10 M q 1 0 0 1 0 0 cm
113.75 285 m 113.789 300 l 113.812 311.316 l S Q
1 g
73.25 255 m 154.25 255 l 156.746 255 158.75 257.008 158.75 259.5 c 158.75
 280.5 l 158.75 282.992 156.746 285 154.25 285 c 73.25 285 l 70.758 285 
68.75 282.992 68.75 280.5 c 68.75 259.5 l 68.75 257.008 70.758 255 73.25
 255 c h
73.25 255 m f
0 0.313726 0.45098 rg
4 M q 1 0 0 1 0 0 cm
73.25 255 m 154.25 255 l 156.746 255 158.75 257.008 158.75 259.5 c 158.75
 280.5 l 158.75 282.992 156.746 285 154.25 285 c 73.25 285 l 70.758 285 
68.75 282.992 68.75 280.5 c 68.75 259.5 l 68.75 257.008 70.758 255 73.25
 255 c h
73.25 255 m S Q
0.137255 0.266667 0.364706 rg
113.75 254.16 m 110.375 247.41 l 113.75 249.098 l 117.125 247.41 l h
113.75 254.16 m f
10 M q 1 0 0 1 0 0 cm
113.75 254.16 m 110.375 247.41 l 113.75 249.098 l 117.125 247.41 l h
113.75 254.16 m S Q
0.780397 w
q 1 0 0 1 0 0 cm
113.75 372.898 m 113.75 401.266 l S Q
1 g
92.82 330 m 107.211 319.688 l 111.57 316.562 115.93 316.562 120.289 319.688
 c 149.074 340.312 l 153.434 343.438 153.434 346.562 149.074 349.688 c 120.289
 370.312 l 115.93 373.438 111.57 373.438 107.211 370.312 c 78.426 349.688
 l 74.066 346.562 74.066 343.438 78.426 340.312 c h
92.82 330 m f
0 0.313726 0.45098 rg
0.792428 w
q 1 0 0 1 0 0 cm
92.82 330 m 107.211 319.688 l 111.57 316.562 115.93 316.562 120.289 319.688
 c 149.074 340.312 l 153.434 343.438 153.434 346.562 149.074 349.688 c 120.289
 370.312 l 115.93 373.438 111.57 373.438 107.211 370.312 c 78.426 349.688
 l 74.066 346.562 74.066 343.438 78.426 340.312 c h
92.82 330 m S Q
0.137255 0.266667 0.364706 rg
0.75 w
q 1 0 0 1 0 0 cm
277.203 345 m 286.25 344.984 l 291.25 344.984 293.75 342.484 293.75 337.484
 c 293.75 290.902 l S Q
q 1 0 0 1 0 0 cm
277.203 435.129 m 286.25 435.117 l 291.25 435.117 293.75 432.617 293.75
 427.617 c 293.75 335.508 l S Q
1 g
191.66 330 m 272.66 330 l 275.152 330 277.16 332.008 277.16 334.5 c 277.16
 355.5 l 277.16 357.992 275.152 360 272.66 360 c 191.66 360 l 189.164 360
 187.16 357.992 187.16 355.5 c 187.16 334.5 l 187.16 332.008 189.164 330
 191.66 330 c h
191.66 330 m f
0 0.313726 0.45098 rg
4 M q 1 0 0 1 0 0 cm
191.66 330 m 272.66 330 l 275.152 330 277.16 332.008 277.16 334.5 c 277.16
 355.5 l 277.16 357.992 275.152 360 272.66 360 c 191.66 360 l 189.164 360
 187.16 357.992 187.16 355.5 c 187.16 334.5 l 187.16 332.008 189.164 330
 191.66 330 c h
191.66 330 m S Q
1 g
191.66 420 m 272.66 420 l 275.152 420 277.16 422.008 277.16 424.5 c 277.16
 445.5 l 277.16 447.992 275.152 450 272.66 450 c 191.66 450 l 189.164 450
 187.16 447.992 187.16 445.5 c 187.16 424.5 l 187.16 422.008 189.164 420
 191.66 420 c h
191.66 420 m f
0 0.313726 0.45098 rg
q 1 0 0 1 0 0 cm
191.66 420 m 272.66 420 l 275.152 420 277.16 422.008 277.16 424.5 c 277.16
 445.5 l 277.16 447.992 275.152 450 272.66 450 c 191.66 450 l 189.164 450
 187.16 447.992 187.16 445.5 c 187.16 424.5 l 187.16 422.008 189.164 420
 191.66 420 c h
191.66 420 m S Q
1 g
253.25 255 m 334.25 255 l 336.746 255 338.75 257.008 338.75 259.5 c 338.75
 280.5 l 338.75 282.992 336.746 285 334.25 285 c 253.25 285 l 250.758 285
 248.75 282.992 248.75 280.5 c 248.75 259.5 l 248.75 257.008 250.758 255
 253.25 255 c h
253.25 255 m f
0 0.313726 0.45098 rg
q 1 0 0 1 0 0 cm
253.25 255 m 334.25 255 l 336.746 255 338.75 257.008 338.75 259.5 c 338.75
 280.5 l 338.75 282.992 336.746 285 334.25 285 c 253.25 285 l 250.758 285
 248.75 282.992 248.75 280.5 c 248.75 259.5 l 248.75 257.008 250.758 255
 253.25 255 c h
253.25 255 m S Q
1 g
13.25 495 m 94.25 495 l 96.746 495 98.75 497.008 98.75 499.5 c 98.75 520.5
 l 98.75 522.992 96.746 525 94.25 525 c 13.25 525 l 10.758 525 8.75 522.992
 8.75 520.5 c 8.75 499.5 l 8.75 497.008 10.758 495 13.25 495 c h
13.25 495 m f
0 0.313726 0.45098 rg
q 1 0 0 1 0 0 cm
13.25 495 m 94.25 495 l 96.746 495 98.75 497.008 98.75 499.5 c 98.75 520.5
 l 98.75 522.992 96.746 525 94.25 525 c 13.25 525 l 10.758 525 8.75 522.992
 8.75 520.5 c 8.75 499.5 l 8.75 497.008 10.758 495 13.25 495 c h
13.25 495 m S Q
0.137255 0.266667 0.364706 rg
113.828 316.379 m 110.438 309.637 l 113.812 311.316 l 117.188 309.621 l
 h
113.828 316.379 m f
10 M q 1 0 0 1 0 0 cm
113.828 316.379 m 110.438 309.637 l 113.812 311.316 l 117.188 309.621 l
 h
113.828 316.379 m S Q
q 1 0 0 1 0 0 cm
113.75 465 m 113.773 472.5 l 113.785 477.5 111.289 480 106.289 480 c 61.289
 480 l 56.289 480 53.785 481.516 53.773 484.551 c 53.766 489.098 l S Q
53.75 494.16 m 50.398 487.402 l 53.766 489.098 l 57.148 487.418 l h
53.75 494.16 m f
q 1 0 0 1 0 0 cm
53.75 494.16 m 50.398 487.402 l 53.766 489.098 l 57.148 487.418 l h
53.75 494.16 m S Q
186.32 345 m 179.57 348.375 l 181.258 345 l 179.57 341.625 l h
186.32 345 m f
q 1 0 0 1 0 0 cm
186.32 345 m 179.57 348.375 l 181.258 345 l 179.57 341.625 l h
186.32 345 m S Q
186.207 435 m 179.457 438.375 l 181.145 435 l 179.457 431.625 l h
186.207 435 m f
q 1 0 0 1 0 0 cm
186.207 435 m 179.457 438.375 l 181.145 435 l 179.457 431.625 l h
186.207 435 m S Q
293.75 285.84 m 297.125 292.59 l 293.75 290.902 l 290.375 292.59 l h
293.75 285.84 m f
q 1 0 0 1 0 0 cm
293.75 285.84 m 297.125 292.59 l 293.75 290.902 l 290.375 292.59 l h
293.75 285.84 m S Q
1 g
15.125 135 m 96.125 135 l 98.621 135 100.625 137.008 100.625 139.5 c 100.625
 160.5 l 100.625 162.992 98.621 165 96.125 165 c 15.125 165 l 12.633 165
 10.625 162.992 10.625 160.5 c 10.625 139.5 l 10.625 137.008 12.633 135 
15.125 135 c h
15.125 135 m f
0 0.313726 0.45098 rg
4 M q 1 0 0 1 0 0 cm
15.125 135 m 96.125 135 l 98.621 135 100.625 137.008 100.625 139.5 c 100.625
 160.5 l 100.625 162.992 98.621 165 96.125 165 c 15.125 165 l 12.633 165
 10.625 162.992 10.625 160.5 c 10.625 139.5 l 10.625 137.008 12.633 135 
15.125 135 c h
15.125 135 m S Q
0.137255 0.266667 0.364706 rg
10 M q 1 0 0 1 0 0 cm
113.75 463.121 m 113.773 472.5 l 113.785 477.5 116.289 480 121.289 480 
c 166.289 480 l 171.289 480 173.785 481.516 173.773 484.551 c 173.766 489.098
 l S Q
1 g
87.953 420 m 106.598 409.164 l 111.367 406.387 116.137 406.387 120.906 
409.164 c 158.191 430.836 l 162.961 433.613 162.961 436.387 158.191 439.164
 c 120.906 460.836 l 116.137 463.613 111.367 463.613 106.598 460.836 c 69.312
 439.164 l 64.543 436.387 64.543 433.613 69.312 430.836 c h
87.953 420 m f
0 0.313726 0.45098 rg
0.803062 w
q 1 0 0 1 0 0 cm
87.953 420 m 106.598 409.164 l 111.367 406.387 116.137 406.387 120.906 
409.164 c 158.191 430.836 l 162.961 433.613 162.961 436.387 158.191 439.164
 c 120.906 460.836 l 116.137 463.613 111.367 463.613 106.598 460.836 c 69.312
 439.164 l 64.543 436.387 64.543 433.613 69.312 430.836 c h
87.953 420 m S Q
0.137255 0.266667 0.364706 rg
113.75 406.328 m 110.375 399.578 l 113.75 401.266 l 117.125 399.578 l h
113.75 406.328 m f
0.75 w
q 1 0 0 1 0 0 cm
113.75 406.328 m 110.375 399.578 l 113.75 401.266 l 117.125 399.578 l h
113.75 406.328 m S Q
q 1 0 0 1 0 0 cm
293.75 255 m 293.75 230.902 l S Q
293.75 225.84 m 297.125 232.59 l 293.75 230.902 l 290.375 232.59 l h
293.75 225.84 m f
q 1 0 0 1 0 0 cm
293.75 225.84 m 297.125 232.59 l 293.75 230.902 l 290.375 232.59 l h
293.75 225.84 m S Q
1 g
253.25 195 m 334.25 195 l 336.746 195 338.75 197.008 338.75 199.5 c 338.75
 220.5 l 338.75 222.992 336.746 225 334.25 225 c 253.25 225 l 250.758 225
 248.75 222.992 248.75 220.5 c 248.75 199.5 l 248.75 197.008 250.758 195
 253.25 195 c h
253.25 195 m f
0 0.313726 0.45098 rg
4 M q 1 0 0 1 0 0 cm
253.25 195 m 334.25 195 l 336.746 195 338.75 197.008 338.75 199.5 c 338.75
 220.5 l 338.75 222.992 336.746 225 334.25 225 c 253.25 225 l 250.758 225
 248.75 222.992 248.75 220.5 c 248.75 199.5 l 248.75 197.008 250.758 195
 253.25 195 c h
253.25 195 m S Q
1 g
133.25 495 m 214.25 495 l 216.746 495 218.75 497.008 218.75 499.5 c 218.75
 520.5 l 218.75 522.992 216.746 525 214.25 525 c 133.25 525 l 130.758 525
 128.75 522.992 128.75 520.5 c 128.75 499.5 l 128.75 497.008 130.758 495
 133.25 495 c h
133.25 495 m f
0 0.313726 0.45098 rg
q 1 0 0 1 0 0 cm
133.25 495 m 214.25 495 l 216.746 495 218.75 497.008 218.75 499.5 c 218.75
 520.5 l 218.75 522.992 216.746 525 214.25 525 c 133.25 525 l 130.758 525
 128.75 522.992 128.75 520.5 c 128.75 499.5 l 128.75 497.008 130.758 495
 133.25 495 c h
133.25 495 m S Q
0.137255 0.266667 0.364706 rg
173.75 494.16 m 170.398 487.402 l 173.766 489.098 l 177.148 487.418 l h
173.75 494.16 m f
10 M q 1 0 0 1 0 0 cm
173.75 494.16 m 170.398 487.402 l 173.766 489.098 l 177.148 487.418 l h
173.75 494.16 m S Q
1 g
131.375 135 m 212.375 135 l 214.871 135 216.875 137.008 216.875 139.5 c
 216.875 160.5 l 216.875 162.992 214.871 165 212.375 165 c 131.375 165 l
 128.883 165 126.875 162.992 126.875 160.5 c 126.875 139.5 l 126.875 137.008
 128.883 135 131.375 135 c h
131.375 135 m f
0 0.313726 0.45098 rg
4 M q 1 0 0 1 0 0 cm
131.375 135 m 212.375 135 l 214.871 135 216.875 137.008 216.875 139.5 c
 216.875 160.5 l 216.875 162.992 214.871 165 212.375 165 c 131.375 165 l
 128.883 165 126.875 162.992 126.875 160.5 c 126.875 139.5 l 126.875 137.008
 128.883 135 131.375 135 c h
131.375 135 m S Q
0.137255 0.266667 0.364706 rg
171.875 134.238 m 168.523 127.48 l 171.891 129.176 l 175.273 127.496 l 
h
171.875 134.238 m f
10 M q 1 0 0 1 0 0 cm
171.875 134.238 m 168.523 127.48 l 171.891 129.176 l 175.273 127.496 l 
h
171.875 134.238 m S Q
126.035 150 m 119.285 153.375 l 120.973 150 l 119.285 146.625 l h
126.035 150 m f
q 1 0 0 1 0 0 cm
126.035 150 m 119.285 153.375 l 120.973 150 l 119.285 146.625 l h
126.035 150 m S Q
101.465 150 m 108.215 146.625 l 106.527 150 l 108.215 153.375 l h
101.465 150 m f
q 1 0 0 1 0 0 cm
101.465 150 m 108.215 146.625 l 106.527 150 l 108.215 153.375 l h
101.465 150 m S Q
0.734356 w
q 1 0 0 1 0 0 cm
126.035 150 m 106.527 150 l S Q
0.75 w
q 1 0 0 1 0 0 cm
55.625 165.039 m 55.656 170.754 l 55.66 175.754 58.164 178.254 63.164 178.254
 c 106.289 178.254 l 111.289 178.254 113.785 180.754 113.781 185.754 c 113.758
 249.359 l S Q
q 1 0 0 1 0 0 cm
100.363 209.91 m 106.289 209.91 l 111.289 209.91 113.785 212.41 113.781
 217.41 c S Q
q 1 0 0 1 0 0 cm
127.199 209.91 m 121.273 209.91 l 116.273 209.91 113.777 212.41 113.781
 217.41 c S Q
q 1 0 0 1 0 0 cm
293.836 195 m 293.871 109.371 l 293.871 104.371 291.371 101.871 286.371
 101.871 c 118.898 101.871 l 113.898 101.871 113.781 104.371 113.781 109.371
 c S Q
55.625 134.238 m 52.273 127.48 l 55.641 129.176 l 59.023 127.496 l h
55.625 134.238 m f
q 1 0 0 1 0 0 cm
55.625 134.238 m 52.273 127.48 l 55.641 129.176 l 59.023 127.496 l h
55.625 134.238 m S Q
Q Q
showpage
%%Trailer
end
%%EOF
