%!PS-Adobe-3.0 EPSF-3.0
%%Creator: cairo 1.17.4 (https://cairographics.org)
%%CreationDate: Tue Jul  6 09:32:19 2021
%%Pages: 1
%%DocumentData: Clean7Bit
%%LanguageLevel: 2
%%BoundingBox: 0 1 157 144
%%EndComments
%%BeginProlog
50 dict begin
/q { gsave } bind def
/Q { grestore } bind def
/cm { 6 array astore concat } bind def
/w { setlinewidth } bind def
/J { setlinecap } bind def
/j { setlinejoin } bind def
/M { setmiterlimit } bind def
/d { setdash } bind def
/m { moveto } bind def
/l { lineto } bind def
/c { curveto } bind def
/h { closepath } bind def
/re { exch dup neg 3 1 roll 5 3 roll moveto 0 rlineto
      0 exch rlineto 0 rlineto closepath } bind def
/S { stroke } bind def
/f { fill } bind def
/f* { eofill } bind def
/n { newpath } bind def
/W { clip } bind def
/W* { eoclip } bind def
/BT { } bind def
/ET { } bind def
/BDC { mark 3 1 roll /BDC pdfmark } bind def
/EMC { mark /EMC pdfmark } bind def
/cairo_store_point { /cairo_point_y exch def /cairo_point_x exch def } def
/Tj { show currentpoint cairo_store_point } bind def
/TJ {
  {
    dup
    type /stringtype eq
    { show } { -0.001 mul 0 cairo_font_matrix dtransform rmoveto } ifelse
  } forall
  currentpoint cairo_store_point
} bind def
/cairo_selectfont { cairo_font_matrix aload pop pop pop 0 0 6 array astore
    cairo_font exch selectfont cairo_point_x cairo_point_y moveto } bind def
/Tf { pop /cairo_font exch def /cairo_font_matrix where
      { pop cairo_selectfont } if } bind def
/Td { matrix translate cairo_font_matrix matrix concatmatrix dup
      /cairo_font_matrix exch def dup 4 get exch 5 get cairo_store_point
      /cairo_font where { pop cairo_selectfont } if } bind def
/Tm { 2 copy 8 2 roll 6 array astore /cairo_font_matrix exch def
      cairo_store_point /cairo_font where { pop cairo_selectfont } if } bind def
/g { setgray } bind def
/rg { setrgbcolor } bind def
/d1 { setcachedevice } bind def
/cairo_data_source {
  CairoDataIndex CairoData length lt
    { CairoData CairoDataIndex get /CairoDataIndex CairoDataIndex 1 add def }
    { () } ifelse
} def
/cairo_flush_ascii85_file { cairo_ascii85_file status { cairo_ascii85_file flushfile } if } def
/cairo_image { image cairo_flush_ascii85_file } def
/cairo_imagemask { imagemask cairo_flush_ascii85_file } def
%%EndProlog
%%BeginSetup
%%EndSetup
%%Page: 1 1
%%BeginPageSetup
%%PageBoundingBox: 0 1 157 144
%%EndPageSetup
q 0 1 157 143 rectclip
1 0 0 -1 0 144 cm q
1 g
0.75 0.375 156 142.5 re f
101.25 101.25 m 101.25 124.5 l 78.75 137.25 l 56.25 124.5 l 56.25 101.25
 l 78.75 88.5 l h
101.25 101.25 m f
0 0.313726 0.45098 rg
3 w
0 J
0 j
[] 0.0 d
10 M q 0 1 -1 0 0 0 cm
101.25 -101.25 m 124.5 -101.25 l 137.25 -78.75 l 124.5 -56.25 l 101.25 
-56.25 l 88.5 -78.75 l h
101.25 -101.25 m S Q
1 g
150 18.75 m 150 42 l 127.5 54.75 l 105 42 l 105 18.75 l 127.5 6 l h
150 18.75 m f
0 0.313726 0.45098 rg
q 0 1 -1 0 0 0 cm
18.75 -150 m 42 -150 l 54.75 -127.5 l 42 -105 l 18.75 -105 l 6 -127.5 l
 h
18.75 -150 m S Q
0.137255 0.266667 0.364706 rg
0.75 w
q 1 0 0 1 0 0 cm
67.68 94.77 m 60.066 82.336 l S Q
q 1 0 0 1 0 0 cm
38.137 44.773 m 55.125 73.926 l S Q
q 1 0 0 1 0 0 cm
52.926 82.125 m 50.926 78.66 51.66 75.926 55.125 73.926 c 58.59 71.926 
61.324 72.66 63.324 76.125 c S Q
1 g
61.875 79.125 m 61.875 81.195 60.195 82.875 58.125 82.875 c 56.055 82.875
 54.375 81.195 54.375 79.125 c 54.375 77.055 56.055 75.375 58.125 75.375
 c 60.195 75.375 61.875 77.055 61.875 79.125 c h
61.875 79.125 m f
0.137255 0.266667 0.364706 rg
4 M q 1 0 0 1 0 0 cm
61.875 79.125 m 61.875 81.195 60.195 82.875 58.125 82.875 c 56.055 82.875
 54.375 81.195 54.375 79.125 c 54.375 77.055 56.055 75.375 58.125 75.375
 c 60.195 75.375 61.875 77.055 61.875 79.125 c h
61.875 79.125 m S Q
10 M q 1 0 0 1 0 0 cm
89.82 94.77 m 97.434 82.336 l S Q
q 1 0 0 1 0 0 cm
116.902 48.742 m 102.375 73.926 l S Q
q 1 0 0 1 0 0 cm
94.176 76.125 m 96.176 72.66 98.91 71.926 102.375 73.926 c 105.84 75.926
 106.574 78.66 104.574 82.125 c S Q
0 0.313726 0.45098 rg
44.738 29.586 m 40.809 30.266 35.094 30.844 30.172 30.844 c 25.742 30.883
 20.199 30.445 15.262 29.629 c 15.34 32.074 16.133 34.16 17.477 35.969 c
 18.699 44.449 24.887 48.656 29.73 48.656 c 35.926 48.656 41.316 43.938 
42.496 35.945 c 43.75 34.355 44.73 31.902 44.738 29.586 c h
23.492 32.855 m 23.316 33.371 23.402 33.898 23.859 34.34 c 24.457 34.918
 25.18 34.895 25.75 34.445 c 26.129 34.129 26.41 33.656 26.273 33.109 c 
26.527 33.176 26.699 33.297 26.828 33.438 c 27.039 33.641 27.016 33.898 
26.957 34.219 c 26.844 34.723 26.312 35.457 25.492 35.594 c 24.031 35.84
 23.402 35.246 22.832 34.766 c 22.492 34.391 22.156 33.875 22.246 33.348
 c 22.305 33.012 23.039 32.891 23.492 32.855 c h
36.488 32.848 m 37.074 32.898 37.508 33.004 37.75 33.266 c 37.883 33.777
 37.621 34.293 37.059 34.855 c 36.18 35.598 35.59 35.801 34.441 35.594 c
 33.922 35.473 33.27 35.016 33.066 34.285 c 33.008 34.086 32.91 33.703 33.105
 33.516 c 33.285 33.305 33.457 33.184 33.723 33.117 c 33.625 33.59 33.758
 34 34.207 34.43 c 34.664 34.82 35.477 34.992 36.082 34.383 c 36.457 34.023
 36.758 33.41 36.488 32.848 c h
19.66 35.434 m 20.707 36.484 22.246 37.438 23.926 38.051 c 25.434 38.629
 26.691 38.719 27.895 37.723 c 28.484 37.25 28.883 36.812 29.348 36.355 
c 29.738 35.953 30.055 35.93 30.473 36.289 c 31.059 36.859 31.566 37.371
 32.039 37.699 c 33.422 38.793 34.516 38.621 36.637 37.82 c 38.027 37.273
 39.527 36.238 40.359 35.441 c 39.961 38.359 39.082 40.625 37.051 43.07 
c 35.348 44.973 33.016 46.422 29.918 46.422 c 27.09 46.422 24.594 44.961
 22.77 42.898 c 21.098 40.871 20.062 38.555 19.66 35.434 c h
28.402 40.684 m 27.66 41.066 27.074 41.426 27.074 42.059 c 27.082 42.535
 27.547 42.672 28.32 42.762 c 29.332 42.852 30.352 42.836 31.367 42.777 
c 32.062 42.738 32.73 42.719 32.941 42.102 c 33.066 41.645 32.41 41.066 
31.891 40.844 c 30.789 40.281 29.379 40.309 28.402 40.684 c h
13.426 28.031 m 12.211 27.82 11.227 26.988 11.273 25.625 c 11.324 24.703
 11.977 23.824 13.492 23.555 c 14.918 23.301 16.816 23.008 18.629 22.805
 c 19.082 20.598 19.5 18.305 19.77 15.531 c 19.754 14.203 20.039 13.105 
21.34 12.426 c 22.164 12.035 23.527 11.961 24.914 12.426 c 27.668 13.52 
32.004 13.633 35.242 12.418 c 36.242 12.086 37.387 11.906 38.535 12.387 
c 39.797 12.957 40.238 14.016 40.199 15.062 c 40.387 17.969 40.848 20.695
 41.324 22.805 c 43.223 23.059 45.188 23.277 46.859 23.645 c 48.105 23.953
 48.727 24.785 48.727 25.746 c 48.727 26.969 47.852 27.664 47.117 27.891
 c 43.191 28.723 37.785 29.645 30.062 29.645 c 24.277 29.645 18.66 29.066
 13.426 28.031 c h
13.426 28.031 m f
1 g
103.125 79.125 m 103.125 81.195 101.445 82.875 99.375 82.875 c 97.305 82.875
 95.625 81.195 95.625 79.125 c 95.625 77.055 97.305 75.375 99.375 75.375
 c 101.445 75.375 103.125 77.055 103.125 79.125 c h
103.125 79.125 m f
0.137255 0.266667 0.364706 rg
4 M q 1 0 0 1 0 0 cm
103.125 79.125 m 103.125 81.195 101.445 82.875 99.375 82.875 c 97.305 82.875
 95.625 81.195 95.625 79.125 c 95.625 77.055 97.305 75.375 99.375 75.375
 c 101.445 75.375 103.125 77.055 103.125 79.125 c h
103.125 79.125 m S Q
Q Q
showpage
%%Trailer
end
%%EOF
