%!PS-Adobe-3.0 EPSF-3.0
%%Creator: cairo 1.16.0 (https://cairographics.org)
%%CreationDate: Thu Jun 24 11:47:14 2021
%%Pages: 1
%%DocumentData: Clean7Bit
%%LanguageLevel: 2
%%BoundingBox: 0 0 52 52
%%EndComments
%%BeginProlog
50 dict begin
/q { gsave } bind def
/Q { grestore } bind def
/cm { 6 array astore concat } bind def
/w { setlinewidth } bind def
/J { setlinecap } bind def
/j { setlinejoin } bind def
/M { setmiterlimit } bind def
/d { setdash } bind def
/m { moveto } bind def
/l { lineto } bind def
/c { curveto } bind def
/h { closepath } bind def
/re { exch dup neg 3 1 roll 5 3 roll moveto 0 rlineto
      0 exch rlineto 0 rlineto closepath } bind def
/S { stroke } bind def
/f { fill } bind def
/f* { eofill } bind def
/n { newpath } bind def
/W { clip } bind def
/W* { eoclip } bind def
/BT { } bind def
/ET { } bind def
/BDC { mark 3 1 roll /BDC pdfmark } bind def
/EMC { mark /EMC pdfmark } bind def
/cairo_store_point { /cairo_point_y exch def /cairo_point_x exch def } def
/Tj { show currentpoint cairo_store_point } bind def
/TJ {
  {
    dup
    type /stringtype eq
    { show } { -0.001 mul 0 cairo_font_matrix dtransform rmoveto } ifelse
  } forall
  currentpoint cairo_store_point
} bind def
/cairo_selectfont { cairo_font_matrix aload pop pop pop 0 0 6 array astore
    cairo_font exch selectfont cairo_point_x cairo_point_y moveto } bind def
/Tf { pop /cairo_font exch def /cairo_font_matrix where
      { pop cairo_selectfont } if } bind def
/Td { matrix translate cairo_font_matrix matrix concatmatrix dup
      /cairo_font_matrix exch def dup 4 get exch 5 get cairo_store_point
      /cairo_font where { pop cairo_selectfont } if } bind def
/Tm { 2 copy 8 2 roll 6 array astore /cairo_font_matrix exch def
      cairo_store_point /cairo_font where { pop cairo_selectfont } if } bind def
/g { setgray } bind def
/rg { setrgbcolor } bind def
/d1 { setcachedevice } bind def
/cairo_data_source {
  CairoDataIndex CairoData length lt
    { CairoData CairoDataIndex get /CairoDataIndex CairoDataIndex 1 add def }
    { () } ifelse
} def
/cairo_flush_ascii85_file { cairo_ascii85_file status { cairo_ascii85_file flushfile } if } def
/cairo_image { image cairo_flush_ascii85_file } def
/cairo_imagemask { imagemask cairo_flush_ascii85_file } def
%%EndProlog
%%BeginSetup
%%EndSetup
%%Page: 1 1
%%BeginPageSetup
%%PageBoundingBox: 0 0 52 52
%%EndPageSetup
q 0 0 52 52 rectclip
1 0 0 -1 0 52 cm q
1 g
50.25 25.875 m 50.25 39.336 39.336 50.25 25.875 50.25 c 12.414 50.25 1.5
 39.336 1.5 25.875 c 1.5 12.414 12.414 1.5 25.875 1.5 c 39.336 1.5 50.25
 12.414 50.25 25.875 c h
50.25 25.875 m f
0 0.313726 0.45098 rg
3 w
0 J
0 j
[] 0.0 d
4 M q 1 0 0 1 0 0 cm
50.25 25.875 m 50.25 39.336 39.336 50.25 25.875 50.25 c 12.414 50.25 1.5
 39.336 1.5 25.875 c 1.5 12.414 12.414 1.5 25.875 1.5 c 39.336 1.5 50.25
 12.414 50.25 25.875 c h
50.25 25.875 m S Q
27.285 34.852 m 27.285 34.516 27.156 34.191 26.918 33.953 c 26.676 33.711
 26.355 33.586 26.016 33.586 c 25.672 33.586 25.359 33.711 25.117 33.953
 c 24.879 34.191 24.742 34.516 24.742 34.852 c 24.742 35.199 24.879 35.512
 25.117 35.754 c 25.598 36.234 26.438 36.234 26.918 35.754 c 27.156 35.512
 27.285 35.199 27.285 34.852 c h
25.117 26.469 m 25.598 26.949 26.438 26.949 26.918 26.469 c 27.156 26.227
 27.285 25.914 27.285 25.566 c 27.285 25.23 27.156 24.914 26.918 24.676 
c 26.676 24.426 26.355 24.301 26.016 24.301 c 25.672 24.301 25.359 24.426
 25.117 24.676 c 24.879 24.914 24.742 25.23 24.742 25.566 c 24.742 25.914
 24.879 26.227 25.117 26.469 c h
25.117 16.59 m 25.598 17.07 26.438 17.07 26.918 16.59 c 27.156 16.352 27.285
 16.035 27.285 15.691 c 27.285 15.352 27.156 15.031 26.918 14.789 c 26.676
 14.551 26.355 14.422 26.016 14.422 c 25.672 14.422 25.359 14.551 25.117
 14.789 c 24.879 15.031 24.742 15.352 24.742 15.691 c 24.742 16.035 24.879
 16.352 25.117 16.59 c h
17.941 31.344 m 17.941 30.996 17.805 30.684 17.566 30.441 c 17.316 30.195
 16.996 30.066 16.664 30.066 c 16.344 30.066 16.02 30.195 15.766 30.441 
c 15.27 30.938 15.27 31.738 15.766 32.242 c 16.266 32.738 17.07 32.738 17.566
 32.242 c 17.805 32.004 17.941 31.68 17.941 31.344 c h
15.398 21.406 m 15.398 21.742 15.523 22.066 15.766 22.305 c 16.266 22.801
 17.07 22.801 17.566 22.305 c 17.805 22.066 17.941 21.742 17.941 21.406 
c 17.941 21.066 17.805 20.746 17.566 20.504 c 17.316 20.258 16.996 20.129
 16.664 20.129 c 16.344 20.129 16.02 20.258 15.766 20.504 c 15.523 20.746
 15.398 21.066 15.398 21.406 c h
34.004 19.207 m 34.004 19.547 34.141 19.867 34.379 20.109 c 34.875 20.602
 35.676 20.602 36.172 20.109 c 36.414 19.867 36.547 19.547 36.547 19.207
 c 36.547 18.871 36.414 18.547 36.172 18.309 c 35.926 18.059 35.602 17.941
 35.281 17.941 c 34.949 17.941 34.629 18.059 34.379 18.309 c 34.141 18.547
 34.004 18.871 34.004 19.207 c h
34.379 30.594 m 34.875 31.086 35.676 31.086 36.172 30.594 c 36.676 30.098
 36.676 29.289 36.172 28.793 c 35.676 28.297 34.875 28.297 34.379 28.793
 c 33.887 29.289 33.887 30.098 34.379 30.594 c h
28.637 34.809 m 28.648 35.496 28.395 36.188 27.871 36.711 c 27.359 37.23
 26.684 37.484 26.016 37.484 c 25.344 37.484 24.668 37.23 24.156 36.711 
c 23.656 36.211 23.398 35.559 23.391 34.898 c 18.832 32.828 l 18.742 32.953
 18.645 33.082 18.523 33.195 c 18.016 33.711 17.34 33.969 16.664 33.969 
c 15.996 33.969 15.324 33.711 14.812 33.195 c 13.785 32.176 13.785 30.512
 14.812 29.484 c 15.066 29.219 15.375 29.023 15.699 28.898 c 15.699 23.844
 l 15.375 23.715 15.066 23.527 14.812 23.266 c 13.785 22.238 13.785 20.574
 14.812 19.547 c 15.832 18.516 17.496 18.516 18.523 19.547 c 19.551 20.574
 19.551 22.238 18.523 23.266 c 18.113 23.676 17.594 23.91 17.055 23.992 
c 17.055 28.746 l 17.594 28.828 18.113 29.07 18.523 29.484 c 19.086 30.047
 19.336 30.801 19.273 31.539 c 23.738 33.562 l 23.852 33.359 23.984 33.164
 24.156 33 c 24.457 32.691 24.816 32.496 25.199 32.371 c 25.199 28.059 l
 24.816 27.93 24.457 27.727 24.156 27.426 c 23.129 26.406 23.129 24.734 
24.156 23.715 c 24.449 23.414 24.809 23.219 25.199 23.102 c 25.199 18.18
 l 24.816 18.051 24.457 17.852 24.156 17.551 c 23.129 16.523 23.129 14.859
 24.156 13.836 c 25.184 12.809 26.852 12.809 27.871 13.836 c 28.898 14.859
 28.898 16.523 27.871 17.551 c 27.504 17.926 27.039 18.156 26.551 18.262
 c 26.551 23.023 l 27.047 23.121 27.512 23.348 27.871 23.715 c 27.887 23.723
 27.887 23.73 27.891 23.738 c 32.828 20.152 l 32.469 19.207 32.664 18.105
 33.422 17.348 c 34.441 16.328 36.113 16.328 37.133 17.348 c 38.16 18.375
 38.16 20.039 37.133 21.066 c 36.621 21.578 35.949 21.832 35.281 21.832 
c 34.695 21.832 34.109 21.629 33.629 21.238 c 28.551 24.938 l 28.77 25.801
 28.551 26.754 27.871 27.426 c 27.504 27.801 27.039 28.035 26.551 28.141
 c 26.551 32.289 l 27.039 32.387 27.504 32.625 27.871 33 c 28.012 33.141
 28.133 33.293 28.238 33.457 c 32.805 30.547 l 32.484 29.633 32.684 28.566
 33.422 27.832 c 34.441 26.812 36.113 26.812 37.133 27.832 c 38.16 28.859
 38.16 30.523 37.133 31.551 c 36.621 32.062 35.949 32.316 35.281 32.316 
c 34.664 32.316 34.059 32.102 33.57 31.672 c h
19.094 39.023 m 12.309 35.941 l 12.309 15.898 l 19.094 12.66 l 19.094 16.453
 l 20.445 16.453 l 20.445 11.586 l 20.445 11.355 20.332 11.137 20.129 11.016
 c 19.934 10.891 19.688 10.875 19.477 10.973 c 11.34 14.859 l 11.102 14.969
 10.949 15.211 10.949 15.473 c 10.949 36.375 l 10.949 36.645 11.109 36.887
 11.348 36.996 c 19.492 40.695 l 19.582 40.734 19.672 40.754 19.77 40.754
 c 19.898 40.754 20.023 40.719 20.137 40.648 c 20.332 40.523 20.445 40.305
 20.445 40.078 c 20.445 35.445 l 19.094 35.445 l h
40.801 15.594 m 40.801 36.496 l 40.801 36.766 40.641 37.004 40.402 37.117
 c 32.258 40.816 l 32.168 40.852 32.078 40.875 31.98 40.875 c 31.852 40.875
 31.727 40.836 31.613 40.77 c 31.418 40.641 31.305 40.426 31.305 40.199 
c 31.305 35.445 l 32.656 35.445 l 32.656 39.141 l 39.441 36.059 l 39.441
 16.02 l 32.656 12.781 l 32.656 16.453 l 31.305 16.453 l 31.305 11.707 l
 31.305 11.477 31.418 11.258 31.621 11.129 c 31.816 11.012 32.062 10.996
 32.273 11.094 c 40.41 14.977 l 40.648 15.09 40.801 15.328 40.801 15.594
 c h
40.801 15.594 m f
Q Q
showpage
%%Trailer
end
%%EOF
