%!PS-Adobe-3.0 EPSF-3.0
%%Creator: cairo 1.16.0 (https://cairographics.org)
%%CreationDate: Thu Jun 17 15:30:41 2021
%%Pages: 1
%%DocumentData: Clean7Bit
%%LanguageLevel: 2
%%BoundingBox: 0 0 209 61
%%EndComments
%%BeginProlog
50 dict begin
/q { gsave } bind def
/Q { grestore } bind def
/cm { 6 array astore concat } bind def
/w { setlinewidth } bind def
/J { setlinecap } bind def
/j { setlinejoin } bind def
/M { setmiterlimit } bind def
/d { setdash } bind def
/m { moveto } bind def
/l { lineto } bind def
/c { curveto } bind def
/h { closepath } bind def
/re { exch dup neg 3 1 roll 5 3 roll moveto 0 rlineto
      0 exch rlineto 0 rlineto closepath } bind def
/S { stroke } bind def
/f { fill } bind def
/f* { eofill } bind def
/n { newpath } bind def
/W { clip } bind def
/W* { eoclip } bind def
/BT { } bind def
/ET { } bind def
/BDC { mark 3 1 roll /BDC pdfmark } bind def
/EMC { mark /EMC pdfmark } bind def
/cairo_store_point { /cairo_point_y exch def /cairo_point_x exch def } def
/Tj { show currentpoint cairo_store_point } bind def
/TJ {
  {
    dup
    type /stringtype eq
    { show } { -0.001 mul 0 cairo_font_matrix dtransform rmoveto } ifelse
  } forall
  currentpoint cairo_store_point
} bind def
/cairo_selectfont { cairo_font_matrix aload pop pop pop 0 0 6 array astore
    cairo_font exch selectfont cairo_point_x cairo_point_y moveto } bind def
/Tf { pop /cairo_font exch def /cairo_font_matrix where
      { pop cairo_selectfont } if } bind def
/Td { matrix translate cairo_font_matrix matrix concatmatrix dup
      /cairo_font_matrix exch def dup 4 get exch 5 get cairo_store_point
      /cairo_font where { pop cairo_selectfont } if } bind def
/Tm { 2 copy 8 2 roll 6 array astore /cairo_font_matrix exch def
      cairo_store_point /cairo_font where { pop cairo_selectfont } if } bind def
/g { setgray } bind def
/rg { setrgbcolor } bind def
/d1 { setcachedevice } bind def
/cairo_data_source {
  CairoDataIndex CairoData length lt
    { CairoData CairoDataIndex get /CairoDataIndex CairoDataIndex 1 add def }
    { () } ifelse
} def
/cairo_flush_ascii85_file { cairo_ascii85_file status { cairo_ascii85_file flushfile } if } def
/cairo_image { image cairo_flush_ascii85_file } def
/cairo_imagemask { imagemask cairo_flush_ascii85_file } def
%%EndProlog
%%BeginSetup
%%EndSetup
%%Page: 1 1
%%BeginPageSetup
%%PageBoundingBox: 0 0 209 61
%%EndPageSetup
q 0 0 209 61 rectclip
1 0 0 -1 0 61 cm q
0.137255 0.266667 0.364706 rg
0.75 w
0 J
0 j
[] 0.0 d
10 M q 1 0 0 1 0 0 cm
44.016 21.168 m 84.422 -5.145 122.18 -6.754 159.492 17.77 c S Q
q 1 0 0 1 0 0 cm
41.301 48.773 m 53.516 59.059 65.359 60.207 79.352 50.805 c S Q
1 g
46.5 22.578 m 46.5 45.828 l 24 58.578 l 1.5 45.828 l 1.5 22.578 l 24 9.828
 l h
46.5 22.578 m f
0 0.313726 0.45098 rg
3 w
q 0 1 -1 0 0 0 cm
22.578 -46.5 m 45.828 -46.5 l 58.578 -24 l 45.828 -1.5 l 22.578 -1.5 l 
9.828 -24 l h
22.578 -46.5 m S Q
0.137255 0.266667 0.364706 rg
0.75 w
q 1 0 0 1 0 0 cm
120.98 49.141 m 134.273 59.668 147.371 60.363 160.273 51.227 c S Q
1 g
126.75 22.578 m 126.75 45.828 l 104.25 58.578 l 81.75 45.828 l 81.75 22.578
 l 104.25 9.828 l h
126.75 22.578 m f
0 0.313726 0.45098 rg
3 w
q 0 1 -1 0 0 0 cm
22.578 -126.75 m 45.828 -126.75 l 58.578 -104.25 l 45.828 -81.75 l 22.578
 -81.75 l 9.828 -104.25 l h
22.578 -126.75 m S Q
1 g
207 22.578 m 207 45.828 l 184.5 58.578 l 162 45.828 l 162 22.578 l 184.5
 9.828 l h
207 22.578 m f
0 0.313726 0.45098 rg
q 0 1 -1 0 0 0 cm
22.578 -207 m 45.828 -207 l 58.578 -184.5 l 45.828 -162 l 22.578 -162 l
 9.828 -184.5 l h
22.578 -207 m S Q
0.137255 0.266667 0.364706 rg
82.621 48.605 m 79.727 53.715 l 79.352 50.805 l 76.801 49.355 l h
82.621 48.605 m f
0.75 w
q 1 0 0 1 0 0 cm
82.621 48.605 m 79.727 53.715 l 79.352 50.805 l 76.801 49.355 l h
82.621 48.605 m S Q
163.484 48.953 m 160.719 54.129 l 160.273 51.227 l 157.68 49.848 l h
163.484 48.953 m f
q 1 0 0 1 0 0 cm
163.484 48.953 m 160.719 54.129 l 160.273 51.227 l 157.68 49.848 l h
163.484 48.953 m S Q
162.777 19.93 m 156.949 19.242 l 159.492 17.77 l 159.84 14.852 l h
162.777 19.93 m f
q 1 0 0 1 0 0 cm
162.777 19.93 m 156.949 19.242 l 159.492 17.77 l 159.84 14.852 l h
162.777 19.93 m S Q
Q Q
showpage
%%Trailer
end
%%EOF
