%!PS-Adobe-3.0 EPSF-3.0
%%Creator: cairo 1.17.4 (https://cairographics.org)
%%CreationDate: Thu Jul 29 16:45:54 2021
%%Pages: 1
%%DocumentData: Clean7Bit
%%LanguageLevel: 2
%%BoundingBox: 0 0 294 144
%%EndComments
%%BeginProlog
50 dict begin
/q { gsave } bind def
/Q { grestore } bind def
/cm { 6 array astore concat } bind def
/w { setlinewidth } bind def
/J { setlinecap } bind def
/j { setlinejoin } bind def
/M { setmiterlimit } bind def
/d { setdash } bind def
/m { moveto } bind def
/l { lineto } bind def
/c { curveto } bind def
/h { closepath } bind def
/re { exch dup neg 3 1 roll 5 3 roll moveto 0 rlineto
      0 exch rlineto 0 rlineto closepath } bind def
/S { stroke } bind def
/f { fill } bind def
/f* { eofill } bind def
/n { newpath } bind def
/W { clip } bind def
/W* { eoclip } bind def
/BT { } bind def
/ET { } bind def
/BDC { mark 3 1 roll /BDC pdfmark } bind def
/EMC { mark /EMC pdfmark } bind def
/cairo_store_point { /cairo_point_y exch def /cairo_point_x exch def } def
/Tj { show currentpoint cairo_store_point } bind def
/TJ {
  {
    dup
    type /stringtype eq
    { show } { -0.001 mul 0 cairo_font_matrix dtransform rmoveto } ifelse
  } forall
  currentpoint cairo_store_point
} bind def
/cairo_selectfont { cairo_font_matrix aload pop pop pop 0 0 6 array astore
    cairo_font exch selectfont cairo_point_x cairo_point_y moveto } bind def
/Tf { pop /cairo_font exch def /cairo_font_matrix where
      { pop cairo_selectfont } if } bind def
/Td { matrix translate cairo_font_matrix matrix concatmatrix dup
      /cairo_font_matrix exch def dup 4 get exch 5 get cairo_store_point
      /cairo_font where { pop cairo_selectfont } if } bind def
/Tm { 2 copy 8 2 roll 6 array astore /cairo_font_matrix exch def
      cairo_store_point /cairo_font where { pop cairo_selectfont } if } bind def
/g { setgray } bind def
/rg { setrgbcolor } bind def
/d1 { setcachedevice } bind def
/cairo_data_source {
  CairoDataIndex CairoData length lt
    { CairoData CairoDataIndex get /CairoDataIndex CairoDataIndex 1 add def }
    { () } ifelse
} def
/cairo_flush_ascii85_file { cairo_ascii85_file status { cairo_ascii85_file flushfile } if } def
/cairo_image { image cairo_flush_ascii85_file } def
/cairo_imagemask { imagemask cairo_flush_ascii85_file } def
%%EndProlog
%%BeginSetup
%%EndSetup
%%Page: 1 1
%%BeginPageSetup
%%PageBoundingBox: 0 0 294 144
%%EndPageSetup
q 0 0 294 144 rectclip
1 0 0 -1 0 144 cm q
1 g
4.875 56.625 m 63.375 56.625 l 65.867 56.625 67.875 58.633 67.875 61.125
 c 67.875 82.125 l 67.875 84.617 65.867 86.625 63.375 86.625 c 4.875 86.625
 l 2.383 86.625 0.375 84.617 0.375 82.125 c 0.375 61.125 l 0.375 58.633 
2.383 56.625 4.875 56.625 c h
4.875 56.625 m f
0 0.313726 0.45098 rg
0.75 w
0 J
0 j
[] 0.0 d
4 M q 1 0 0 1 0 0 cm
4.875 56.625 m 63.375 56.625 l 65.867 56.625 67.875 58.633 67.875 61.125
 c 67.875 82.125 l 67.875 84.617 65.867 86.625 63.375 86.625 c 4.875 86.625
 l 2.383 86.625 0.375 84.617 0.375 82.125 c 0.375 61.125 l 0.375 58.633 
2.383 56.625 4.875 56.625 c h
4.875 56.625 m S Q
1 g
94.875 56.625 m 153.375 56.625 l 155.867 56.625 157.875 58.633 157.875 
61.125 c 157.875 82.125 l 157.875 84.617 155.867 86.625 153.375 86.625 c
 94.875 86.625 l 92.383 86.625 90.375 84.617 90.375 82.125 c 90.375 61.125
 l 90.375 58.633 92.383 56.625 94.875 56.625 c h
94.875 56.625 m f
0 0.313726 0.45098 rg
q 1 0 0 1 0 0 cm
94.875 56.625 m 153.375 56.625 l 155.867 56.625 157.875 58.633 157.875 
61.125 c 157.875 82.125 l 157.875 84.617 155.867 86.625 153.375 86.625 c
 94.875 86.625 l 92.383 86.625 90.375 84.617 90.375 82.125 c 90.375 61.125
 l 90.375 58.633 92.383 56.625 94.875 56.625 c h
94.875 56.625 m S Q
1 g
229.875 56.625 m 288.375 56.625 l 290.867 56.625 292.875 58.633 292.875
 61.125 c 292.875 82.125 l 292.875 84.617 290.867 86.625 288.375 86.625 
c 229.875 86.625 l 227.383 86.625 225.375 84.617 225.375 82.125 c 225.375
 61.125 l 225.375 58.633 227.383 56.625 229.875 56.625 c h
229.875 56.625 m f
0 0.313726 0.45098 rg
q 1 0 0 1 0 0 cm
229.875 56.625 m 288.375 56.625 l 290.867 56.625 292.875 58.633 292.875
 61.125 c 292.875 82.125 l 292.875 84.617 290.867 86.625 288.375 86.625 
c 229.875 86.625 l 227.383 86.625 225.375 84.617 225.375 82.125 c 225.375
 61.125 l 225.375 58.633 227.383 56.625 229.875 56.625 c h
229.875 56.625 m S Q
1 g
120.375 112.875 m 178.875 112.875 l 181.367 112.875 183.375 114.883 183.375
 117.375 c 183.375 138.375 l 183.375 140.867 181.367 142.875 178.875 142.875
 c 120.375 142.875 l 117.883 142.875 115.875 140.867 115.875 138.375 c 115.875
 117.375 l 115.875 114.883 117.883 112.875 120.375 112.875 c h
120.375 112.875 m f
0 0.313726 0.45098 rg
q 1 0 0 1 0 0 cm
120.375 112.875 m 178.875 112.875 l 181.367 112.875 183.375 114.883 183.375
 117.375 c 183.375 138.375 l 183.375 140.867 181.367 142.875 178.875 142.875
 c 120.375 142.875 l 117.883 142.875 115.875 140.867 115.875 138.375 c 115.875
 117.375 l 115.875 114.883 117.883 112.875 120.375 112.875 c h
120.375 112.875 m S Q
1 g
120.375 0.375 m 178.875 0.375 l 181.367 0.375 183.375 2.383 183.375 4.875
 c 183.375 25.875 l 183.375 28.367 181.367 30.375 178.875 30.375 c 120.375
 30.375 l 117.883 30.375 115.875 28.367 115.875 25.875 c 115.875 4.875 l
 115.875 2.383 117.883 0.375 120.375 0.375 c h
120.375 0.375 m f
0 0.313726 0.45098 rg
q 1 0 0 1 0 0 cm
120.375 0.375 m 178.875 0.375 l 181.367 0.375 183.375 2.383 183.375 4.875
 c 183.375 25.875 l 183.375 28.367 181.367 30.375 178.875 30.375 c 120.375
 30.375 l 117.883 30.375 115.875 28.367 115.875 25.875 c 115.875 4.875 l
 115.875 2.383 117.883 0.375 120.375 0.375 c h
120.375 0.375 m S Q
0.137255 0.266667 0.364706 rg
10 M q 1 0 0 1 0 0 cm
34.125 86.625 m 34.125 120.375 l 34.125 125.375 36.625 127.875 41.625 127.875
 c 111.098 127.875 l S Q
115.035 127.875 m 109.785 130.5 l 111.098 127.875 l 109.785 125.25 l h
115.035 127.875 m f
q 1 0 0 1 0 0 cm
115.035 127.875 m 109.785 130.5 l 111.098 127.875 l 109.785 125.25 l h
115.035 127.875 m S Q
q 1 0 0 1 0 0 cm
124.125 51.848 m 124.125 48.613 l 124.125 46.453 126.625 45.375 131.625
 45.375 c 142.125 45.375 l 147.125 45.375 149.625 43.672 149.625 40.262 
c 149.625 35.152 l S Q
124.125 55.785 m 121.5 50.535 l 124.125 51.848 l 126.75 50.535 l h
124.125 55.785 m f
q 1 0 0 1 0 0 cm
124.125 55.785 m 121.5 50.535 l 124.125 51.848 l 126.75 50.535 l h
124.125 55.785 m S Q
149.625 31.215 m 152.25 36.465 l 149.625 35.152 l 147 36.465 l h
149.625 31.215 m f
q 1 0 0 1 0 0 cm
149.625 31.215 m 152.25 36.465 l 149.625 35.152 l 147 36.465 l h
149.625 31.215 m S Q
q 1 0 0 1 0 0 cm
34.125 56.625 m 34.125 22.875 l 34.125 17.875 36.625 15.375 41.625 15.375
 c 111.098 15.375 l S Q
115.035 15.375 m 109.785 18 l 111.098 15.375 l 109.785 12.75 l h
115.035 15.375 m f
q 1 0 0 1 0 0 cm
115.035 15.375 m 109.785 18 l 111.098 15.375 l 109.785 12.75 l h
115.035 15.375 m S Q
q 1 0 0 1 0 0 cm
124.125 91.402 m 124.125 94.637 l 124.125 96.797 126.625 97.875 131.625
 97.875 c 142.125 97.875 l 147.125 97.875 149.625 99.578 149.625 102.988
 c 149.625 108.098 l S Q
124.125 87.465 m 126.75 92.715 l 124.125 91.402 l 121.5 92.715 l h
124.125 87.465 m f
q 1 0 0 1 0 0 cm
124.125 87.465 m 126.75 92.715 l 124.125 91.402 l 121.5 92.715 l h
124.125 87.465 m S Q
149.625 112.035 m 147 106.785 l 149.625 108.098 l 152.25 106.785 l h
149.625 112.035 m f
q 1 0 0 1 0 0 cm
149.625 112.035 m 147 106.785 l 149.625 108.098 l 152.25 106.785 l h
149.625 112.035 m S Q
q 1 0 0 1 0 0 cm
183.375 15.375 m 195.375 15.375 l 200.375 15.375 202.875 17.875 202.875
 22.875 c 202.875 64.125 l 202.875 69.125 205.375 71.625 210.375 71.625 
c 220.598 71.625 l S Q
224.535 71.625 m 219.285 74.25 l 220.598 71.625 l 219.285 69 l h
224.535 71.625 m f
q 1 0 0 1 0 0 cm
224.535 71.625 m 219.285 74.25 l 220.598 71.625 l 219.285 69 l h
224.535 71.625 m S Q
q 1 0 0 1 0 0 cm
183.375 127.875 m 195.375 127.875 l 200.375 127.875 202.875 125.375 202.875
 120.375 c 202.875 79.125 l 202.875 74.125 205.375 71.625 210.375 71.625
 c 220.598 71.625 l S Q
224.535 71.625 m 219.285 74.25 l 220.598 71.625 l 219.285 69 l h
224.535 71.625 m f
q 1 0 0 1 0 0 cm
224.535 71.625 m 219.285 74.25 l 220.598 71.625 l 219.285 69 l h
224.535 71.625 m S Q
q 1 0 0 1 0 0 cm
85.598 71.625 m 72.652 71.625 l S Q
89.535 71.625 m 84.285 74.25 l 85.598 71.625 l 84.285 69 l h
89.535 71.625 m f
q 1 0 0 1 0 0 cm
89.535 71.625 m 84.285 74.25 l 85.598 71.625 l 84.285 69 l h
89.535 71.625 m S Q
68.715 71.625 m 73.965 69 l 72.652 71.625 l 73.965 74.25 l h
68.715 71.625 m f
q 1 0 0 1 0 0 cm
68.715 71.625 m 73.965 69 l 72.652 71.625 l 73.965 74.25 l h
68.715 71.625 m S Q
Q Q
showpage
%%Trailer
end
%%EOF
