%!PS-Adobe-3.0 EPSF-3.0
%%Creator: cairo 1.16.0 (https://cairographics.org)
%%CreationDate: Thu Jun 24 11:02:06 2021
%%Pages: 1
%%DocumentData: Clean7Bit
%%LanguageLevel: 2
%%BoundingBox: 0 0 116 120
%%EndComments
%%BeginProlog
50 dict begin
/q { gsave } bind def
/Q { grestore } bind def
/cm { 6 array astore concat } bind def
/w { setlinewidth } bind def
/J { setlinecap } bind def
/j { setlinejoin } bind def
/M { setmiterlimit } bind def
/d { setdash } bind def
/m { moveto } bind def
/l { lineto } bind def
/c { curveto } bind def
/h { closepath } bind def
/re { exch dup neg 3 1 roll 5 3 roll moveto 0 rlineto
      0 exch rlineto 0 rlineto closepath } bind def
/S { stroke } bind def
/f { fill } bind def
/f* { eofill } bind def
/n { newpath } bind def
/W { clip } bind def
/W* { eoclip } bind def
/BT { } bind def
/ET { } bind def
/BDC { mark 3 1 roll /BDC pdfmark } bind def
/EMC { mark /EMC pdfmark } bind def
/cairo_store_point { /cairo_point_y exch def /cairo_point_x exch def } def
/Tj { show currentpoint cairo_store_point } bind def
/TJ {
  {
    dup
    type /stringtype eq
    { show } { -0.001 mul 0 cairo_font_matrix dtransform rmoveto } ifelse
  } forall
  currentpoint cairo_store_point
} bind def
/cairo_selectfont { cairo_font_matrix aload pop pop pop 0 0 6 array astore
    cairo_font exch selectfont cairo_point_x cairo_point_y moveto } bind def
/Tf { pop /cairo_font exch def /cairo_font_matrix where
      { pop cairo_selectfont } if } bind def
/Td { matrix translate cairo_font_matrix matrix concatmatrix dup
      /cairo_font_matrix exch def dup 4 get exch 5 get cairo_store_point
      /cairo_font where { pop cairo_selectfont } if } bind def
/Tm { 2 copy 8 2 roll 6 array astore /cairo_font_matrix exch def
      cairo_store_point /cairo_font where { pop cairo_selectfont } if } bind def
/g { setgray } bind def
/rg { setrgbcolor } bind def
/d1 { setcachedevice } bind def
/cairo_data_source {
  CairoDataIndex CairoData length lt
    { CairoData CairoDataIndex get /CairoDataIndex CairoDataIndex 1 add def }
    { () } ifelse
} def
/cairo_flush_ascii85_file { cairo_ascii85_file status { cairo_ascii85_file flushfile } if } def
/cairo_image { image cairo_flush_ascii85_file } def
/cairo_imagemask { imagemask cairo_flush_ascii85_file } def
%%EndProlog
%%BeginSetup
%%EndSetup
%%Page: 1 1
%%BeginPageSetup
%%PageBoundingBox: 0 0 116 120
%%EndPageSetup
q 0 0 116 120 rectclip
1 0 0 -1 0 120 cm q
0.137255 0.266667 0.364706 rg
0.75 w
0 J
0 j
[] 0.0 d
10 M q 1 0 0 1 0 0 cm
24 69.223 m 24 50.473 l S Q
q 1 0 0 1 0 0 cm
69 26.098 m 46.5 26.098 l S Q
q 1 0 0 1 0 0 cm
91.5 69.223 m 91.5 50.473 l S Q
1 g
114 81.973 m 114 105.223 l 91.5 117.973 l 69 105.223 l 69 81.973 l 91.5
 69.223 l h
114 81.973 m f
0 0.313726 0.45098 rg
3 w
q 0 1 -1 0 0 0 cm
81.973 -114 m 105.223 -114 l 117.973 -91.5 l 105.223 -69 l 81.973 -69 l
 69.223 -91.5 l h
81.973 -114 m S Q
q 1 0 0 1 0 0 cm
82.125 83.879 m 82.125 81.84 86.324 80.18 91.5 80.18 c 96.676 80.18 100.875
 81.84 100.875 83.879 c 100.875 103.312 l 100.875 105.359 96.676 107.016
 91.5 107.016 c 86.324 107.016 82.125 105.359 82.125 103.312 c h
82.125 83.879 m S Q
q 1 0 0 1 0 0 cm
82.125 83.879 m 82.125 85.926 86.324 87.586 91.5 87.586 c 96.676 87.586
 100.875 85.926 100.875 83.879 c 82.125 89.992 m 82.125 92.031 86.324 93.688
 91.5 93.688 c 96.676 93.688 100.875 92.031 100.875 89.992 c 82.125 96.93
 m 82.125 98.977 86.324 100.625 91.5 100.625 c 96.676 100.625 100.875 98.977
 100.875 96.93 c S Q
1 g
46.5 81.973 m 46.5 105.223 l 24 117.973 l 1.5 105.223 l 1.5 81.973 l 24
 69.223 l h
46.5 81.973 m f
0 0.313726 0.45098 rg
q 0 1 -1 0 0 0 cm
81.973 -46.5 m 105.223 -46.5 l 117.973 -24 l 105.223 -1.5 l 81.973 -1.5
 l 69.223 -24 l h
81.973 -46.5 m S Q
q 1 0 0 1 0 0 cm
14.625 83.879 m 14.625 81.84 18.824 80.18 24 80.18 c 29.176 80.18 33.375
 81.84 33.375 83.879 c 33.375 103.312 l 33.375 105.359 29.176 107.016 24
 107.016 c 18.824 107.016 14.625 105.359 14.625 103.312 c h
14.625 83.879 m S Q
q 1 0 0 1 0 0 cm
14.625 83.879 m 14.625 85.926 18.824 87.586 24 87.586 c 29.176 87.586 33.375
 85.926 33.375 83.879 c 14.625 89.992 m 14.625 92.031 18.824 93.688 24 93.688
 c 29.176 93.688 33.375 92.031 33.375 89.992 c 14.625 96.93 m 14.625 98.977
 18.824 100.625 24 100.625 c 29.176 100.625 33.375 98.977 33.375 96.93 c
 S Q
1 g
46.5 14.473 m 46.5 37.723 l 24 50.473 l 1.5 37.723 l 1.5 14.473 l 24 1.723
 l h
46.5 14.473 m f
0 0.313726 0.45098 rg
q 0 1 -1 0 0 0 cm
14.473 -46.5 m 37.723 -46.5 l 50.473 -24 l 37.723 -1.5 l 14.473 -1.5 l 
1.723 -24 l h
14.473 -46.5 m S Q
16.934 19.238 m 16.656 20.203 l 18.328 20.691 l 18.613 21.863 l 18.488 
21.988 18.449 22.176 18.504 22.348 c 20.504 28.703 l 20.574 28.91 20.766
 29.055 20.984 29.055 c 21.871 29.055 l 21.512 29.781 l 21.488 29.781 21.465
 29.781 21.441 29.781 c 20.484 29.781 19.688 30.57 19.688 31.527 c 19.688
 32.488 20.484 33.285 21.441 33.285 c 22.23 33.285 22.906 32.75 23.113 32.023
 c 26.672 32.023 l 26.879 32.75 27.555 33.285 28.352 33.285 c 29.309 33.285
 30.098 32.496 30.098 31.535 c 30.098 30.578 29.309 29.781 28.352 29.781
 c 27.562 29.781 26.895 30.305 26.676 31.02 c 23.113 31.02 l 23.004 30.652
 22.77 30.336 22.469 30.117 c 22.996 29.055 l 28.629 29.055 l 28.844 29.055
 29.039 28.91 29.109 28.703 c 31.141 22.348 l 31.191 22.199 31.164 22.035
 31.074 21.898 c 30.977 21.773 30.824 21.695 30.66 21.695 c 19.613 21.695
 l 19.238 20.168 l 19.191 19.992 19.066 19.859 18.891 19.805 c h
19.672 22.703 m 29.969 22.703 l 28.262 28.051 l 21.359 28.051 l h
21.441 30.785 m 21.855 30.785 22.184 31.117 22.184 31.527 c 22.184 31.949
 21.855 32.273 21.441 32.273 c 21.023 32.273 20.699 31.949 20.699 31.527
 c 20.699 31.117 21.023 30.785 21.441 30.785 c h
28.352 30.793 m 28.762 30.793 29.094 31.125 29.094 31.535 c 29.094 31.957
 28.762 32.277 28.352 32.277 c 27.93 32.277 27.609 31.957 27.609 31.535 
c 27.609 31.125 27.93 30.793 28.352 30.793 c h
17.211 12.973 m 17.211 15.652 l 15.164 15.652 l 14.281 15.652 13.551 16.379
 13.551 17.266 c 13.551 19.305 l 10.906 19.305 l 10.906 20.309 l 13.551 
20.309 l 13.551 22.453 l 10.906 22.453 l 10.906 23.465 l 13.551 23.465 l
 13.551 25.598 l 10.906 25.598 l 10.906 26.609 l 13.551 26.609 l 13.551 
28.754 l 10.906 28.754 l 10.906 29.758 l 13.551 29.758 l 13.551 31.883 l
 10.906 31.883 l 10.906 32.895 l 13.551 32.895 l 13.551 34.973 l 13.551 
35.855 14.281 36.586 15.164 36.586 c 17.211 36.586 l 17.211 39.223 l 18.219
 39.223 l 18.219 36.586 l 20.363 36.586 l 20.363 39.223 l 21.375 39.223 
l 21.375 36.586 l 23.52 36.586 l 23.52 39.223 l 24.523 39.223 l 24.523 36.586
 l 26.676 36.586 l 26.676 39.223 l 27.684 39.223 l 27.684 36.586 l 29.797
 36.586 l 29.797 39.223 l 30.809 39.223 l 30.809 36.586 l 32.844 36.586 
l 33.727 36.586 34.453 35.855 34.453 34.973 c 34.453 32.895 l 37.094 32.895
 l 37.094 31.883 l 34.453 31.883 l 34.453 29.758 l 37.094 29.758 l 37.094
 28.754 l 34.453 28.754 l 34.453 26.609 l 37.094 26.609 l 37.094 25.598 
l 34.453 25.598 l 34.453 23.465 l 37.094 23.465 l 37.094 22.453 l 34.453
 22.453 l 34.453 20.309 l 37.094 20.309 l 37.094 19.305 l 34.453 19.305 
l 34.453 17.266 l 34.453 16.379 33.727 15.652 32.844 15.652 c 30.809 15.652
 l 30.809 12.973 l 29.797 12.973 l 29.797 15.652 l 27.684 15.652 l 27.684
 12.973 l 26.676 12.973 l 26.676 15.652 l 24.523 15.652 l 24.523 12.973 
l 23.52 12.973 l 23.52 15.652 l 21.375 15.652 l 21.375 12.973 l 20.363 12.973
 l 20.363 15.652 l 18.219 15.652 l 18.219 12.973 l h
15.164 16.656 m 32.844 16.656 l 33.188 16.656 33.449 16.918 33.449 17.266
 c 33.449 34.973 l 33.449 35.316 33.188 35.578 32.844 35.578 c 15.164 35.578
 l 14.82 35.578 14.559 35.316 14.559 34.973 c 14.559 17.266 l 14.559 16.918
 14.82 16.656 15.164 16.656 c h
15.164 16.656 m f
1 g
14.625 18.598 18.75 15 re f
0 0.313726 0.45098 rg
18.098 20.473 m 29.902 20.473 l 30.789 20.473 31.5 21.141 31.5 21.973 c
 31.5 30.223 l 31.5 31.055 30.789 31.723 29.902 31.723 c 18.098 31.723 l
 17.211 31.723 16.5 31.055 16.5 30.223 c 16.5 21.973 l 16.5 21.141 17.211
 20.473 18.098 20.473 c h
18.098 20.473 m f
1 g
17.953 26.07 m 30.039 26.07 l 30.039 30.359 l 17.953 30.359 l h
17.953 21.848 m 30.039 21.848 l 30.039 23.301 l 17.953 23.301 l h
17.953 21.848 m f
114 14.473 m 114 37.723 l 91.5 50.473 l 69 37.723 l 69 14.473 l 91.5 1.723
 l h
114 14.473 m f
0 0.313726 0.45098 rg
q 0 1 -1 0 0 0 cm
14.473 -114 m 37.723 -114 l 50.473 -91.5 l 37.723 -69 l 14.473 -69 l 1.723
 -91.5 l h
14.473 -114 m S Q
84.434 19.238 m 84.156 20.203 l 85.828 20.691 l 86.113 21.863 l 85.988 
21.988 85.949 22.176 86.004 22.348 c 88.004 28.703 l 88.074 28.91 88.266
 29.055 88.484 29.055 c 89.371 29.055 l 89.012 29.781 l 88.988 29.781 88.965
 29.781 88.941 29.781 c 87.984 29.781 87.188 30.57 87.188 31.527 c 87.188
 32.488 87.984 33.285 88.941 33.285 c 89.73 33.285 90.406 32.75 90.613 32.023
 c 94.172 32.023 l 94.379 32.75 95.055 33.285 95.852 33.285 c 96.809 33.285
 97.598 32.496 97.598 31.535 c 97.598 30.578 96.809 29.781 95.852 29.781
 c 95.062 29.781 94.395 30.305 94.176 31.02 c 90.613 31.02 l 90.504 30.652
 90.27 30.336 89.969 30.117 c 90.496 29.055 l 96.129 29.055 l 96.344 29.055
 96.539 28.91 96.609 28.703 c 98.641 22.348 l 98.691 22.199 98.664 22.035
 98.574 21.898 c 98.477 21.773 98.324 21.695 98.16 21.695 c 87.113 21.695
 l 86.738 20.168 l 86.691 19.992 86.566 19.859 86.391 19.805 c h
87.172 22.703 m 97.469 22.703 l 95.762 28.051 l 88.859 28.051 l h
88.941 30.785 m 89.355 30.785 89.684 31.117 89.684 31.527 c 89.684 31.949
 89.355 32.273 88.941 32.273 c 88.523 32.273 88.199 31.949 88.199 31.527
 c 88.199 31.117 88.523 30.785 88.941 30.785 c h
95.852 30.793 m 96.262 30.793 96.594 31.125 96.594 31.535 c 96.594 31.957
 96.262 32.277 95.852 32.277 c 95.43 32.277 95.109 31.957 95.109 31.535 
c 95.109 31.125 95.43 30.793 95.852 30.793 c h
84.711 12.973 m 84.711 15.652 l 82.664 15.652 l 81.781 15.652 81.051 16.379
 81.051 17.266 c 81.051 19.305 l 78.406 19.305 l 78.406 20.309 l 81.051 
20.309 l 81.051 22.453 l 78.406 22.453 l 78.406 23.465 l 81.051 23.465 l
 81.051 25.598 l 78.406 25.598 l 78.406 26.609 l 81.051 26.609 l 81.051 
28.754 l 78.406 28.754 l 78.406 29.758 l 81.051 29.758 l 81.051 31.883 l
 78.406 31.883 l 78.406 32.895 l 81.051 32.895 l 81.051 34.973 l 81.051 
35.855 81.781 36.586 82.664 36.586 c 84.711 36.586 l 84.711 39.223 l 85.719
 39.223 l 85.719 36.586 l 87.863 36.586 l 87.863 39.223 l 88.875 39.223 
l 88.875 36.586 l 91.02 36.586 l 91.02 39.223 l 92.023 39.223 l 92.023 36.586
 l 94.176 36.586 l 94.176 39.223 l 95.184 39.223 l 95.184 36.586 l 97.297
 36.586 l 97.297 39.223 l 98.309 39.223 l 98.309 36.586 l 100.344 36.586
 l 101.227 36.586 101.953 35.855 101.953 34.973 c 101.953 32.895 l 104.594
 32.895 l 104.594 31.883 l 101.953 31.883 l 101.953 29.758 l 104.594 29.758
 l 104.594 28.754 l 101.953 28.754 l 101.953 26.609 l 104.594 26.609 l 104.594
 25.598 l 101.953 25.598 l 101.953 23.465 l 104.594 23.465 l 104.594 22.453
 l 101.953 22.453 l 101.953 20.309 l 104.594 20.309 l 104.594 19.305 l 101.953
 19.305 l 101.953 17.266 l 101.953 16.379 101.227 15.652 100.344 15.652 
c 98.309 15.652 l 98.309 12.973 l 97.297 12.973 l 97.297 15.652 l 95.184
 15.652 l 95.184 12.973 l 94.176 12.973 l 94.176 15.652 l 92.023 15.652 
l 92.023 12.973 l 91.02 12.973 l 91.02 15.652 l 88.875 15.652 l 88.875 12.973
 l 87.863 12.973 l 87.863 15.652 l 85.719 15.652 l 85.719 12.973 l h
82.664 16.656 m 100.344 16.656 l 100.688 16.656 100.949 16.918 100.949 
17.266 c 100.949 34.973 l 100.949 35.316 100.688 35.578 100.344 35.578 c
 82.664 35.578 l 82.32 35.578 82.059 35.316 82.059 34.973 c 82.059 17.266
 l 82.059 16.918 82.32 16.656 82.664 16.656 c h
82.664 16.656 m f
Q Q
showpage
%%Trailer
end
%%EOF
