%!PS-Adobe-3.0 EPSF-3.0
%%Creator: cairo 1.16.0 (https://cairographics.org)
%%CreationDate: Fri Jun 18 17:50:26 2021
%%Pages: 1
%%DocumentData: Clean7Bit
%%LanguageLevel: 2
%%BoundingBox: 0 0 258 138
%%EndComments
%%BeginProlog
50 dict begin
/q { gsave } bind def
/Q { grestore } bind def
/cm { 6 array astore concat } bind def
/w { setlinewidth } bind def
/J { setlinecap } bind def
/j { setlinejoin } bind def
/M { setmiterlimit } bind def
/d { setdash } bind def
/m { moveto } bind def
/l { lineto } bind def
/c { curveto } bind def
/h { closepath } bind def
/re { exch dup neg 3 1 roll 5 3 roll moveto 0 rlineto
      0 exch rlineto 0 rlineto closepath } bind def
/S { stroke } bind def
/f { fill } bind def
/f* { eofill } bind def
/n { newpath } bind def
/W { clip } bind def
/W* { eoclip } bind def
/BT { } bind def
/ET { } bind def
/BDC { mark 3 1 roll /BDC pdfmark } bind def
/EMC { mark /EMC pdfmark } bind def
/cairo_store_point { /cairo_point_y exch def /cairo_point_x exch def } def
/Tj { show currentpoint cairo_store_point } bind def
/TJ {
  {
    dup
    type /stringtype eq
    { show } { -0.001 mul 0 cairo_font_matrix dtransform rmoveto } ifelse
  } forall
  currentpoint cairo_store_point
} bind def
/cairo_selectfont { cairo_font_matrix aload pop pop pop 0 0 6 array astore
    cairo_font exch selectfont cairo_point_x cairo_point_y moveto } bind def
/Tf { pop /cairo_font exch def /cairo_font_matrix where
      { pop cairo_selectfont } if } bind def
/Td { matrix translate cairo_font_matrix matrix concatmatrix dup
      /cairo_font_matrix exch def dup 4 get exch 5 get cairo_store_point
      /cairo_font where { pop cairo_selectfont } if } bind def
/Tm { 2 copy 8 2 roll 6 array astore /cairo_font_matrix exch def
      cairo_store_point /cairo_font where { pop cairo_selectfont } if } bind def
/g { setgray } bind def
/rg { setrgbcolor } bind def
/d1 { setcachedevice } bind def
/cairo_data_source {
  CairoDataIndex CairoData length lt
    { CairoData CairoDataIndex get /CairoDataIndex CairoDataIndex 1 add def }
    { () } ifelse
} def
/cairo_flush_ascii85_file { cairo_ascii85_file status { cairo_ascii85_file flushfile } if } def
/cairo_image { image cairo_flush_ascii85_file } def
/cairo_imagemask { imagemask cairo_flush_ascii85_file } def
%%EndProlog
%%BeginSetup
%%EndSetup
%%Page: 1 1
%%BeginPageSetup
%%PageBoundingBox: 0 0 258 138
%%EndPageSetup
q 0 0 258 138 rectclip
1 0 0 -1 0 138 cm q
1 g
84 24 m 84 36.426 73.926 46.5 61.5 46.5 c 49.074 46.5 39 36.426 39 24 c
 39 11.574 49.074 1.5 61.5 1.5 c 73.926 1.5 84 11.574 84 24 c h
84 24 m f
0 0.313726 0.45098 rg
3 w
0 J
0 j
[] 0.0 d
4 M q 1 0 0 1 0 0 cm
84 24 m 84 36.426 73.926 46.5 61.5 46.5 c 49.074 46.5 39 36.426 39 24 c
 39 11.574 49.074 1.5 61.5 1.5 c 73.926 1.5 84 11.574 84 24 c h
84 24 m S Q
1 g
46.5 114 m 46.5 126.426 36.426 136.5 24 136.5 c 11.574 136.5 1.5 126.426
 1.5 114 c 1.5 101.574 11.574 91.5 24 91.5 c 36.426 91.5 46.5 101.574 46.5
 114 c h
46.5 114 m f
0 0.313726 0.45098 rg
q 1 0 0 1 0 0 cm
46.5 114 m 46.5 126.426 36.426 136.5 24 136.5 c 11.574 136.5 1.5 126.426
 1.5 114 c 1.5 101.574 11.574 91.5 24 91.5 c 36.426 91.5 46.5 101.574 46.5
 114 c h
46.5 114 m S Q
1 g
121.5 84 m 121.5 96.426 111.426 106.5 99 106.5 c 86.574 106.5 76.5 96.426
 76.5 84 c 76.5 71.574 86.574 61.5 99 61.5 c 111.426 61.5 121.5 71.574 121.5
 84 c h
121.5 84 m f
0 0.313726 0.45098 rg
q 1 0 0 1 0 0 cm
121.5 84 m 121.5 96.426 111.426 106.5 99 106.5 c 86.574 106.5 76.5 96.426
 76.5 84 c 76.5 71.574 86.574 61.5 99 61.5 c 111.426 61.5 121.5 71.574 121.5
 84 c h
121.5 84 m S Q
1 g
174 114 m 174 126.426 163.926 136.5 151.5 136.5 c 139.074 136.5 129 126.426
 129 114 c 129 101.574 139.074 91.5 151.5 91.5 c 163.926 91.5 174 101.574
 174 114 c h
174 114 m f
0 0.313726 0.45098 rg
q 1 0 0 1 0 0 cm
174 114 m 174 126.426 163.926 136.5 151.5 136.5 c 139.074 136.5 129 126.426
 129 114 c 129 101.574 139.074 91.5 151.5 91.5 c 163.926 91.5 174 101.574
 174 114 c h
174 114 m S Q
1 g
256.5 114 m 256.5 126.426 246.426 136.5 234 136.5 c 221.574 136.5 211.5
 126.426 211.5 114 c 211.5 101.574 221.574 91.5 234 91.5 c 246.426 91.5 
256.5 101.574 256.5 114 c h
256.5 114 m f
0 0.313726 0.45098 rg
q 1 0 0 1 0 0 cm
256.5 114 m 256.5 126.426 246.426 136.5 234 136.5 c 221.574 136.5 211.5
 126.426 211.5 114 c 211.5 101.574 221.574 91.5 234 91.5 c 246.426 91.5 
256.5 101.574 256.5 114 c h
256.5 114 m S Q
1 g
211.5 46.5 m 211.5 58.926 201.426 69 189 69 c 176.574 69 166.5 58.926 166.5
 46.5 c 166.5 34.074 176.574 24 189 24 c 201.426 24 211.5 34.074 211.5 46.5
 c h
211.5 46.5 m f
0 0.313726 0.45098 rg
q 1 0 0 1 0 0 cm
211.5 46.5 m 211.5 58.926 201.426 69 189 69 c 176.574 69 166.5 58.926 166.5
 46.5 c 166.5 34.074 176.574 24 189 24 c 201.426 24 211.5 34.074 211.5 46.5
 c h
211.5 46.5 m S Q
0.137255 0.266667 0.364706 rg
0.75 w
10 M q 1 0 0 1 0 0 cm
78.031 92.152 m 49.312 103.844 l S Q
45.668 105.328 m 49.539 100.922 l 49.312 103.844 l 51.516 105.781 l h
45.668 105.328 m f
q 1 0 0 1 0 0 cm
45.668 105.328 m 49.539 100.922 l 49.312 103.844 l 51.516 105.781 l h
45.668 105.328 m S Q
q 1 0 0 1 0 0 cm
87.016 64.957 m 75.945 47.137 l S Q
73.867 43.793 m 78.871 46.867 l 75.945 47.137 l 74.406 49.637 l h
73.867 43.793 m f
q 1 0 0 1 0 0 cm
73.867 43.793 m 78.871 46.867 l 75.945 47.137 l 74.406 49.637 l h
73.867 43.793 m S Q
q 1 0 0 1 0 0 cm
162.426 94.336 m 175.754 70.344 l S Q
177.668 66.898 m 177.414 72.766 l 175.754 70.344 l 172.824 70.215 l h
177.668 66.898 m f
q 1 0 0 1 0 0 cm
177.668 66.898 m 177.414 72.766 l 175.754 70.344 l 172.824 70.215 l h
177.668 66.898 m S Q
q 1 0 0 1 0 0 cm
168.203 55.086 m 124.176 73.5 l S Q
120.539 75.023 m 124.371 70.574 l 124.176 73.5 l 126.398 75.422 l h
120.539 75.023 m f
q 1 0 0 1 0 0 cm
120.539 75.023 m 124.371 70.574 l 124.176 73.5 l 126.398 75.422 l h
120.539 75.023 m S Q
q 1 0 0 1 0 0 cm
221.586 95.234 m 204.141 69.188 l S Q
201.945 65.918 m 207.051 68.82 l 204.141 69.188 l 202.688 71.738 l h
201.945 65.918 m f
q 1 0 0 1 0 0 cm
201.945 65.918 m 207.051 68.82 l 204.141 69.188 l 202.688 71.738 l h
201.945 65.918 m S Q
q 1 0 0 1 0 0 cm
166.824 42.699 m 88.359 28.746 l S Q
84.48 28.059 m 90.113 26.391 l 88.359 28.746 l 89.191 31.559 l h
84.48 28.059 m f
q 1 0 0 1 0 0 cm
84.48 28.059 m 90.113 26.391 l 88.359 28.746 l 89.191 31.559 l h
84.48 28.059 m S Q
Q Q
showpage
%%Trailer
end
%%EOF
