%!PS-Adobe-3.0 EPSF-3.0
%%Creator: cairo 1.16.0 (https://cairographics.org)
%%CreationDate: Fri Jun 18 17:52:00 2021
%%Pages: 1
%%DocumentData: Clean7Bit
%%LanguageLevel: 2
%%BoundingBox: 0 0 363 138
%%EndComments
%%BeginProlog
50 dict begin
/q { gsave } bind def
/Q { grestore } bind def
/cm { 6 array astore concat } bind def
/w { setlinewidth } bind def
/J { setlinecap } bind def
/j { setlinejoin } bind def
/M { setmiterlimit } bind def
/d { setdash } bind def
/m { moveto } bind def
/l { lineto } bind def
/c { curveto } bind def
/h { closepath } bind def
/re { exch dup neg 3 1 roll 5 3 roll moveto 0 rlineto
      0 exch rlineto 0 rlineto closepath } bind def
/S { stroke } bind def
/f { fill } bind def
/f* { eofill } bind def
/n { newpath } bind def
/W { clip } bind def
/W* { eoclip } bind def
/BT { } bind def
/ET { } bind def
/BDC { mark 3 1 roll /BDC pdfmark } bind def
/EMC { mark /EMC pdfmark } bind def
/cairo_store_point { /cairo_point_y exch def /cairo_point_x exch def } def
/Tj { show currentpoint cairo_store_point } bind def
/TJ {
  {
    dup
    type /stringtype eq
    { show } { -0.001 mul 0 cairo_font_matrix dtransform rmoveto } ifelse
  } forall
  currentpoint cairo_store_point
} bind def
/cairo_selectfont { cairo_font_matrix aload pop pop pop 0 0 6 array astore
    cairo_font exch selectfont cairo_point_x cairo_point_y moveto } bind def
/Tf { pop /cairo_font exch def /cairo_font_matrix where
      { pop cairo_selectfont } if } bind def
/Td { matrix translate cairo_font_matrix matrix concatmatrix dup
      /cairo_font_matrix exch def dup 4 get exch 5 get cairo_store_point
      /cairo_font where { pop cairo_selectfont } if } bind def
/Tm { 2 copy 8 2 roll 6 array astore /cairo_font_matrix exch def
      cairo_store_point /cairo_font where { pop cairo_selectfont } if } bind def
/g { setgray } bind def
/rg { setrgbcolor } bind def
/d1 { setcachedevice } bind def
/cairo_data_source {
  CairoDataIndex CairoData length lt
    { CairoData CairoDataIndex get /CairoDataIndex CairoDataIndex 1 add def }
    { () } ifelse
} def
/cairo_flush_ascii85_file { cairo_ascii85_file status { cairo_ascii85_file flushfile } if } def
/cairo_image { image cairo_flush_ascii85_file } def
/cairo_imagemask { imagemask cairo_flush_ascii85_file } def
%%EndProlog
%%BeginSetup
%%EndSetup
%%Page: 1 1
%%BeginPageSetup
%%PageBoundingBox: 0 0 363 138
%%EndPageSetup
q 0 0 363 138 rectclip
1 0 0 -1 0 138 cm q
1 g
189 24 m 189 36.426 178.926 46.5 166.5 46.5 c 154.074 46.5 144 36.426 144
 24 c 144 11.574 154.074 1.5 166.5 1.5 c 178.926 1.5 189 11.574 189 24 c
 h
189 24 m f
0 0.313726 0.45098 rg
3 w
0 J
0 j
[] 0.0 d
4 M q 1 0 0 1 0 0 cm
189 24 m 189 36.426 178.926 46.5 166.5 46.5 c 154.074 46.5 144 36.426 144
 24 c 144 11.574 154.074 1.5 166.5 1.5 c 178.926 1.5 189 11.574 189 24 c
 h
189 24 m S Q
1 g
151.5 114 m 151.5 126.426 141.426 136.5 129 136.5 c 116.574 136.5 106.5
 126.426 106.5 114 c 106.5 101.574 116.574 91.5 129 91.5 c 141.426 91.5 
151.5 101.574 151.5 114 c h
151.5 114 m f
0 0.313726 0.45098 rg
q 1 0 0 1 0 0 cm
151.5 114 m 151.5 126.426 141.426 136.5 129 136.5 c 116.574 136.5 106.5
 126.426 106.5 114 c 106.5 101.574 116.574 91.5 129 91.5 c 141.426 91.5 
151.5 101.574 151.5 114 c h
151.5 114 m S Q
1 g
226.5 84 m 226.5 96.426 216.426 106.5 204 106.5 c 191.574 106.5 181.5 96.426
 181.5 84 c 181.5 71.574 191.574 61.5 204 61.5 c 216.426 61.5 226.5 71.574
 226.5 84 c h
226.5 84 m f
0 0.313726 0.45098 rg
q 1 0 0 1 0 0 cm
226.5 84 m 226.5 96.426 216.426 106.5 204 106.5 c 191.574 106.5 181.5 96.426
 181.5 84 c 181.5 71.574 191.574 61.5 204 61.5 c 216.426 61.5 226.5 71.574
 226.5 84 c h
226.5 84 m S Q
1 g
279 114 m 279 126.426 268.926 136.5 256.5 136.5 c 244.074 136.5 234 126.426
 234 114 c 234 101.574 244.074 91.5 256.5 91.5 c 268.926 91.5 279 101.574
 279 114 c h
279 114 m f
0 0.313726 0.45098 rg
q 1 0 0 1 0 0 cm
279 114 m 279 126.426 268.926 136.5 256.5 136.5 c 244.074 136.5 234 126.426
 234 114 c 234 101.574 244.074 91.5 256.5 91.5 c 268.926 91.5 279 101.574
 279 114 c h
279 114 m S Q
1 g
361.5 114 m 361.5 126.426 351.426 136.5 339 136.5 c 326.574 136.5 316.5
 126.426 316.5 114 c 316.5 101.574 326.574 91.5 339 91.5 c 351.426 91.5 
361.5 101.574 361.5 114 c h
361.5 114 m f
0 0.313726 0.45098 rg
q 1 0 0 1 0 0 cm
361.5 114 m 361.5 126.426 351.426 136.5 339 136.5 c 326.574 136.5 316.5
 126.426 316.5 114 c 316.5 101.574 326.574 91.5 339 91.5 c 351.426 91.5 
361.5 101.574 361.5 114 c h
361.5 114 m S Q
1 g
316.5 46.5 m 316.5 58.926 306.426 69 294 69 c 281.574 69 271.5 58.926 271.5
 46.5 c 271.5 34.074 281.574 24 294 24 c 306.426 24 316.5 34.074 316.5 46.5
 c h
316.5 46.5 m f
0 0.313726 0.45098 rg
q 1 0 0 1 0 0 cm
316.5 46.5 m 316.5 58.926 306.426 69 294 69 c 281.574 69 271.5 58.926 271.5
 46.5 c 271.5 34.074 281.574 24 294 24 c 306.426 24 316.5 34.074 316.5 46.5
 c h
316.5 46.5 m S Q
0.137255 0.266667 0.364706 rg
0.75 w
10 M q 1 0 0 1 0 0 cm
183.031 92.152 m 154.312 103.844 l S Q
150.668 105.328 m 154.539 100.922 l 154.312 103.844 l 156.516 105.781 l
 h
150.668 105.328 m f
q 1 0 0 1 0 0 cm
150.668 105.328 m 154.539 100.922 l 154.312 103.844 l 156.516 105.781 l
 h
150.668 105.328 m S Q
q 1 0 0 1 0 0 cm
192.016 64.957 m 180.945 47.137 l S Q
178.867 43.793 m 183.871 46.867 l 180.945 47.137 l 179.406 49.637 l h
178.867 43.793 m f
q 1 0 0 1 0 0 cm
178.867 43.793 m 183.871 46.867 l 180.945 47.137 l 179.406 49.637 l h
178.867 43.793 m S Q
q 1 0 0 1 0 0 cm
267.426 94.336 m 280.754 70.344 l S Q
282.668 66.898 m 282.414 72.766 l 280.754 70.344 l 277.824 70.215 l h
282.668 66.898 m f
q 1 0 0 1 0 0 cm
282.668 66.898 m 282.414 72.766 l 280.754 70.344 l 277.824 70.215 l h
282.668 66.898 m S Q
q 1 0 0 1 0 0 cm
273.203 55.086 m 229.176 73.5 l S Q
225.539 75.023 m 229.371 70.574 l 229.176 73.5 l 231.398 75.422 l h
225.539 75.023 m f
q 1 0 0 1 0 0 cm
225.539 75.023 m 229.371 70.574 l 229.176 73.5 l 231.398 75.422 l h
225.539 75.023 m S Q
q 1 0 0 1 0 0 cm
326.586 95.234 m 309.141 69.188 l S Q
306.945 65.918 m 312.051 68.82 l 309.141 69.188 l 307.688 71.738 l h
306.945 65.918 m f
q 1 0 0 1 0 0 cm
306.945 65.918 m 312.051 68.82 l 309.141 69.188 l 307.688 71.738 l h
306.945 65.918 m S Q
q 1 0 0 1 0 0 cm
271.824 42.699 m 193.359 28.746 l S Q
189.48 28.059 m 195.113 26.391 l 193.359 28.746 l 194.191 31.559 l h
189.48 28.059 m f
q 1 0 0 1 0 0 cm
189.48 28.059 m 195.113 26.391 l 193.359 28.746 l 194.191 31.559 l h
189.48 28.059 m S Q
1 g
61.5 39 m 61.5 51.426 51.426 61.5 39 61.5 c 26.574 61.5 16.5 51.426 16.5
 39 c 16.5 26.574 26.574 16.5 39 16.5 c 51.426 16.5 61.5 26.574 61.5 39 
c h
61.5 39 m f
0 0.313726 0.45098 rg
3 w
4 M q 1 0 0 1 0 0 cm
61.5 39 m 61.5 51.426 51.426 61.5 39 61.5 c 26.574 61.5 16.5 51.426 16.5
 39 c 16.5 26.574 26.574 16.5 39 16.5 c 51.426 16.5 61.5 26.574 61.5 39 
c h
61.5 39 m S Q
1 g
46.5 91.5 m 46.5 103.926 36.426 114 24 114 c 11.574 114 1.5 103.926 1.5
 91.5 c 1.5 79.074 11.574 69 24 69 c 36.426 69 46.5 79.074 46.5 91.5 c h
46.5 91.5 m f
0 0.313726 0.45098 rg
q 1 0 0 1 0 0 cm
46.5 91.5 m 46.5 103.926 36.426 114 24 114 c 11.574 114 1.5 103.926 1.5
 91.5 c 1.5 79.074 11.574 69 24 69 c 36.426 69 46.5 79.074 46.5 91.5 c h
46.5 91.5 m S Q
0.137255 0.266667 0.364706 rg
0.75 w
10 M q 1 0 0 1 0 0 cm
144.141 26.559 m 66.09 35.812 l S Q
62.176 36.27 m 67.078 33.047 l 66.09 35.812 l 67.703 38.258 l h
62.176 36.27 m f
q 1 0 0 1 0 0 cm
62.176 36.27 m 67.078 33.047 l 66.09 35.812 l 67.703 38.258 l h
62.176 36.27 m S Q
q 1 0 0 1 0 0 cm
106.98 109.395 m 50.672 97.223 l S Q
46.824 96.391 m 52.508 94.934 l 50.672 97.223 l 51.398 100.066 l h
46.824 96.391 m f
q 1 0 0 1 0 0 cm
46.824 96.391 m 52.508 94.934 l 50.672 97.223 l 51.398 100.066 l h
46.824 96.391 m S Q
q 1 0 0 1 0 0 cm
182.289 78.09 m 65.316 46.176 l S Q
61.516 45.141 m 67.273 43.988 l 65.316 46.176 l 65.887 49.059 l h
61.516 45.141 m f
q 1 0 0 1 0 0 cm
61.516 45.141 m 67.273 43.988 l 65.316 46.176 l 65.887 49.059 l h
61.516 45.141 m S Q
q 1 0 0 1 0 0 cm
146.176 33.66 m 48.652 79.824 l S Q
45.09 81.512 m 48.711 76.891 l 48.652 79.824 l 50.961 81.637 l h
45.09 81.512 m f
q 1 0 0 1 0 0 cm
45.09 81.512 m 48.711 76.891 l 48.652 79.824 l 50.961 81.637 l h
45.09 81.512 m S Q
Q Q
showpage
%%Trailer
end
%%EOF
