%!PS-Adobe-3.0 EPSF-3.0
%%Creator: cairo 1.16.0 (https://cairographics.org)
%%CreationDate: Tue Jun 15 12:19:01 2021
%%Pages: 1
%%DocumentData: Clean7Bit
%%LanguageLevel: 2
%%BoundingBox: 0 0 300 135
%%EndComments
%%BeginProlog
50 dict begin
/q { gsave } bind def
/Q { grestore } bind def
/cm { 6 array astore concat } bind def
/w { setlinewidth } bind def
/J { setlinecap } bind def
/j { setlinejoin } bind def
/M { setmiterlimit } bind def
/d { setdash } bind def
/m { moveto } bind def
/l { lineto } bind def
/c { curveto } bind def
/h { closepath } bind def
/re { exch dup neg 3 1 roll 5 3 roll moveto 0 rlineto
      0 exch rlineto 0 rlineto closepath } bind def
/S { stroke } bind def
/f { fill } bind def
/f* { eofill } bind def
/n { newpath } bind def
/W { clip } bind def
/W* { eoclip } bind def
/BT { } bind def
/ET { } bind def
/BDC { mark 3 1 roll /BDC pdfmark } bind def
/EMC { mark /EMC pdfmark } bind def
/cairo_store_point { /cairo_point_y exch def /cairo_point_x exch def } def
/Tj { show currentpoint cairo_store_point } bind def
/TJ {
  {
    dup
    type /stringtype eq
    { show } { -0.001 mul 0 cairo_font_matrix dtransform rmoveto } ifelse
  } forall
  currentpoint cairo_store_point
} bind def
/cairo_selectfont { cairo_font_matrix aload pop pop pop 0 0 6 array astore
    cairo_font exch selectfont cairo_point_x cairo_point_y moveto } bind def
/Tf { pop /cairo_font exch def /cairo_font_matrix where
      { pop cairo_selectfont } if } bind def
/Td { matrix translate cairo_font_matrix matrix concatmatrix dup
      /cairo_font_matrix exch def dup 4 get exch 5 get cairo_store_point
      /cairo_font where { pop cairo_selectfont } if } bind def
/Tm { 2 copy 8 2 roll 6 array astore /cairo_font_matrix exch def
      cairo_store_point /cairo_font where { pop cairo_selectfont } if } bind def
/g { setgray } bind def
/rg { setrgbcolor } bind def
/d1 { setcachedevice } bind def
/cairo_data_source {
  CairoDataIndex CairoData length lt
    { CairoData CairoDataIndex get /CairoDataIndex CairoDataIndex 1 add def }
    { () } ifelse
} def
/cairo_flush_ascii85_file { cairo_ascii85_file status { cairo_ascii85_file flushfile } if } def
/cairo_image { image cairo_flush_ascii85_file } def
/cairo_imagemask { imagemask cairo_flush_ascii85_file } def
%%EndProlog
%%BeginSetup
%%EndSetup
%%Page: 1 1
%%BeginPageSetup
%%PageBoundingBox: 0 0 300 135
%%EndPageSetup
q 0 0 300 135 rectclip
1 0 0 -1 0 135 cm q
1 g
0 0 300 135 rectfill
0.137255 0.266667 0.364706 rg
0.75 w
0 J
0 j
[] 0.0 d
10 M q 1 0 0 1 0 0 cm
22.5 120 m 22.5 12.277 l S Q
22.5 8.34 m 25.125 13.59 l 22.5 12.277 l 19.875 13.59 l h
22.5 8.34 m f
q 1 0 0 1 0 0 cm
22.5 8.34 m 25.125 13.59 l 22.5 12.277 l 19.875 13.59 l h
22.5 8.34 m S Q
q 1 0 0 1 0 0 cm
22.5 120 m 287.723 120 l S Q
291.66 120 m 286.41 122.625 l 287.723 120 l 286.41 117.375 l h
291.66 120 m f
q 1 0 0 1 0 0 cm
291.66 120 m 286.41 122.625 l 287.723 120 l 286.41 117.375 l h
291.66 120 m S Q
q 1 0 0 1 0 0 cm
45 22.5 m 75 82.5 150.473 110.078 271.418 105.238 c S Q
276.66 105.031 m 271.484 106.996 l 271.352 103.492 l h
276.66 105.031 m f
q 1 0 0 1 0 0 cm
276.66 105.031 m 271.484 106.996 l 271.352 103.492 l h
276.66 105.031 m S Q
q 1 0 0 1 0 0 cm
45 105 m 170 110 246.594 84.316 274.777 27.945 c S Q
277.125 23.25 m 276.344 28.727 l 273.211 27.164 l h
277.125 23.25 m f
q 1 0 0 1 0 0 cm
277.125 23.25 m 276.344 28.727 l 273.211 27.164 l h
277.125 23.25 m S Q
Q Q
showpage
%%Trailer
end
%%EOF
