<?xml version="1.0" standalone="no"?> <!DOCTYPE svg PUBLIC "-//W3C//DTD SVG 1.0//EN" "http://www.w3.org/TR/2001/REC-SVG-20010904/DTD/svg10.dtd" > <svg xmlns="http://www.w3.org/2000/svg" width="100%" height="100%">
<defs >
<font id="57e1427cda7142ff97c4925758d657a7" horiz-adv-x="593" ><font-face
    font-family="NeoSansW23-Medium"
    units-per-em="1000"
    panose-1="2 11 7 4 3 5 4 4 2 4"
    ascent="1000"
    descent="-216"
    alphabetic="0" />
<missing-glyph horiz-adv-x="500" d="M12 665H487V0H12V665ZM250 375L411 618H88L250 375ZM60 91Q60 91 67 101T85 128T110 167T140 212Q175 266 221 333L60 575V91ZM278 333L440 90V575L278 333ZM250 290L88 48H411L250 290Z" />
<glyph unicode=" " glyph-name="space" horiz-adv-x="250" />
<glyph unicode="!" glyph-name="exclam" horiz-adv-x="376" d="M241 234Q241 226 235 220T221 214H156Q148 214 142 220T135 234L120 742Q120 750 126 755T141 761H236Q244 761 250 756T256 742L241 234ZM252 17Q252 9 247 3T233 -3H143Q135 -3 130 3T124 17V130Q124
149 143 149H233Q252 149 252 130V17Z" />
<glyph unicode="&quot;" glyph-name="quotedbl" horiz-adv-x="420" d="M407 750Q407 748 405 742L337 535Q332 516 318 516H238Q229 516 229 526Q229 532 230 535L281 742Q285 761 301 761H395Q407 761 407 750ZM207 750Q207 748 205 742L137 535Q132 516 118
516H38Q29 516 29 526Q29 532 30 535L81 742Q85 761 101 761H195Q207 761 207 750Z" />
<glyph unicode="#" glyph-name="numbersign" horiz-adv-x="684" d="M634 524L629 479Q628 471 623 465T609 459Q606 459 596 459T573 459T546 458T520 458L504 281H589Q597 281 603 276T609 263V261L604 215Q603 207 598 201T584 195H496L481 19Q480 11 476 6T463
0H384Q376 0 372 5T368 17V19L383 195H253L238 19Q237 11 233 6T220 0H140Q133 0 129 5T124 17V19L139 195H56Q48 195 42 200T36 213V215L41 261Q42 269 47 275T61 281H147L163 458L82 459Q74 459 68 464T62 477V479L67 524Q68 532 73 538T87 544H170L186 724Q187
732 192 737T205 743H285Q292 743 296 738T300 726V724L284 544H414L430 724Q431 732 436 737T449 743H528Q536 743 539 738T543 726V724L527 544H614Q622 544 628 539T634 526V524ZM277 458L261 281H391L407 458H277Z" />
<glyph unicode="$" glyph-name="dollar" horiz-adv-x="630" d="M555 201Q555 169 546 137T516 78T461 30T376 -1V-92Q376 -100 370 -106T356 -112H265Q257 -112 251 -106T245 -92V-7Q206 -5 175 -1T115 10Q107 12 102 17T96 30V102Q96 110 101 115T115 121H117Q132
119 156 118T207 115T256 112T294 111Q361 111 385 134T410 201Q410 216 406 227T392 250T366 272T325 299L193 378Q158 399 136 420T100 463T81 510T75 561Q75 595 84 625T113 680T165 720T245 745V829Q245 837 251 843T265 849H356Q364 849 370 843T376 829V749Q418
747 457 743T517 733Q525 731 530 727T535 714V640Q535 632 531 627T518 622H516Q466 627 417 629T319 632Q263 632 239 614T214 561Q214 549 217 539T230 518T256 496T296 472L416 405Q457 382 484 359T526 310T548 258T555 201Z" />
<glyph unicode="%" glyph-name="percent" horiz-adv-x="811" d="M772 162Q772 76 735 35T630 -6Q562 -6 525 35T487 162V244Q487 330 524 371T630 412Q698 412 735 371T772 244V162ZM674 735Q674 730 670 723L253 18Q247 7 243 2T230 -3H146Q136 -3 136 6Q136
13 140 18L557 723Q564 734 568 738T581 743H665Q674 743 674 735ZM325 499Q325 413 288 372T183 331Q115 331 78 372T40 499V581Q40 667 77 707T183 748Q251 748 288 708T325 581V499ZM687 244Q687 297 672 317T630 337Q603 337 588 317T572 244V162Q572 109 587
89T630 69Q657 69 672 89T687 162V244ZM240 581Q240 634 225 654T183 674Q156 674 141 654T125 581V499Q125 445 140 425T183 405Q210 405 225 425T240 499V581Z" />
<glyph unicode="&amp;" glyph-name="ampersand" horiz-adv-x="718" d="M687 11Q687 0 676 0H564Q559 0 556 1T547 8L510 47Q472 21 425 7T320 -8Q266 -8 218 2T134 36T76 96T55 184V194Q55 225 64 251T90 300T133 343T192 384L185 392Q153 429 134 456T106 504T93
543T90 577V586Q90 660 147 705T318 751Q418 751 475 706T533 586V577Q533 541 521 512T487 459T440 415T385 378L361 363L511 203Q525 234 531 270T537 346V358Q537 366 541 372T554 378H627Q635 378 640 372T645 358V346Q645 282 630 226T585 125L683 21Q687
17 687 11ZM414 586Q414 620 390 638T318 657Q267 657 238 639T208 586V577Q208 565 209 554T217 528T238 495T278 451L287 442L317 460Q345 477 363 490T393 517T409 545T414 577V586ZM266 306Q221 279 207 254T192 194V184Q192 136 228 113T320 90Q358 90 388
98T441 120L266 306Z" />
<glyph unicode="&apos;" glyph-name="quotesingle" horiz-adv-x="220" d="M207 750Q207 748 205 742L137 535Q132 516 118 516H38Q29 516 29 526Q29 532 30 535L81 742Q85 761 101 761H195Q207 761 207 750Z" />
<glyph unicode="(" glyph-name="parenleft" horiz-adv-x="333" d="M303 -185Q303 -195 291 -195H220Q209 -195 201 -192T186 -181Q154 -136 130 -89T89 13T64 129T55 264V283Q55 428 88 534T186 729Q192 737 200 740T220 743H291Q303 743 303 733Q303 725 298
717Q277 679 258 634T223 534T199 418T190 283V264Q190 192 199 130T223 14T257 -85T298 -169Q303 -177 303 -185Z" />
<glyph unicode=")" glyph-name="parenright" horiz-adv-x="333" d="M278 264Q278 191 270 129T245 13T204 -88T147 -181Q141 -189 133 -192T113 -195H42Q30 -195 30 -185Q30 -177 35 -169Q56 -131 75 -86T110 13T134 129T143 264V283Q143 355 134 417T110 534T76
633T35 717Q30 725 30 733Q30 743 42 743H113Q124 743 132 740T147 729Q211 640 244 534T278 283V264Z" />
<glyph unicode="*" glyph-name="asterisk" horiz-adv-x="473" d="M435 583Q435 572 420 567L301 531L375 430Q380 423 380 416Q380 409 374 405L333 375Q328 372 324 372Q316 372 309 382L237 484L165 382Q158 372 150 372Q145 372 141 375L99 405Q93 409 93 416Q93
423 98 430L173 531L55 567Q39 572 39 583Q39 586 40 588L56 637Q59 647 69 647Q73 647 79 645L198 606L196 731Q196 739 199 744T211 750H263Q271 750 274 744T278 730L277 606L395 645Q401 647 405 647Q415 647 418 637L434 588Q435 586 435 583Z" />
<glyph unicode="+" glyph-name="plus" horiz-adv-x="630" d="M548 356Q548 348 542 344T528 340H366V179Q366 171 362 165T350 159H280Q272 159 268 165T264 179V340H103Q95 340 89 344T83 356V426Q83 434 89 438T103 442H264V604Q264 612 268 618T280 624H350Q358
624 362 618T366 604V442H528Q536 442 542 438T548 426V356Z" />
<glyph unicode="," glyph-name="comma" horiz-adv-x="259" d="M203 140Q203 139 201 133L114 -77Q110 -86 107 -91T95 -97H26Q11 -97 11 -83Q11 -79 12 -77L73 133Q79 152 93 152H189Q203 152 203 140Z" />
<glyph unicode="-" glyph-name="hyphen" horiz-adv-x="321" d="M278 276Q278 258 259 258H63Q55 258 49 263T43 276V339Q43 347 49 352T63 358H259Q278 358 278 339V276Z" />
<glyph unicode="." glyph-name="period" horiz-adv-x="259" d="M194 20Q194 12 188 6T174 0H85Q77 0 71 6T65 20V133Q65 141 71 146T85 152H174Q182 152 188 147T194 133V20Z" />
<glyph unicode="/" glyph-name="slash" horiz-adv-x="365" d="M234 723Q236 731 240 737T253 743H334Q342 743 347 739T349 723L132 21Q130 13 126 7T113 0H32Q21 0 18 6T16 21L234 723Z" />
<glyph unicode="0" glyph-name="zero" horiz-adv-x="630" d="M576 334Q576 241 558 176T506 70T424 11T315 -8Q254 -8 206 10T124 69T72 175T54 334V408Q54 501 72 566T123 673T205 732T315 751Q376 751 424 733T506 673T558 567T576 408V334ZM437 408Q437 476
428 520T402 591T363 627T315 638Q289 638 267 628T229 591T203 521T193 408V334Q193 266 202 222T228 152T267 116T315 105Q341 105 363 115T401 152T427 222T437 334V408Z" />
<glyph unicode="1" glyph-name="one" horiz-adv-x="630" d="M129 0Q121 0 115 6T109 20V96Q109 104 115 109T129 114H263V606L132 566Q127 564 120 564Q109 564 109 576V670Q109 678 116 681L293 739Q298 741 303 742T316 743H382Q401 743 401 724V114H535Q543
114 549 109T555 96V20Q555 12 549 6T535 0H129Z" />
<glyph unicode="2" glyph-name="two" horiz-adv-x="630" d="M553 568Q553 505 522 461T428 374L338 314Q267 267 232 224T196 118V114H525Q533 114 539 109T545 96V20Q545 12 539 6T525 0H101Q93 0 87 6T81 20V118Q81 159 93 197T126 269T174 331T233 380L332
446Q361 465 379 479T407 505T420 532T424 568Q424 609 397 625T307 642Q285 642 260 641T208 637T155 633T107 627H105Q97 627 92 633T87 647V707Q87 715 92 719T106 726Q125 731 150 735T201 743T255 749T307 751Q438 751 495 706T553 568Z" />
<glyph unicode="3" glyph-name="three" horiz-adv-x="630" d="M546 208Q546 152 527 112T474 45T394 5T295 -8Q239 -8 193 -1T103 17Q95 19 90 23T84 36V98Q84 106 89 111T102 116H104Q164 110 211 106T295 102Q356 102 381 128T407 208V229Q407 249 404 267T390
299T361 321T315 330H138Q119 330 119 349V412Q119 431 138 431H315Q343 431 361 439T389 460T403 491T407 529V545Q407 564 403 581T386 612T351 633T295 641Q268 641 248 640T206 638T161 633T104 627H102Q94 627 89 632T84 645V707Q84 715 89 719T103 726Q146
737 192 744T295 751Q349 751 395 740T474 705T527 641T546 545V529Q546 476 524 440T460 381Q502 358 524 318T546 229V208Z" />
<glyph unicode="4" glyph-name="four" horiz-adv-x="630" d="M592 199Q592 191 586 185T572 179H498V20Q498 12 493 6T480 0H377Q369 0 364 6T359 20V179H59Q51 179 45 185T39 199V280Q39 298 50 312L358 725Q363 733 369 738T387 743H478Q486 743 492 737T498
723V289H572Q580 289 586 283T592 269V199ZM360 543Q360 549 357 549Q354 549 350 543L175 300Q172 297 172 294Q172 289 180 289H360V543Z" />
<glyph unicode="5" glyph-name="five" horiz-adv-x="630" d="M552 237Q552 124 489 58T295 -8Q250 -8 198 -1T103 17Q95 19 90 23T84 39V98Q84 106 89 111T102 116H104Q164 108 211 105T295 102Q330 102 353 111T389 138T408 181T413 237V242Q413 304 372 329T236
354H101Q96 354 93 358T90 367V369L122 725Q123 733 128 738T142 743H505Q513 743 519 738T525 724V648Q525 640 519 635T505 629H234L219 463H236Q293 463 349 456T451 425T524 358T552 242V237Z" />
<glyph unicode="6" glyph-name="six" horiz-adv-x="630" d="M580 240Q580 184 563 139T513 61T432 10T322 -8Q266 -8 218 10T135 65T80 161T60 301V416Q60 506 77 570T130 674T216 732T337 751Q403 751 450 744T522 732Q533 730 539 726T545 711V649Q545 628 526
628H522Q508 630 486 632T438 637T386 640T337 641Q299 641 273 632T230 602T205 545T196 459Q220 464 257 467T335 470Q384 470 428 459T506 422T560 354T580 250V240ZM444 250Q444 285 433 308T403 344T359 363T307 369Q285 369 252 366T196 358V301Q196 238
205 199T231 138T271 108T322 100Q347 100 369 106T408 129T434 172T444 240V250Z" />
<glyph unicode="7" glyph-name="seven" horiz-adv-x="630" d="M554 649Q554 641 549 631T536 603L266 19Q261 8 255 4T239 0H135Q128 0 125 4T121 15Q121 18 123 24L410 622V624Q410 629 405 629H97Q89 629 83 634T77 647V724Q77 732 83 737T97 743H514Q531 743
542 732T554 703V649Z" />
<glyph unicode="8" glyph-name="eight" horiz-adv-x="630" d="M577 215Q577 156 556 114T500 44T418 5T320 -8H310Q259 -8 213 4T131 44T75 113T54 215V224Q54 275 79 316T145 387Q99 417 79 456T58 543V547Q58 603 78 642T132 705T213 740T310 751H320Q371 751
417 740T498 705T553 642T574 547V543Q574 496 553 457T486 387Q527 358 552 317T577 224V215ZM445 543Q445 594 416 621T320 649H310Q244 649 216 622T187 543V539Q187 495 212 466T295 436H336Q394 436 419 465T445 539V543ZM442 224Q442 242 437 261T419 297T386
323T336 334H295Q265 334 245 324T213 297T195 262T189 224V215Q189 164 219 130T310 96H320Q381 96 411 130T442 215V224Z" />
<glyph unicode="9" glyph-name="nine" horiz-adv-x="630" d="M569 327Q569 237 552 173T499 69T413 11T292 -8Q226 -8 179 -1T107 11Q96 13 90 17T84 32V94Q84 115 103 115H107Q121 113 143 111T191 106T243 103T292 102Q330 102 356 111T399 141T424 198T433
284Q409 279 372 276T294 273Q245 273 201 284T123 321T69 389T49 493V503Q49 558 66 604T116 682T197 733T307 751Q363 751 411 733T494 678T549 582T569 442V327ZM433 442Q433 505 424 544T398 605T358 635T307 643Q281 643 259 637T221 614T195 571T185 503V493Q185
458 196 435T226 399T270 380T322 374Q344 374 377 377T433 385V442Z" />
<glyph unicode=":" glyph-name="colon" horiz-adv-x="259" d="M194 414Q194 406 188 401T174 395H85Q77 395 71 400T65 414V527Q65 535 71 541T85 547H174Q182 547 188 541T194 527V414ZM194 20Q194 12 188 6T174 0H85Q77 0 71 6T65 20V133Q65 141 71 146T85 152H174Q182
152 188 147T194 133V20Z" />
<glyph unicode=";" glyph-name="semicolon" horiz-adv-x="259" d="M194 414Q194 406 188 401T174 395H85Q77 395 71 400T65 414V527Q65 535 71 541T85 547H174Q182 547 188 541T194 527V414ZM196 140Q196 139 194 133L107 -77Q103 -86 100 -91T88 -97H19Q4 -97
4 -83Q4 -79 5 -77L66 133Q72 152 86 152H182Q196 152 196 140Z" />
<glyph unicode="&lt;" glyph-name="less" horiz-adv-x="630" d="M514 153Q514 148 511 144T502 139H392Q384 139 380 142T370 150L139 352Q127 363 122 371T116 391Q116 403 121 411T139 430L370 632Q375 637 379 640T392 643H502Q507 643 510 639T514 629Q514
621 508 617L248 391L508 165Q514 160 514 153Z" />
<glyph unicode="=" glyph-name="equal" horiz-adv-x="630" d="M538 477Q538 469 532 465T518 461H113Q105 461 99 465T93 477V547Q93 555 99 559T113 563H518Q526 563 532 559T538 547V477ZM538 235Q538 227 532 223T518 219H113Q105 219 99 223T93 235V305Q93
313 99 317T113 321H518Q526 321 532 317T538 305V235Z" />
<glyph unicode="&gt;" glyph-name="greater" horiz-adv-x="630" d="M514 391Q514 379 509 371T491 352L260 150Q255 145 251 142T238 139H128Q123 139 120 143T116 153Q116 160 122 165L382 391L122 617Q116 621 116 629Q116 634 119 638T128 643H238Q246 643
250 640T260 632L491 430Q503 419 508 411T514 391Z" />
<glyph unicode="?" glyph-name="question" horiz-adv-x="437" d="M407 579Q407 565 406 551T397 518T376 478T336 425L275 353Q255 329 242 312T229 271V233Q229 225 223 220T209 214H126Q107 214 107 233V271Q107 295 109 313T119 347T137 380T166 418L230 492Q248
513 253 534T259 579V595Q259 613 246 622T201 632Q164 632 124 629T51 621H47Q30 621 30 643V705Q30 717 32 723T48 733Q80 741 121 746T201 751Q249 751 287 744T352 718T393 670T407 595V579ZM233 19Q233 11 227 6T213 0H123Q115 0 109 5T103 19V132Q103 140
109 146T123 152H213Q221 152 227 146T233 132V19Z" />
<glyph unicode="@" glyph-name="at" horiz-adv-x="772" d="M737 362Q737 271 711 211T635 114T518 63T368 48Q292 48 245 83T198 191Q198 196 198 200T199 209L208 326Q215 411 267 451T402 491Q412 491 428 490T462 486T500 482T534 476Q557 473 557 450V446L528
144Q567 150 592 168T633 215T654 281T660 362Q660 407 646 449T603 522T528 573T420 592Q288 592 214 527T129 344L114 186Q113 177 113 169T112 153Q112 109 127 72T173 8T251 -34T362 -49Q397 -49 437 -47T507 -42H513Q520 -42 520 -51V-88Q520 -100 507 -101Q484
-104 447 -107T362 -111Q290 -111 230 -93T127 -42T60 41T36 154Q36 162 36 170T37 186L52 349Q58 419 86 476T161 575T273 638T421 660Q501 660 560 635T659 569T717 473T737 362ZM446 397Q432 399 419 400T391 402Q353 402 336 384T314 322L303 210Q302 205 302
201T302 193Q302 162 319 150T375 137H395Q403 137 409 137T423 138L446 397Z" />
<glyph unicode="A" glyph-name="A" horiz-adv-x="646" d="M627 17Q627 9 622 5T609 0H503Q496 0 491 5T484 17L438 207H208L162 17Q160 10 155 5T143 0H37Q29 0 24 4T19 17Q19 18 19 19T20 22L184 649Q193 684 210 704T246 734T286 748T323 751Q339 751 359 748T399
735T436 704T462 649L626 22Q626 20 626 19T627 17ZM339 618Q337 627 334 630T323 634Q315 634 312 631T307 618L235 321H411L339 618Z" />
<glyph unicode="B" glyph-name="B" horiz-adv-x="650" d="M600 208Q600 148 579 107T518 41T422 4T296 -8Q235 -8 191 -5T123 3Q98 8 87 18T75 57V687Q75 714 85 725T120 741Q140 744 184 747T287 751Q355 751 411 741T509 706T572 644T595 548V528Q595 478 572
438T503 377Q549 357 574 320T600 225V208ZM460 540Q460 592 422 614T287 636Q269 636 250 636T214 634V431H341Q376 431 399 438T435 459T454 489T460 526V540ZM464 223Q464 244 458 263T438 296T400 320T341 329H214V109Q232 109 256 108T296 107Q344 107 376
113T427 132T455 164T464 210V223Z" />
<glyph unicode="C" glyph-name="C" horiz-adv-x="563" d="M518 31Q518 20 512 16T496 8Q490 6 476 4T440 -1T393 -6T338 -8Q293 -8 243 5T152 52T83 146T55 298V445Q55 539 82 598T151 692T243 738T338 751Q367 751 393 749T440 745T475 739T496 735Q506 732 512
728T518 712V645Q518 636 514 630T498 624H496Q483 625 465 626T425 629T382 631T340 632Q308 632 282 623T236 592T206 534T195 445V298Q195 246 206 210T236 152T281 121T340 111Q360 111 382 112T425 114T464 116T496 119H498Q509 119 513 113T518 98V31Z" />
<glyph unicode="D" glyph-name="D" horiz-adv-x="667" d="M612 298Q612 149 531 71T298 -8Q271 -8 242 -7T185 -4T135 0T101 4Q88 6 82 13T75 35V708Q75 723 81 730T101 739Q112 741 134 743T184 747T241 750T298 751Q449 751 530 673T612 445V298ZM474 445Q474
501 461 537T424 595T368 625T298 634Q270 634 250 633T214 631V112Q230 111 250 110T298 109Q335 109 367 117T423 147T460 205T474 298V445Z" />
<glyph unicode="E" glyph-name="E" horiz-adv-x="576" d="M516 27Q516 16 512 12T496 6Q484 4 470 2T434 -3T382 -6T306 -8Q257 -8 215 0T142 30T93 93T75 197V546Q75 610 93 650T142 712T215 743T306 751Q351 751 381 750T433 746T469 742T496 737Q507 735 511
731T516 716V652Q516 644 510 638T496 632H292Q248 632 231 614T213 546V438H484Q492 438 498 432T504 418V346Q504 338 498 332T484 326H213V197Q213 147 230 129T292 111H496Q504 111 510 105T516 91V27Z" />
<glyph unicode="F" glyph-name="F" horiz-adv-x="576" d="M516 652Q516 644 510 638T496 632H292Q248 632 231 614T213 546V438H484Q492 438 498 432T504 418V346Q504 338 498 332T484 326H213V20Q213 12 207 6T193 0H95Q87 0 81 6T75 20V546Q75 610 93 650T142
712T215 743T306 751Q351 751 381 750T433 746T469 742T496 737Q507 735 511 731T516 716V652Z" />
<glyph unicode="G" glyph-name="G" horiz-adv-x="635" d="M560 33Q560 13 541 9Q503 1 452 -3T323 -8Q282 -8 236 7T149 57T82 151T55 299V443Q55 532 80 591T146 685T233 736T326 751Q362 751 395 749T457 744T507 738T541 733Q560 729 560 712V645Q560 634 556
629T540 624H537Q502 627 450 629T326 632Q301 632 278 623T236 591T206 533T195 443V299Q195 246 206 210T236 152T278 121T323 111Q351 111 375 111T422 114V369Q422 377 427 383T441 389H540Q548 389 554 383T560 369V33Z" />
<glyph unicode="H" glyph-name="H" horiz-adv-x="712" d="M637 20Q637 12 631 6T617 0H518Q510 0 504 6T498 20V326H214V20Q214 12 208 6T194 0H95Q87 0 81 6T75 20V724Q75 732 81 737T95 743H194Q202 743 208 738T214 724V448H498V724Q498 732 504 737T518 743H617Q625
743 631 738T637 724V20Z" />
<glyph unicode="I" glyph-name="I" horiz-adv-x="289" d="M214 20Q214 12 208 6T194 0H95Q87 0 81 6T75 20V724Q75 732 81 737T95 743H194Q202 743 208 738T214 724V20Z" />
<glyph unicode="J" glyph-name="J" horiz-adv-x="289" d="M214 -21Q214 -101 175 -134T54 -167Q43 -167 30 -166T6 -164T-14 -161T-26 -159Q-36 -156 -36 -145V-74Q-36 -66 -30 -61T-16 -56H50Q64 -56 69 -50T75 -21V724Q75 732 81 737T95 743H194Q202 743 208
738T214 724V-21Z" />
<glyph unicode="K" glyph-name="K" horiz-adv-x="643" d="M615 9Q615 0 600 0H466Q450 0 443 11L214 352V20Q214 12 208 6T194 0H95Q87 0 81 6T75 20V723Q75 731 81 736T95 742H194Q202 742 208 737T214 723V405L459 734Q463 739 468 740T482 742H596Q615 742
615 730Q615 723 608 714L352 383L610 21Q615 13 615 9Z" />
<glyph unicode="L" glyph-name="L" horiz-adv-x="516" d="M496 27Q496 16 492 12T476 6Q465 3 445 1T400 -4T351 -7T306 -8Q257 -8 215 0T142 30T93 93T75 197V723Q75 731 81 737T95 743H194Q202 743 208 737T214 723V197Q214 147 231 129T292 111H476Q484 111
490 105T496 91V27Z" />
<glyph unicode="M" glyph-name="M" horiz-adv-x="792" d="M717 15Q717 7 712 4T700 0H599Q592 0 588 6T583 20V485Q583 495 580 495Q579 495 575 489L479 298Q474 290 466 286T447 281H346Q336 281 328 285T314 298L217 489Q213 495 212 495Q209 495 209 485V20Q209
12 205 6T193 0H92Q85 0 80 3T75 15V703Q75 720 86 731T115 743H197Q209 743 219 737T234 719L385 413Q389 406 391 403T396 399Q399 399 401 402T407 413L558 719Q563 730 573 736T595 743H677Q694 743 705 732T717 703V15Z" />
<glyph unicode="N" glyph-name="N" horiz-adv-x="712" d="M637 40Q637 23 626 12T597 0H496Q478 0 463 4T435 36L213 523Q209 531 204 531Q199 531 199 523V20Q199 12 194 6T180 0H95Q87 0 81 6T75 20V703Q75 720 86 731T115 743H223Q239 743 248 737T267 711L500
197Q503 189 508 189Q513 189 513 198V724Q513 743 532 743H618Q637 743 637 724V40Z" />
<glyph unicode="O" glyph-name="O" horiz-adv-x="680" d="M625 304Q625 221 604 162T544 66T454 10T340 -8Q278 -8 226 10T136 65T77 162T55 304V439Q55 521 76 580T136 677T226 733T340 751Q402 751 454 733T544 678T603 581T625 439V304ZM485 439Q485 539 450
584T340 630Q266 630 231 585T195 439V304Q195 204 230 159T340 113Q414 113 449 158T485 304V439Z" />
<glyph unicode="P" glyph-name="P" horiz-adv-x="626" d="M591 511Q591 445 568 400T505 328T413 289T303 277Q283 277 257 278T214 281V20Q214 12 209 6T195 0H95Q87 0 81 6T75 20V708Q75 723 83 729T107 738Q146 744 197 747T303 751Q361 751 413 740T504 702T567
631T591 520V511ZM453 520Q453 583 416 609T303 636Q295 636 283 636T257 635T233 634T214 632V394Q220 394 232 394T258 393T284 392T303 391Q384 391 418 421T453 511V520Z" />
<glyph unicode="Q" glyph-name="Q" horiz-adv-x="690" d="M630 304Q630 233 614 180T569 89T500 29T411 -3V-24Q411 -44 419 -50T441 -56H538Q549 -56 555 -60T562 -72V-134Q562 -149 540 -155Q525 -159 495 -162T441 -166Q405 -166 376 -159T325 -134T291 -91T279
-26V-3Q230 6 190 28T121 88T76 179T60 304V439Q60 521 81 580T141 677T231 733T345 751Q407 751 459 733T549 678T608 581T630 439V304ZM490 439Q490 539 455 584T345 630Q271 630 236 585T200 439V304Q200 204 235 159T345 113Q419 113 454 158T490 304V439Z"
/>
<glyph unicode="R" glyph-name="R" horiz-adv-x="653" d="M615 12Q615 0 603 0H481Q473 0 469 6T461 20L317 287H303Q283 287 257 288T214 291V20Q214 12 209 6T195 0H95Q87 0 81 6T75 20V708Q75 723 83 729T107 738Q146 744 197 747T303 751Q361 751 413 740T504
702T567 633T591 525V516Q591 436 555 386T456 312L613 20Q615 17 615 12ZM453 525Q453 582 416 607T303 632Q295 632 283 632T257 631T233 630T214 628V403Q220 403 232 403T258 402T284 401T303 400Q381 400 417 425T453 516V525Z" />
<glyph unicode="S" glyph-name="S" horiz-adv-x="570" d="M525 201Q525 163 512 126T469 59T388 11T262 -8Q205 -8 163 -3T85 10Q77 12 72 17T66 30V102Q66 110 71 115T85 121H87Q102 119 126 118T177 115T226 112T264 111Q331 111 355 134T380 201Q380 216 376
227T362 250T336 272T295 299L163 378Q128 399 106 420T70 463T51 510T45 561Q45 602 58 637T100 697T177 737T295 751Q320 751 348 750T403 745T452 739T487 733Q495 731 500 727T505 714V640Q505 632 501 627T488 622H486Q436 627 387 629T289 632Q233 632 209
614T184 561Q184 549 187 539T200 518T226 496T266 472L386 405Q427 382 454 359T496 310T518 258T525 201Z" />
<glyph unicode="T" glyph-name="T" horiz-adv-x="579" d="M554 645Q554 637 548 632T534 627H359V20Q359 12 353 6T339 0H240Q232 0 226 6T220 20V627H45Q37 627 31 632T25 645V724Q25 732 31 737T45 743H534Q542 743 548 738T554 724V645Z" />
<glyph unicode="U" glyph-name="U" horiz-adv-x="690" d="M620 275Q620 195 600 141T543 54T456 7T345 -8Q285 -8 235 6T148 54T91 141T70 275V724Q70 732 76 737T90 743H189Q197 743 203 738T209 724V275Q209 232 215 201T236 148T278 117T345 107Q385 107 411
117T453 148T475 200T481 275V724Q481 732 487 737T501 743H600Q608 743 614 738T620 724V275Z" />
<glyph unicode="V" glyph-name="V" horiz-adv-x="656" d="M632 726Q632 724 632 724T631 721L467 94Q458 59 441 39T405 9T365 -5T328 -8Q312 -8 292 -5T252 8T215 39T189 94L25 721Q25 723 25 723T24 726Q24 734 29 738T42 743H148Q155 743 160 738T167 726L312
125Q314 116 317 113T328 109Q336 109 339 112T344 125L489 726Q491 733 496 738T508 743H614Q622 743 627 739T632 726Z" />
<glyph unicode="W" glyph-name="W" horiz-adv-x="862" d="M838 726L744 73Q737 26 715 9T654 -8H600Q566 -8 547 10T517 72L438 402Q436 413 432 413Q427 413 425 402L346 72Q335 28 316 10T263 -8H209Q170 -8 148 9T119 73L25 726V729Q25 736 30 739T42 743H148Q154
743 159 738T165 725L237 128Q238 121 238 117T242 113Q245 113 245 117T248 128L334 479Q339 497 352 510T397 524H466Q498 524 511 511T529 479L615 128Q617 121 617 117T621 113Q624 113 624 117T626 128L698 725Q699 733 704 738T715 743H821Q828 743 833 740T838
729V726Z" />
<glyph unicode="X" glyph-name="X" horiz-adv-x="650" d="M627 12Q627 7 623 4T611 0H493Q485 0 479 5T467 20L320 256L182 20Q171 0 156 0H47Q31 0 31 13Q31 16 33 20L246 375L27 724Q25 728 25 730Q25 743 41 743H159Q167 743 173 737T185 724L331 491L466 724Q470
731 477 737T492 743H601Q617 743 617 730Q617 728 615 724L405 372L625 20Q627 17 627 12Z" />
<glyph unicode="Y" glyph-name="Y" horiz-adv-x="615" d="M590 728Q590 726 588 720L436 373Q422 340 407 324T375 300V20Q375 12 370 6T356 0H256Q248 0 243 6T237 20V300Q220 307 205 323T176 373L25 720Q23 726 23 728Q23 734 27 738T39 743H150Q157 743 162
738T169 727L289 429Q294 416 298 413T306 409Q310 409 314 412T324 429L444 727Q446 733 451 738T463 743H573Q581 743 585 739T590 728Z" />
<glyph unicode="Z" glyph-name="Z" horiz-adv-x="588" d="M548 20Q548 12 542 6T528 0H91Q69 0 55 8T40 37V92Q40 101 42 110T53 130L370 605Q373 609 373 614Q373 622 363 622H85Q66 622 66 640V724Q66 743 85 743H488Q510 743 525 734T541 705V647Q541 636 537
626T527 606L215 139Q211 134 211 128Q211 122 220 122H528Q536 122 542 117T548 104V20Z" />
<glyph unicode="[" glyph-name="bracketleft" horiz-adv-x="356" d="M328 -178Q328 -194 309 -194H87Q79 -194 75 -189T70 -175V724Q70 732 74 737T87 743H309Q328 743 328 727V654Q328 637 309 637H204V-88H309Q328 -88 328 -105V-178Z" />
<glyph unicode="\" glyph-name="backslash" horiz-adv-x="385" d="M371 8Q371 2 366 -3T354 -8H253Q245 -8 241 -2T235 13L16 723Q16 725 16 725T15 728Q15 734 20 738T32 743H132Q140 743 145 737T152 723L370 13Q370 11 370 11T371 8Z" />
<glyph unicode="]" glyph-name="bracketright" horiz-adv-x="356" d="M286 -175Q286 -183 282 -188T269 -194H47Q28 -194 28 -178V-105Q28 -88 47 -88H152V637H47Q28 637 28 653V726Q28 743 47 743H269Q277 743 281 738T286 724V-175Z" />
<glyph unicode="^" glyph-name="asciicircum" horiz-adv-x="630" d="M548 573Q548 564 536 564H434Q423 564 418 568T404 580L315 682L226 580Q218 572 213 568T196 564H94Q82 564 82 573Q82 578 87 585L200 733Q208 744 214 747T232 751H398Q410 751 416 748T430
733L543 585Q548 578 548 573Z" />
<glyph unicode="_" glyph-name="underscore" horiz-adv-x="523" d="M554 -98Q554 -106 548 -110T534 -114H-11Q-19 -114 -25 -110T-31 -98V-59Q-31 -51 -25 -47T-11 -43H534Q542 -43 548 -47T554 -59V-98Z" />
<glyph unicode="`" glyph-name="grave" horiz-adv-x="415" d="M273 634Q273 627 264 627H178Q169 627 165 630T155 640L36 764Q32 768 32 772Q32 779 43 779H149Q159 779 163 776T175 764L269 644Q273 640 273 634Z" />
<glyph unicode="a" glyph-name="a" horiz-adv-x="548" d="M483 20Q483 12 477 6T463 0H378Q370 0 364 6T358 20V36Q323 15 288 4T217 -8Q186 -8 155 -1T100 25T60 76T44 159V163Q44 206 57 238T100 292T176 325T288 336H351V380Q351 429 330 445T263 461Q215 461
170 459T100 453H95Q87 453 82 456T77 470V534Q77 551 96 555Q126 561 168 566T263 571Q370 571 426 524T483 380V20ZM351 248H288Q254 248 233 243T199 227T182 200T177 163V159Q177 122 194 110T249 97Q276 97 302 105T351 125V248Z" />
<glyph unicode="b" glyph-name="b" horiz-adv-x="577" d="M532 243Q532 125 473 59T293 -8Q245 -8 192 -1T92 18Q75 23 70 28T65 45V741Q65 749 71 755T85 761H177Q185 761 191 755T197 741V564Q225 568 250 569T293 571Q414 571 473 505T532 320V243ZM400 320Q400
351 396 377T379 422T346 452T293 463Q275 463 247 461T197 456V107Q211 104 238 102T293 100Q325 100 346 111T379 141T395 186T400 243V320Z" />
<glyph unicode="c" glyph-name="c" horiz-adv-x="468" d="M423 31Q423 19 419 14T402 5Q385 0 352 -4T273 -8Q224 -8 183 7T111 52T63 128T45 235V328Q45 389 62 434T110 510T182 556T273 571Q319 571 352 567T402 558Q415 555 419 550T423 532V467Q423 459 418
456T405 452H402Q387 454 374 455T347 457T315 458T273 459Q255 459 238 453T208 433T186 393T177 328V235Q177 196 185 171T207 131T238 110T273 104Q297 104 315 104T347 105T374 107T402 111H405Q413 111 418 108T423 96V31Z" />
<glyph unicode="d" glyph-name="d" horiz-adv-x="577" d="M512 45Q512 34 507 29T485 18Q438 6 385 -1T284 -8Q163 -8 104 58T45 243V320Q45 438 104 504T284 571Q302 571 327 570T380 564V741Q380 749 386 755T400 761H492Q500 761 506 755T512 741V45ZM380 456Q359
459 331 461T284 463Q252 463 231 452T198 422T182 377T177 320V243Q177 212 181 186T198 141T231 111T284 100Q311 100 338 102T380 107V456Z" />
<glyph unicode="e" glyph-name="e" horiz-adv-x="574" d="M526 261Q526 236 506 236H180V233Q180 211 185 189T203 148T240 118T300 106Q355 106 403 109T484 116H487Q495 116 500 113T505 101V35Q505 23 502 17T484 9Q460 4 439 1T397 -4T350 -7T290 -8Q252 -8
210 3T131 43T72 120T48 243V317Q48 375 64 422T110 502T186 553T288 571Q346 571 390 553T465 500T510 420T526 317V261ZM393 334Q393 393 364 425T288 457Q241 457 211 426T181 334V330H393V334Z" />
<glyph unicode="f" glyph-name="f" horiz-adv-x="395" d="M375 690Q375 681 370 677T360 673H315Q279 673 268 662T256 613V564H352Q360 564 366 558T372 544V484Q372 476 366 471T352 465H256V21Q256 13 250 7T236 0H145Q137 0 131 6T124 21V465L35 479Q27 481
21 485T15 498V544Q15 552 21 558T35 564H124V613Q124 661 136 692T171 741T226 766T297 773Q315 773 329 771T357 765Q363 763 369 760T375 749V690Z" />
<glyph unicode="g" glyph-name="g" horiz-adv-x="584" d="M556 495Q556 484 553 481T540 473L507 460Q519 443 525 425T532 380V373Q532 279 471 235T295 191Q255 191 228 196T186 208Q169 197 169 182Q169 167 177 160T203 149L321 121Q372 109 413 98T484 69T529
27T545 -39V-46Q545 -123 487 -163T300 -203Q178 -203 115 -160T52 -37V-28Q52 3 65 31T103 82Q82 98 70 122T58 174V175Q58 198 68 220T98 256Q75 279 66 307T57 373V380Q57 417 70 450T111 509T185 549T295 564H529Q540 564 548 556T556 537V495ZM402 378Q402
396 398 411T381 438T348 456T295 463Q263 463 242 457T209 439T192 412T187 378V370Q187 356 191 342T206 317T239 298T295 291Q357 291 379 311T402 370V378ZM413 -39Q413 -31 410 -24T394 -10T358 4T295 21L206 42Q195 26 188 13T181 -28V-37Q181 -52 186 -64T205
-85T242 -98T300 -103Q336 -103 358 -99T392 -88T409 -71T413 -46V-39Z" />
<glyph unicode="h" glyph-name="h" horiz-adv-x="592" d="M527 21Q527 13 521 7T507 0H415Q407 0 401 6T395 21V350Q395 383 392 404T379 437T354 454T313 459Q262 459 197 425V21Q197 13 191 7T177 0H85Q77 0 71 6T65 21V741Q65 749 71 755T85 761H177Q185 761
191 755T197 741V534Q226 551 260 561T348 571Q400 571 434 554T489 507T518 437T527 350V21Z" />
<glyph unicode="i" glyph-name="i" horiz-adv-x="268" d="M203 659Q203 651 197 645T183 639H86Q78 639 72 645T65 659V747Q65 755 71 761T86 767H183Q191 767 197 761T203 747V659ZM200 21Q200 13 194 7T180 0H88Q80 0 74 6T68 21V544Q68 552 74 558T88 564H180Q188
564 194 558T200 544V21Z" />
<glyph unicode="j" glyph-name="j" horiz-adv-x="268" d="M203 659Q203 651 197 645T182 639H86Q78 639 72 645T66 659V747Q66 755 72 761T86 767H182Q190 767 196 761T203 747V659ZM200 -42Q200 -88 190 -118T161 -167T115 -192T52 -200Q35 -200 20 -199T-14
-194Q-33 -191 -33 -176V-111Q-33 -95 -12 -95H33Q57 -95 62 -84T68 -42V544Q68 552 74 558T88 564H180Q188 564 194 558T200 544V-42Z" />
<glyph unicode="k" glyph-name="k" horiz-adv-x="549" d="M519 12Q519 7 515 4T505 0H383Q375 0 367 6T354 20L197 248V21Q197 13 191 7T177 0H85Q77 0 71 6T65 21V741Q65 749 71 755T85 761H177Q185 761 191 755T197 741V324L368 552Q373 559 379 561T391 564H503Q518
564 518 553Q518 548 514 543L313 296L516 20Q519 15 519 12Z" />
<glyph unicode="l" glyph-name="l" horiz-adv-x="272" d="M202 21Q202 13 197 7T183 0H90Q82 0 76 6T70 21V741Q70 749 76 755T90 761H183Q191 761 196 755T202 741V21Z" />
<glyph unicode="m" glyph-name="m" horiz-adv-x="848" d="M783 21Q783 13 777 7T763 0H671Q663 0 657 6T651 21V361Q651 390 648 408T636 438T614 453T579 458Q565 458 539 453T486 433Q488 416 489 398T490 361V21Q490 13 484 7T470 0H378Q370 0 364 6T358 21V361Q358
390 355 408T345 438T324 453T289 458Q258 458 197 425V21Q197 13 191 7T177 0H85Q77 0 71 6T65 21V544Q65 552 71 558T85 564H172Q180 564 186 558T192 544V523Q224 543 257 557T335 571Q378 571 406 559T452 526Q490 547 527 559T617 571Q668 571 700 555T751
510T776 443T783 361V21Z" />
<glyph unicode="n" glyph-name="n" horiz-adv-x="592" d="M527 21Q527 13 521 7T507 0H415Q407 0 401 6T395 21V347Q395 380 393 401T382 435T356 453T310 459Q284 459 257 450T197 423V21Q197 13 191 7T177 0H85Q77 0 71 6T65 21V544Q65 552 71 558T85 564H172Q180
564 186 558T192 544V523Q214 537 232 546T270 560T309 568T354 571Q408 571 442 554T494 507T520 436T527 347V21Z" />
<glyph unicode="o" glyph-name="o" horiz-adv-x="574" d="M526 241Q526 187 511 142T465 63T391 11T287 -8Q228 -8 184 11T109 63T64 141T48 241V322Q48 376 63 421T109 500T183 552T287 571Q346 571 390 552T465 500T510 422T526 322V241ZM394 322Q394 384 367
420T287 457Q234 457 207 421T180 322V241Q180 179 207 143T287 106Q340 106 367 142T394 241V322Z" />
<glyph unicode="p" glyph-name="p" horiz-adv-x="577" d="M532 243Q532 125 473 59T293 -8Q275 -8 250 -7T197 -1V-178Q197 -186 191 -192T177 -198H85Q77 -198 71 -192T65 -178V518Q65 529 70 534T92 545Q139 557 192 564T293 571Q414 571 473 505T532 320V243ZM400
320Q400 351 396 377T379 422T346 452T293 463Q266 463 239 461T197 456V107Q218 104 246 102T293 100Q325 100 346 111T379 141T395 186T400 243V320Z" />
<glyph unicode="q" glyph-name="q" horiz-adv-x="577" d="M512 -178Q512 -186 506 -192T492 -198H400Q392 -198 386 -192T380 -178V-1Q352 -5 327 -6T284 -8Q163 -8 104 58T45 243V320Q45 438 104 504T284 571Q332 571 385 564T485 545Q502 540 507 535T512 518V-178ZM380
456Q366 459 339 461T284 463Q252 463 231 452T198 422T182 377T177 320V243Q177 212 181 186T198 141T231 111T284 100Q302 100 330 102T380 107V456Z" />
<glyph unicode="r" glyph-name="r" horiz-adv-x="375" d="M355 479Q355 471 349 465T335 459Q294 459 262 450T197 423V21Q197 13 191 7T177 0H85Q77 0 71 6T65 21V544Q65 552 71 558T85 564H172Q180 564 186 558T192 544V523Q229 552 267 561T335 571Q343 571
349 565T355 551V479Z" />
<glyph unicode="s" glyph-name="s" horiz-adv-x="489" d="M444 148Q444 115 432 87T396 37T334 4T248 -8Q233 -8 212 -7T165 -4T115 2T69 12Q50 17 50 35V95Q50 101 54 106T67 111H71Q89 109 113 107T162 104T207 101T239 100Q262 100 276 103T297 113T307 129T310
148Q310 162 300 173T266 199L129 283Q92 306 69 341T45 421Q45 571 235 571Q265 571 289 570T335 565T375 559T413 551Q431 546 431 528V470Q431 451 415 451H411Q400 452 381 454T339 458T292 461T246 463Q210 463 194 454T177 421Q177 409 187 400T217 380L348
300Q379 281 398 262T427 224T441 186T444 148Z" />
<glyph unicode="t" glyph-name="t" horiz-adv-x="405" d="M380 17Q380 2 361 -1Q343 -4 327 -6T293 -8Q251 -8 221 -2T171 21T143 69T134 151V465L40 479Q32 481 26 486T20 499V544Q20 552 26 558T40 564H134V646Q134 654 140 659T154 666L247 682H251Q267 682
267 667V564H357Q365 564 371 558T377 544V485Q377 477 371 471T357 465H267V151Q267 132 268 121T273 104T284 97T306 95H359Q380 95 380 80V17Z" />
<glyph unicode="u" glyph-name="u" horiz-adv-x="592" d="M527 20Q527 12 521 6T507 0H415Q407 0 401 6T395 20V43Q356 17 321 5T238 -7Q200 -7 169 3T115 35Q87 63 76 108T65 217V543Q65 551 71 557T85 564H177Q185 564 191 558T197 543V217Q197 179 201 157T220
121Q231 112 245 108T282 103Q296 103 311 107T342 117T370 130T395 143V543Q395 551 401 557T415 564H507Q515 564 521 558T527 543V20Z" />
<glyph unicode="v" glyph-name="v" horiz-adv-x="551" d="M527 548Q527 543 526 541L400 86Q392 58 379 40T349 12T313 -3T275 -8Q256 -8 237 -4T202 11T172 40T151 86L25 541Q24 543 24 548Q24 564 40 564H140Q155 564 160 544L256 125Q259 111 264 106T275 100Q281
100 286 105T294 125L390 544Q395 564 411 564H511Q527 564 527 548Z" />
<glyph unicode="w" glyph-name="w" horiz-adv-x="819" d="M793 541L702 81Q697 58 692 43T676 17T651 2T613 -3H586Q545 -3 523 16T491 75L412 381Q411 386 409 386Q407 386 406 381L327 75Q317 36 295 17T232 -3H205Q182 -3 167 1T142 16T126 42T116 81L25 541V544Q25
552 31 558T45 564H142Q150 564 154 559T160 546L223 123Q225 109 228 109Q232 109 235 123L318 459Q326 488 337 495T374 502H444Q470 502 481 495T500 459L583 123Q586 109 590 109Q593 109 595 123L658 546Q659 553 663 558T676 564H773Q781 564 787 558T793
544V541Z" />
<glyph unicode="x" glyph-name="x" horiz-adv-x="557" d="M537 13Q537 8 533 4T522 0H408Q400 0 395 3T381 20L267 196L159 20Q151 7 146 4T132 0H29Q17 0 17 11Q17 15 20 20L199 291L30 544Q28 548 28 550Q28 555 32 559T44 564H158Q166 564 171 560T184 544L285
388L379 544Q387 558 392 561T406 564H509Q521 564 521 553Q521 548 518 544L353 292L535 20Q537 16 537 13Z" />
<glyph unicode="y" glyph-name="y" horiz-adv-x="560" d="M535 547Q535 543 534 541L367 -43Q355 -84 341 -113T305 -162T248 -191T163 -200Q151 -200 136 -199T107 -196T79 -192T57 -187Q49 -185 43 -182T36 -170V-106Q36 -98 42 -93T56 -88H58Q68 -88 83 -89T114
-91T145 -93T171 -94Q203 -94 221 -82T250 -30L258 0H243Q232 0 220 2T197 13T175 37T156 83L25 541Q24 544 24 548Q24 564 43 564H144Q151 564 156 559T163 546L264 139Q267 126 270 122T278 117H287L395 547Q397 554 402 559T415 564H517Q525 564 530 559T535
547Z" />
<glyph unicode="z" glyph-name="z" horiz-adv-x="490" d="M450 20Q450 12 444 6T430 0H80Q63 0 52 11T40 40V83Q40 98 53 115L295 448Q298 452 298 454Q298 457 292 457H66Q58 457 53 461T48 473V544Q48 552 54 558T68 564H408Q425 564 436 552T448 523V466Q448
462 447 454T443 443L210 124L208 121Q208 117 214 117H432Q440 117 445 113T450 101V20Z" />
<glyph unicode="{" glyph-name="braceleft" horiz-adv-x="363" d="M353 -181Q353 -198 334 -198H278Q222 -198 187 -190T131 -163T104 -111T96 -31V121Q96 161 82 186T37 233V313Q68 334 81 359T95 425V576Q95 624 102 656T130 707T185 735T277 743H334Q353 743
353 726V653Q353 637 334 637H287Q249 637 239 624T229 576V425Q229 373 212 336T151 273Q194 247 212 210T230 121V-31Q230 -66 240 -79T288 -92H334Q353 -92 353 -108V-181Z" />
<glyph unicode="|" glyph-name="bar" horiz-adv-x="274" d="M204 -174Q204 -182 199 -188T185 -194H90Q82 -194 76 -188T70 -174V723Q70 731 76 737T90 743H185Q193 743 198 737T204 723V-174Z" />
<glyph unicode="}" glyph-name="braceright" horiz-adv-x="363" d="M326 233Q295 212 281 187T267 121V-31Q267 -79 260 -111T232 -162T177 -190T85 -198H29Q10 -198 10 -181V-108Q10 -92 29 -92H75Q113 -92 123 -79T133 -31V121Q133 173 151 210T212 273Q169
299 152 336T134 425V576Q134 611 124 624T76 637H29Q10 637 10 653V726Q10 743 29 743H86Q142 743 177 735T233 708T260 656T268 576V425Q268 385 281 360T326 313V233Z" />
<glyph unicode="~" glyph-name="asciitilde" horiz-adv-x="630" d="M552 475Q552 399 520 368T423 336Q406 336 385 340T348 356L260 417Q248 425 239 427T221 430Q205 430 195 421T185 388V362Q185 342 168 342H97Q79 342 79 362V388Q79 463 111 495T209 528Q226
528 247 523T283 507L371 447Q383 439 393 437T411 434Q429 434 437 443T446 475V501Q446 521 463 521H533Q552 521 552 501V475Z" />
</font>
</defs>
</svg>
