NAME : eil31
COMMENT : Clarke and Wright, 1963; Eilon, Watson-Gandy and Christofides, 1971
TYPE : CVRP
DIMENSION : 31
EDGE_WEIGHT_TYPE : EXPLICIT
EDGE_WEIGHT_FORMAT : LOWER_COL
DISPLAY_DATA_TYPE : NO_DISPLAY
CAPACITY : 140
EDGE_WEIGHT_SECTION
    41    38    80    80    97    92    96    78    98    87   95    77    93    91    98    96    40    73    82    55    52    76    76    76    72    98    98    93    89    68
     3    54    54    64    59    56    39    59    52    58   38    55    52    58    59     5    34    48    16    16    46    44    50    33    58    58    66    55    32
    56    56    67    62    59    41    62    50    61    41   58    53    61    62     5    37    46    19    17    49    46    53    34    61    61    68    58    33
     3    19    13    16    54    20    47    15    30    15   25    19    17    60    46    44    54    68     8    11     4    53    33    32    14    10    64
    16    10    14    54    17    46    12    29    12    22   16    14    61    46    44    54    68     9    11     4    54    30    29    12     9    64
     7    11    53    12    46     8    34    10    24    10    8    71    50    45    58    77    19    20    20    57    27    26    23     8    67
    10    57    13    42     8    32    14    19    10     8   65    46    42    55    72    15    15    14    55    30    29    18     5    66
    48     4    35    45    25     3    12     4     4    63   39    33    48    69    18    15    18    47    21    20    22     7    57
    39    12    45    24    47    30    42    44    40     8    9    22    36    44    42    50     6    27    28    65    48    22
    33     6    21     7     9     3     5    66    39    31   45    65    22    19    21    45    15    15    25    10    55
    39    18    39    24    36    38    49    12     4    30   46    40    36    43    15    18    20    54    39    38
    28     3    15     4     2    65    43    36    53    71   16    18    17    49    19    18    20     5    63
    26    14    24    26    40    16    18    24    44    20   18    25    22    19    19    41    29    34
    14     6     4    62    41    36    51    68    17    14   16    49    21    20    20     5    60
    12    14    54    28    21    38    57    24    18    28   34     8     7    32    18    47
     2    65    42    34    48    67    20    20    20    46   17    16    24     9    58
    66    44    35    50    69    18    18    19    48    19   18    22     7    60
    36    45    18    14    52    47    57    34    60    60   72    62    32
     9    22    36    37    35    41     6    26    26    57   44    26
    31    45    35    33    40    15    18    19    54    39   33
    21    45    39    50    16    44    44    61    51    21
    59    57    64    30    61    61    79    69    18
     6     5    47    34    34    20    15    66
    10    42    28    28    26    12    53
    50    35    34    15    11    60
    32    34    64    52    18
     3    39    24    51
    39    23    52
    15    76
    65
DEMAND_SECTION
1 0
2 24
3 34
4 11
5 15
6 11
7 1
8 3
9 29
10 6
11 25
12 6
13 25
14 2
15 28
16 8
17 10
18 18
19 45
20 33
21 17
22 9
23 16
24 35
25 5
26 60
27 80
28 39
29 95
30 90
31 123
DEPOT_SECTION
1
-1
EOF
