%YAML 1.1
%TAG !u! tag:unity3d.com,2011:
--- !u!1001 &1129672603498383681
PrefabInstance:
  m_ObjectHideFlags: 0
  serializedVersion: 2
  m_Modification:
    m_TransformParent: {fileID: 0}
    m_Modifications:
    - target: {fileID: 4582653606166470506, guid: 4d77b9d7a1021e349a32d208f3f46bc8,
        type: 3}
      propertyPath: m_Color.b
      value: 0.495283
      objectReference: {fileID: 0}
    - target: {fileID: 4582653606166470506, guid: 4d77b9d7a1021e349a32d208f3f46bc8,
        type: 3}
      propertyPath: m_Color.g
      value: 0.6849988
      objectReference: {fileID: 0}
    - target: {fileID: 4582653606166470506, guid: 4d77b9d7a1021e349a32d208f3f46bc8,
        type: 3}
      propertyPath: m_Color.r
      value: 1
      objectReference: {fileID: 0}
    - target: {fileID: 4582653606166470506, guid: 4d77b9d7a1021e349a32d208f3f46bc8,
        type: 3}
      propertyPath: m_Intensity
      value: 2
      objectReference: {fileID: 0}
    - target: {fileID: 5875278831305306525, guid: 4d77b9d7a1021e349a32d208f3f46bc8,
        type: 3}
      propertyPath: m_RootOrder
      value: 0
      objectReference: {fileID: 0}
    - target: {fileID: 5875278831305306525, guid: 4d77b9d7a1021e349a32d208f3f46bc8,
        type: 3}
      propertyPath: m_LocalPosition.x
      value: 0
      objectReference: {fileID: 0}
    - target: {fileID: 5875278831305306525, guid: 4d77b9d7a1021e349a32d208f3f46bc8,
        type: 3}
      propertyPath: m_LocalPosition.y
      value: 0
      objectReference: {fileID: 0}
    - target: {fileID: 5875278831305306525, guid: 4d77b9d7a1021e349a32d208f3f46bc8,
        type: 3}
      propertyPath: m_LocalPosition.z
      value: 0
      objectReference: {fileID: 0}
    - target: {fileID: 5875278831305306525, guid: 4d77b9d7a1021e349a32d208f3f46bc8,
        type: 3}
      propertyPath: m_LocalRotation.w
      value: 1
      objectReference: {fileID: 0}
    - target: {fileID: 5875278831305306525, guid: 4d77b9d7a1021e349a32d208f3f46bc8,
        type: 3}
      propertyPath: m_LocalRotation.x
      value: 0
      objectReference: {fileID: 0}
    - target: {fileID: 5875278831305306525, guid: 4d77b9d7a1021e349a32d208f3f46bc8,
        type: 3}
      propertyPath: m_LocalRotation.y
      value: 0
      objectReference: {fileID: 0}
    - target: {fileID: 5875278831305306525, guid: 4d77b9d7a1021e349a32d208f3f46bc8,
        type: 3}
      propertyPath: m_LocalRotation.z
      value: 0
      objectReference: {fileID: 0}
    - target: {fileID: 5875278831305306525, guid: 4d77b9d7a1021e349a32d208f3f46bc8,
        type: 3}
      propertyPath: m_LocalEulerAnglesHint.x
      value: 0
      objectReference: {fileID: 0}
    - target: {fileID: 5875278831305306525, guid: 4d77b9d7a1021e349a32d208f3f46bc8,
        type: 3}
      propertyPath: m_LocalEulerAnglesHint.y
      value: 0
      objectReference: {fileID: 0}
    - target: {fileID: 5875278831305306525, guid: 4d77b9d7a1021e349a32d208f3f46bc8,
        type: 3}
      propertyPath: m_LocalEulerAnglesHint.z
      value: 0
      objectReference: {fileID: 0}
    - target: {fileID: 7054275555155019304, guid: 4d77b9d7a1021e349a32d208f3f46bc8,
        type: 3}
      propertyPath: _weapon
      value: 
      objectReference: {fileID: 11400000, guid: b84e511fe6a7fd44eba77ada4a824848,
        type: 2}
    - target: {fileID: 8054865670243079081, guid: 4d77b9d7a1021e349a32d208f3f46bc8,
        type: 3}
      propertyPath: m_RootOrder
      value: 1
      objectReference: {fileID: 0}
    - target: {fileID: 8054865670243079081, guid: 4d77b9d7a1021e349a32d208f3f46bc8,
        type: 3}
      propertyPath: m_LocalPosition.y
      value: 0
      objectReference: {fileID: 0}
    - target: {fileID: 8729656684557518081, guid: 4d77b9d7a1021e349a32d208f3f46bc8,
        type: 3}
      propertyPath: m_Name
      value: SwordPickup
      objectReference: {fileID: 0}
    m_RemovedComponents: []
  m_SourcePrefab: {fileID: 100100000, guid: 4d77b9d7a1021e349a32d208f3f46bc8, type: 3}
--- !u!4 &6783628064557381852 stripped
Transform:
  m_CorrespondingSourceObject: {fileID: 5875278831305306525, guid: 4d77b9d7a1021e349a32d208f3f46bc8,
    type: 3}
  m_PrefabInstance: {fileID: 1129672603498383681}
  m_PrefabAsset: {fileID: 0}
--- !u!1001 &8541656183436183658
PrefabInstance:
  m_ObjectHideFlags: 0
  serializedVersion: 2
  m_Modification:
    m_TransformParent: {fileID: 6783628064557381852}
    m_Modifications:
    - target: {fileID: 181534, guid: 13af847dfa6dbe844ba4b7c902f98f67, type: 3}
      propertyPath: m_Name
      value: SM_Wep_Sword_01
      objectReference: {fileID: 0}
    - target: {fileID: 489998, guid: 13af847dfa6dbe844ba4b7c902f98f67, type: 3}
      propertyPath: m_RootOrder
      value: 0
      objectReference: {fileID: 0}
    - target: {fileID: 489998, guid: 13af847dfa6dbe844ba4b7c902f98f67, type: 3}
      propertyPath: m_LocalPosition.x
      value: 0
      objectReference: {fileID: 0}
    - target: {fileID: 489998, guid: 13af847dfa6dbe844ba4b7c902f98f67, type: 3}
      propertyPath: m_LocalPosition.y
      value: 0
      objectReference: {fileID: 0}
    - target: {fileID: 489998, guid: 13af847dfa6dbe844ba4b7c902f98f67, type: 3}
      propertyPath: m_LocalPosition.z
      value: 0
      objectReference: {fileID: 0}
    - target: {fileID: 489998, guid: 13af847dfa6dbe844ba4b7c902f98f67, type: 3}
      propertyPath: m_LocalRotation.w
      value: 0.7071068
      objectReference: {fileID: 0}
    - target: {fileID: 489998, guid: 13af847dfa6dbe844ba4b7c902f98f67, type: 3}
      propertyPath: m_LocalRotation.x
      value: 0.7071068
      objectReference: {fileID: 0}
    - target: {fileID: 489998, guid: 13af847dfa6dbe844ba4b7c902f98f67, type: 3}
      propertyPath: m_LocalRotation.y
      value: 0
      objectReference: {fileID: 0}
    - target: {fileID: 489998, guid: 13af847dfa6dbe844ba4b7c902f98f67, type: 3}
      propertyPath: m_LocalRotation.z
      value: 0
      objectReference: {fileID: 0}
    - target: {fileID: 489998, guid: 13af847dfa6dbe844ba4b7c902f98f67, type: 3}
      propertyPath: m_LocalEulerAnglesHint.x
      value: 90
      objectReference: {fileID: 0}
    - target: {fileID: 489998, guid: 13af847dfa6dbe844ba4b7c902f98f67, type: 3}
      propertyPath: m_LocalEulerAnglesHint.y
      value: 0
      objectReference: {fileID: 0}
    - target: {fileID: 489998, guid: 13af847dfa6dbe844ba4b7c902f98f67, type: 3}
      propertyPath: m_LocalEulerAnglesHint.z
      value: 0
      objectReference: {fileID: 0}
    m_RemovedComponents: []
  m_SourcePrefab: {fileID: 100100000, guid: 13af847dfa6dbe844ba4b7c902f98f67, type: 3}
