{
	"process_id" : 2744,
	"version" : "2020.2.1f1",
	"app_path" : "C:/Program Files/Unity/Hub/Editor/2020.2.1f1/Editor/Unity.exe",
	"app_contents_path" : "C:/Program Files/Unity/Hub/Editor/2020.2.1f1/Editor/Data"
}