%YAML 1.1
%TAG !u! tag:unity3d.com,2011:
--- !u!1001 &4840746268521672315
PrefabInstance:
  m_ObjectHideFlags: 0
  serializedVersion: 2
  m_Modification:
    m_TransformParent: {fileID: 0}
    m_Modifications:
    - target: {fileID: 3554947823290410144, guid: ab6725370571ac244ad7b9ed764ec4dd,
        type: 3}
      propertyPath: m_RootOrder
      value: 0
      objectReference: {fileID: 0}
    - target: {fileID: 3554947823290410144, guid: ab6725370571ac244ad7b9ed764ec4dd,
        type: 3}
      propertyPath: m_LocalPosition.x
      value: 0
      objectReference: {fileID: 0}
    - target: {fileID: 3554947823290410144, guid: ab6725370571ac244ad7b9ed764ec4dd,
        type: 3}
      propertyPath: m_LocalPosition.y
      value: 0
      objectReference: {fileID: 0}
    - target: {fileID: 3554947823290410144, guid: ab6725370571ac244ad7b9ed764ec4dd,
        type: 3}
      propertyPath: m_LocalPosition.z
      value: 0
      objectReference: {fileID: 0}
    - target: {fileID: 3554947823290410144, guid: ab6725370571ac244ad7b9ed764ec4dd,
        type: 3}
      propertyPath: m_LocalRotation.w
      value: 1
      objectReference: {fileID: 0}
    - target: {fileID: 3554947823290410144, guid: ab6725370571ac244ad7b9ed764ec4dd,
        type: 3}
      propertyPath: m_LocalRotation.x
      value: 0
      objectReference: {fileID: 0}
    - target: {fileID: 3554947823290410144, guid: ab6725370571ac244ad7b9ed764ec4dd,
        type: 3}
      propertyPath: m_LocalRotation.y
      value: 0
      objectReference: {fileID: 0}
    - target: {fileID: 3554947823290410144, guid: ab6725370571ac244ad7b9ed764ec4dd,
        type: 3}
      propertyPath: m_LocalRotation.z
      value: 0
      objectReference: {fileID: 0}
    - target: {fileID: 3554947823290410144, guid: ab6725370571ac244ad7b9ed764ec4dd,
        type: 3}
      propertyPath: m_LocalEulerAnglesHint.x
      value: 0
      objectReference: {fileID: 0}
    - target: {fileID: 3554947823290410144, guid: ab6725370571ac244ad7b9ed764ec4dd,
        type: 3}
      propertyPath: m_LocalEulerAnglesHint.y
      value: 0
      objectReference: {fileID: 0}
    - target: {fileID: 3554947823290410144, guid: ab6725370571ac244ad7b9ed764ec4dd,
        type: 3}
      propertyPath: m_LocalEulerAnglesHint.z
      value: 0
      objectReference: {fileID: 0}
    - target: {fileID: 3554947823290410202, guid: ab6725370571ac244ad7b9ed764ec4dd,
        type: 3}
      propertyPath: m_Name
      value: Archer
      objectReference: {fileID: 0}
    - target: {fileID: 3554947823290410205, guid: ab6725370571ac244ad7b9ed764ec4dd,
        type: 3}
      propertyPath: _defaultWeapon
      value: 
      objectReference: {fileID: 11400000, guid: d614d425c9754e343879c37bda4619b3,
        type: 2}
    - target: {fileID: 3554947823290410205, guid: ab6725370571ac244ad7b9ed764ec4dd,
        type: 3}
      propertyPath: _defaultWeaponConfig
      value: 
      objectReference: {fileID: 11400000, guid: d614d425c9754e343879c37bda4619b3,
        type: 2}
    - target: {fileID: 3959387917571872953, guid: ab6725370571ac244ad7b9ed764ec4dd,
        type: 3}
      propertyPath: takeDamage.m_PersistentCalls.m_Calls.Array.size
      value: 2
      objectReference: {fileID: 0}
    - target: {fileID: 3959387917571872953, guid: ab6725370571ac244ad7b9ed764ec4dd,
        type: 3}
      propertyPath: takeDamage.m_PersistentCalls.m_Calls.Array.data[0].m_Mode
      value: 0
      objectReference: {fileID: 0}
    - target: {fileID: 3959387917571872953, guid: ab6725370571ac244ad7b9ed764ec4dd,
        type: 3}
      propertyPath: takeDamage.m_PersistentCalls.m_Calls.Array.data[1].m_Mode
      value: 1
      objectReference: {fileID: 0}
    - target: {fileID: 3959387917571872953, guid: ab6725370571ac244ad7b9ed764ec4dd,
        type: 3}
      propertyPath: takeDamage.m_PersistentCalls.m_Calls.Array.data[0].m_Target
      value: 
      objectReference: {fileID: 8101980092759916604}
    - target: {fileID: 3959387917571872953, guid: ab6725370571ac244ad7b9ed764ec4dd,
        type: 3}
      propertyPath: takeDamage.m_PersistentCalls.m_Calls.Array.data[1].m_Target
      value: 
      objectReference: {fileID: 4045270139702809265}
    - target: {fileID: 3959387917571872953, guid: ab6725370571ac244ad7b9ed764ec4dd,
        type: 3}
      propertyPath: takeDamage.m_PersistentCalls.m_Calls.Array.data[0].m_CallState
      value: 2
      objectReference: {fileID: 0}
    - target: {fileID: 3959387917571872953, guid: ab6725370571ac244ad7b9ed764ec4dd,
        type: 3}
      propertyPath: takeDamage.m_PersistentCalls.m_Calls.Array.data[0].m_MethodName
      value: Spawn
      objectReference: {fileID: 0}
    - target: {fileID: 3959387917571872953, guid: ab6725370571ac244ad7b9ed764ec4dd,
        type: 3}
      propertyPath: takeDamage.m_PersistentCalls.m_Calls.Array.data[1].m_MethodName
      value: Play
      objectReference: {fileID: 0}
    - target: {fileID: 3959387917571872953, guid: ab6725370571ac244ad7b9ed764ec4dd,
        type: 3}
      propertyPath: takeDamage.m_PersistentCalls.m_Calls.Array.data[0].m_TargetAssemblyTypeName
      value: RPG.UI.DamageText.DamageTextSpawner, Assembly-CSharp
      objectReference: {fileID: 0}
    - target: {fileID: 3959387917571872953, guid: ab6725370571ac244ad7b9ed764ec4dd,
        type: 3}
      propertyPath: takeDamage.m_PersistentCalls.m_Calls.Array.data[1].m_TargetAssemblyTypeName
      value: UnityEngine.AudioSource, UnityEngine
      objectReference: {fileID: 0}
    - target: {fileID: 3959387917571872953, guid: ab6725370571ac244ad7b9ed764ec4dd,
        type: 3}
      propertyPath: takeDamage.m_PersistentCalls.m_Calls.Array.data[0].m_Arguments.m_ObjectArgumentAssemblyTypeName
      value: UnityEngine.Object, UnityEngine
      objectReference: {fileID: 0}
    - target: {fileID: 3959387917571872953, guid: ab6725370571ac244ad7b9ed764ec4dd,
        type: 3}
      propertyPath: takeDamage.m_PersistentCalls.m_Calls.Array.data[1].m_Arguments.m_ObjectArgumentAssemblyTypeName
      value: UnityEngine.Object, UnityEngine
      objectReference: {fileID: 0}
    - target: {fileID: 4597600097685134665, guid: ab6725370571ac244ad7b9ed764ec4dd,
        type: 3}
      propertyPath: _startingLevel
      value: 2
      objectReference: {fileID: 0}
    - target: {fileID: 4597600097685134665, guid: ab6725370571ac244ad7b9ed764ec4dd,
        type: 3}
      propertyPath: _characterClass
      value: 3
      objectReference: {fileID: 0}
    - target: {fileID: 8804216811413675495, guid: ab6725370571ac244ad7b9ed764ec4dd,
        type: 3}
      propertyPath: m_Materials.Array.data[0]
      value: 
      objectReference: {fileID: 2100000, guid: bfbe2e8b331e2cc42be1591f949c0e41, type: 2}
    m_RemovedComponents: []
  m_SourcePrefab: {fileID: 100100000, guid: ab6725370571ac244ad7b9ed764ec4dd, type: 3}
--- !u!114 &8101980092759916604 stripped
MonoBehaviour:
  m_CorrespondingSourceObject: {fileID: 3701337543618719303, guid: ab6725370571ac244ad7b9ed764ec4dd,
    type: 3}
  m_PrefabInstance: {fileID: 4840746268521672315}
  m_PrefabAsset: {fileID: 0}
  m_GameObject: {fileID: 0}
  m_Enabled: 1
  m_EditorHideFlags: 0
  m_Script: {fileID: 11500000, guid: b6aaef8d19eca374e92df2e759b8ffb6, type: 3}
  m_Name: 
  m_EditorClassIdentifier: 
--- !u!82 &4045270139702809265 stripped
AudioSource:
  m_CorrespondingSourceObject: {fileID: 8867137790319738058, guid: ab6725370571ac244ad7b9ed764ec4dd,
    type: 3}
  m_PrefabInstance: {fileID: 4840746268521672315}
  m_PrefabAsset: {fileID: 0}
