%YAML 1.1
%TAG !u! tag:unity3d.com,2011:
--- !u!1 &2897048053213046890
GameObject:
  m_ObjectHideFlags: 0
  m_CorrespondingSourceObject: {fileID: 0}
  m_PrefabInstance: {fileID: 0}
  m_PrefabAsset: {fileID: 0}
  serializedVersion: 6
  m_Component:
  - component: {fileID: 6218445771122716967}
  - component: {fileID: 7060860356491608120}
  m_Layer: 31
  m_Name: Ground Items
  m_TagString: Untagged
  m_Icon: {fileID: 0}
  m_NavMeshLayer: 0
  m_StaticEditorFlags: 0
  m_IsActive: 1
--- !u!4 &6218445771122716967
Transform:
  m_ObjectHideFlags: 0
  m_CorrespondingSourceObject: {fileID: 0}
  m_PrefabInstance: {fileID: 0}
  m_PrefabAsset: {fileID: 0}
  m_GameObject: {fileID: 2897048053213046890}
  m_LocalRotation: {x: 0, y: 0, z: 0, w: 1}
  m_LocalPosition: {x: 0, y: 0, z: 0}
  m_LocalScale: {x: 1, y: 1, z: 1}
  m_Children:
  - {fileID: 4500805386663134865}
  m_Father: {fileID: 0}
  m_RootOrder: 0
  m_LocalEulerAnglesHint: {x: 0, y: 0, z: 0}
--- !u!156049354 &7060860356491608120
Grid:
  m_ObjectHideFlags: 0
  m_CorrespondingSourceObject: {fileID: 0}
  m_PrefabInstance: {fileID: 0}
  m_PrefabAsset: {fileID: 0}
  m_GameObject: {fileID: 2897048053213046890}
  m_Enabled: 1
  m_CellSize: {x: 1, y: 1, z: 0}
  m_CellGap: {x: 0, y: 0, z: 0}
  m_CellLayout: 0
  m_CellSwizzle: 0
--- !u!1 &4175124285439598330
GameObject:
  m_ObjectHideFlags: 0
  m_CorrespondingSourceObject: {fileID: 0}
  m_PrefabInstance: {fileID: 0}
  m_PrefabAsset: {fileID: 0}
  serializedVersion: 6
  m_Component:
  - component: {fileID: 4500805386663134865}
  - component: {fileID: 1356443071771266407}
  - component: {fileID: 8402181660349667256}
  m_Layer: 31
  m_Name: Layer1
  m_TagString: Untagged
  m_Icon: {fileID: 0}
  m_NavMeshLayer: 0
  m_StaticEditorFlags: 0
  m_IsActive: 1
--- !u!4 &4500805386663134865
Transform:
  m_ObjectHideFlags: 0
  m_CorrespondingSourceObject: {fileID: 0}
  m_PrefabInstance: {fileID: 0}
  m_PrefabAsset: {fileID: 0}
  m_GameObject: {fileID: 4175124285439598330}
  m_LocalRotation: {x: -0, y: -0, z: -0, w: 1}
  m_LocalPosition: {x: 0, y: 0, z: 0}
  m_LocalScale: {x: 1, y: 1, z: 1}
  m_Children: []
  m_Father: {fileID: 6218445771122716967}
  m_RootOrder: 0
  m_LocalEulerAnglesHint: {x: 0, y: 0, z: 0}
--- !u!1839735485 &1356443071771266407
Tilemap:
  m_ObjectHideFlags: 0
  m_CorrespondingSourceObject: {fileID: 0}
  m_PrefabInstance: {fileID: 0}
  m_PrefabAsset: {fileID: 0}
  m_GameObject: {fileID: 4175124285439598330}
  m_Enabled: 1
  m_Tiles:
  - first: {x: -2, y: -5, z: 0}
    second:
      serializedVersion: 2
      m_TileIndex: 42
      m_TileSpriteIndex: 42
      m_TileMatrixIndex: 0
      m_TileColorIndex: 0
      m_TileObjectToInstantiateIndex: 65535
      m_AllTileFlags: 1073741825
  - first: {x: -1, y: -5, z: 0}
    second:
      serializedVersion: 2
      m_TileIndex: 43
      m_TileSpriteIndex: 43
      m_TileMatrixIndex: 0
      m_TileColorIndex: 0
      m_TileObjectToInstantiateIndex: 65535
      m_AllTileFlags: 1073741825
  - first: {x: 0, y: -5, z: 0}
    second:
      serializedVersion: 2
      m_TileIndex: 44
      m_TileSpriteIndex: 44
      m_TileMatrixIndex: 0
      m_TileColorIndex: 0
      m_TileObjectToInstantiateIndex: 65535
      m_AllTileFlags: 1073741825
  - first: {x: 1, y: -5, z: 0}
    second:
      serializedVersion: 2
      m_TileIndex: 45
      m_TileSpriteIndex: 45
      m_TileMatrixIndex: 0
      m_TileColorIndex: 0
      m_TileObjectToInstantiateIndex: 65535
      m_AllTileFlags: 1073741825
  - first: {x: 3, y: -5, z: 0}
    second:
      serializedVersion: 2
      m_TileIndex: 46
      m_TileSpriteIndex: 46
      m_TileMatrixIndex: 0
      m_TileColorIndex: 0
      m_TileObjectToInstantiateIndex: 65535
      m_AllTileFlags: 1073741825
  - first: {x: 4, y: -5, z: 0}
    second:
      serializedVersion: 2
      m_TileIndex: 47
      m_TileSpriteIndex: 47
      m_TileMatrixIndex: 0
      m_TileColorIndex: 0
      m_TileObjectToInstantiateIndex: 65535
      m_AllTileFlags: 1073741825
  - first: {x: 5, y: -5, z: 0}
    second:
      serializedVersion: 2
      m_TileIndex: 48
      m_TileSpriteIndex: 48
      m_TileMatrixIndex: 0
      m_TileColorIndex: 0
      m_TileObjectToInstantiateIndex: 65535
      m_AllTileFlags: 1073741825
  - first: {x: -2, y: -4, z: 0}
    second:
      serializedVersion: 2
      m_TileIndex: 37
      m_TileSpriteIndex: 37
      m_TileMatrixIndex: 0
      m_TileColorIndex: 0
      m_TileObjectToInstantiateIndex: 65535
      m_AllTileFlags: 1073741825
  - first: {x: -1, y: -4, z: 0}
    second:
      serializedVersion: 2
      m_TileIndex: 38
      m_TileSpriteIndex: 38
      m_TileMatrixIndex: 0
      m_TileColorIndex: 0
      m_TileObjectToInstantiateIndex: 65535
      m_AllTileFlags: 1073741825
  - first: {x: 3, y: -4, z: 0}
    second:
      serializedVersion: 2
      m_TileIndex: 39
      m_TileSpriteIndex: 39
      m_TileMatrixIndex: 0
      m_TileColorIndex: 0
      m_TileObjectToInstantiateIndex: 65535
      m_AllTileFlags: 1073741825
  - first: {x: 4, y: -4, z: 0}
    second:
      serializedVersion: 2
      m_TileIndex: 40
      m_TileSpriteIndex: 40
      m_TileMatrixIndex: 0
      m_TileColorIndex: 0
      m_TileObjectToInstantiateIndex: 65535
      m_AllTileFlags: 1073741825
  - first: {x: 5, y: -4, z: 0}
    second:
      serializedVersion: 2
      m_TileIndex: 41
      m_TileSpriteIndex: 41
      m_TileMatrixIndex: 0
      m_TileColorIndex: 0
      m_TileObjectToInstantiateIndex: 65535
      m_AllTileFlags: 1073741825
  - first: {x: -2, y: -3, z: 0}
    second:
      serializedVersion: 2
      m_TileIndex: 30
      m_TileSpriteIndex: 30
      m_TileMatrixIndex: 0
      m_TileColorIndex: 0
      m_TileObjectToInstantiateIndex: 65535
      m_AllTileFlags: 1073741825
  - first: {x: -1, y: -3, z: 0}
    second:
      serializedVersion: 2
      m_TileIndex: 31
      m_TileSpriteIndex: 31
      m_TileMatrixIndex: 0
      m_TileColorIndex: 0
      m_TileObjectToInstantiateIndex: 65535
      m_AllTileFlags: 1073741825
  - first: {x: 0, y: -3, z: 0}
    second:
      serializedVersion: 2
      m_TileIndex: 32
      m_TileSpriteIndex: 32
      m_TileMatrixIndex: 0
      m_TileColorIndex: 0
      m_TileObjectToInstantiateIndex: 65535
      m_AllTileFlags: 1073741825
  - first: {x: 1, y: -3, z: 0}
    second:
      serializedVersion: 2
      m_TileIndex: 33
      m_TileSpriteIndex: 33
      m_TileMatrixIndex: 0
      m_TileColorIndex: 0
      m_TileObjectToInstantiateIndex: 65535
      m_AllTileFlags: 1073741825
  - first: {x: 2, y: -3, z: 0}
    second:
      serializedVersion: 2
      m_TileIndex: 34
      m_TileSpriteIndex: 34
      m_TileMatrixIndex: 0
      m_TileColorIndex: 0
      m_TileObjectToInstantiateIndex: 65535
      m_AllTileFlags: 1073741825
  - first: {x: 3, y: -3, z: 0}
    second:
      serializedVersion: 2
      m_TileIndex: 35
      m_TileSpriteIndex: 35
      m_TileMatrixIndex: 0
      m_TileColorIndex: 0
      m_TileObjectToInstantiateIndex: 65535
      m_AllTileFlags: 1073741825
  - first: {x: 4, y: -3, z: 0}
    second:
      serializedVersion: 2
      m_TileIndex: 36
      m_TileSpriteIndex: 36
      m_TileMatrixIndex: 0
      m_TileColorIndex: 0
      m_TileObjectToInstantiateIndex: 65535
      m_AllTileFlags: 1073741825
  - first: {x: -1, y: -2, z: 0}
    second:
      serializedVersion: 2
      m_TileIndex: 24
      m_TileSpriteIndex: 24
      m_TileMatrixIndex: 0
      m_TileColorIndex: 0
      m_TileObjectToInstantiateIndex: 65535
      m_AllTileFlags: 1073741825
  - first: {x: 0, y: -2, z: 0}
    second:
      serializedVersion: 2
      m_TileIndex: 25
      m_TileSpriteIndex: 25
      m_TileMatrixIndex: 0
      m_TileColorIndex: 0
      m_TileObjectToInstantiateIndex: 65535
      m_AllTileFlags: 1073741825
  - first: {x: 1, y: -2, z: 0}
    second:
      serializedVersion: 2
      m_TileIndex: 26
      m_TileSpriteIndex: 26
      m_TileMatrixIndex: 0
      m_TileColorIndex: 0
      m_TileObjectToInstantiateIndex: 65535
      m_AllTileFlags: 1073741825
  - first: {x: 2, y: -2, z: 0}
    second:
      serializedVersion: 2
      m_TileIndex: 27
      m_TileSpriteIndex: 27
      m_TileMatrixIndex: 0
      m_TileColorIndex: 0
      m_TileObjectToInstantiateIndex: 65535
      m_AllTileFlags: 1073741825
  - first: {x: 3, y: -2, z: 0}
    second:
      serializedVersion: 2
      m_TileIndex: 28
      m_TileSpriteIndex: 28
      m_TileMatrixIndex: 0
      m_TileColorIndex: 0
      m_TileObjectToInstantiateIndex: 65535
      m_AllTileFlags: 1073741825
  - first: {x: 5, y: -2, z: 0}
    second:
      serializedVersion: 2
      m_TileIndex: 29
      m_TileSpriteIndex: 29
      m_TileMatrixIndex: 0
      m_TileColorIndex: 0
      m_TileObjectToInstantiateIndex: 65535
      m_AllTileFlags: 1073741825
  - first: {x: -2, y: -1, z: 0}
    second:
      serializedVersion: 2
      m_TileIndex: 17
      m_TileSpriteIndex: 17
      m_TileMatrixIndex: 0
      m_TileColorIndex: 0
      m_TileObjectToInstantiateIndex: 65535
      m_AllTileFlags: 1073741825
  - first: {x: -1, y: -1, z: 0}
    second:
      serializedVersion: 2
      m_TileIndex: 18
      m_TileSpriteIndex: 18
      m_TileMatrixIndex: 0
      m_TileColorIndex: 0
      m_TileObjectToInstantiateIndex: 65535
      m_AllTileFlags: 1073741825
  - first: {x: 0, y: -1, z: 0}
    second:
      serializedVersion: 2
      m_TileIndex: 19
      m_TileSpriteIndex: 19
      m_TileMatrixIndex: 0
      m_TileColorIndex: 0
      m_TileObjectToInstantiateIndex: 65535
      m_AllTileFlags: 1073741825
  - first: {x: 1, y: -1, z: 0}
    second:
      serializedVersion: 2
      m_TileIndex: 20
      m_TileSpriteIndex: 20
      m_TileMatrixIndex: 0
      m_TileColorIndex: 0
      m_TileObjectToInstantiateIndex: 65535
      m_AllTileFlags: 1073741825
  - first: {x: 3, y: -1, z: 0}
    second:
      serializedVersion: 2
      m_TileIndex: 21
      m_TileSpriteIndex: 21
      m_TileMatrixIndex: 0
      m_TileColorIndex: 0
      m_TileObjectToInstantiateIndex: 65535
      m_AllTileFlags: 1073741825
  - first: {x: 4, y: -1, z: 0}
    second:
      serializedVersion: 2
      m_TileIndex: 22
      m_TileSpriteIndex: 22
      m_TileMatrixIndex: 0
      m_TileColorIndex: 0
      m_TileObjectToInstantiateIndex: 65535
      m_AllTileFlags: 1073741825
  - first: {x: 5, y: -1, z: 0}
    second:
      serializedVersion: 2
      m_TileIndex: 23
      m_TileSpriteIndex: 23
      m_TileMatrixIndex: 0
      m_TileColorIndex: 0
      m_TileObjectToInstantiateIndex: 65535
      m_AllTileFlags: 1073741825
  - first: {x: -2, y: 0, z: 0}
    second:
      serializedVersion: 2
      m_TileIndex: 12
      m_TileSpriteIndex: 12
      m_TileMatrixIndex: 0
      m_TileColorIndex: 0
      m_TileObjectToInstantiateIndex: 65535
      m_AllTileFlags: 1073741825
  - first: {x: -1, y: 0, z: 0}
    second:
      serializedVersion: 2
      m_TileIndex: 13
      m_TileSpriteIndex: 13
      m_TileMatrixIndex: 0
      m_TileColorIndex: 0
      m_TileObjectToInstantiateIndex: 65535
      m_AllTileFlags: 1073741825
  - first: {x: 3, y: 0, z: 0}
    second:
      serializedVersion: 2
      m_TileIndex: 14
      m_TileSpriteIndex: 14
      m_TileMatrixIndex: 0
      m_TileColorIndex: 0
      m_TileObjectToInstantiateIndex: 65535
      m_AllTileFlags: 1073741825
  - first: {x: 4, y: 0, z: 0}
    second:
      serializedVersion: 2
      m_TileIndex: 15
      m_TileSpriteIndex: 15
      m_TileMatrixIndex: 0
      m_TileColorIndex: 0
      m_TileObjectToInstantiateIndex: 65535
      m_AllTileFlags: 1073741825
  - first: {x: 5, y: 0, z: 0}
    second:
      serializedVersion: 2
      m_TileIndex: 16
      m_TileSpriteIndex: 16
      m_TileMatrixIndex: 0
      m_TileColorIndex: 0
      m_TileObjectToInstantiateIndex: 65535
      m_AllTileFlags: 1073741825
  - first: {x: -2, y: 1, z: 0}
    second:
      serializedVersion: 2
      m_TileIndex: 5
      m_TileSpriteIndex: 5
      m_TileMatrixIndex: 0
      m_TileColorIndex: 0
      m_TileObjectToInstantiateIndex: 65535
      m_AllTileFlags: 1073741825
  - first: {x: -1, y: 1, z: 0}
    second:
      serializedVersion: 2
      m_TileIndex: 6
      m_TileSpriteIndex: 6
      m_TileMatrixIndex: 0
      m_TileColorIndex: 0
      m_TileObjectToInstantiateIndex: 65535
      m_AllTileFlags: 1073741825
  - first: {x: 0, y: 1, z: 0}
    second:
      serializedVersion: 2
      m_TileIndex: 7
      m_TileSpriteIndex: 7
      m_TileMatrixIndex: 0
      m_TileColorIndex: 0
      m_TileObjectToInstantiateIndex: 65535
      m_AllTileFlags: 1073741825
  - first: {x: 1, y: 1, z: 0}
    second:
      serializedVersion: 2
      m_TileIndex: 8
      m_TileSpriteIndex: 8
      m_TileMatrixIndex: 0
      m_TileColorIndex: 0
      m_TileObjectToInstantiateIndex: 65535
      m_AllTileFlags: 1073741825
  - first: {x: 2, y: 1, z: 0}
    second:
      serializedVersion: 2
      m_TileIndex: 9
      m_TileSpriteIndex: 9
      m_TileMatrixIndex: 0
      m_TileColorIndex: 0
      m_TileObjectToInstantiateIndex: 65535
      m_AllTileFlags: 1073741825
  - first: {x: 3, y: 1, z: 0}
    second:
      serializedVersion: 2
      m_TileIndex: 10
      m_TileSpriteIndex: 10
      m_TileMatrixIndex: 0
      m_TileColorIndex: 0
      m_TileObjectToInstantiateIndex: 65535
      m_AllTileFlags: 1073741825
  - first: {x: 4, y: 1, z: 0}
    second:
      serializedVersion: 2
      m_TileIndex: 11
      m_TileSpriteIndex: 11
      m_TileMatrixIndex: 0
      m_TileColorIndex: 0
      m_TileObjectToInstantiateIndex: 65535
      m_AllTileFlags: 1073741825
  - first: {x: -1, y: 2, z: 0}
    second:
      serializedVersion: 2
      m_TileIndex: 0
      m_TileSpriteIndex: 0
      m_TileMatrixIndex: 0
      m_TileColorIndex: 0
      m_TileObjectToInstantiateIndex: 65535
      m_AllTileFlags: 1073741825
  - first: {x: 0, y: 2, z: 0}
    second:
      serializedVersion: 2
      m_TileIndex: 1
      m_TileSpriteIndex: 1
      m_TileMatrixIndex: 0
      m_TileColorIndex: 0
      m_TileObjectToInstantiateIndex: 65535
      m_AllTileFlags: 1073741825
  - first: {x: 1, y: 2, z: 0}
    second:
      serializedVersion: 2
      m_TileIndex: 2
      m_TileSpriteIndex: 2
      m_TileMatrixIndex: 0
      m_TileColorIndex: 0
      m_TileObjectToInstantiateIndex: 65535
      m_AllTileFlags: 1073741825
  - first: {x: 2, y: 2, z: 0}
    second:
      serializedVersion: 2
      m_TileIndex: 3
      m_TileSpriteIndex: 3
      m_TileMatrixIndex: 0
      m_TileColorIndex: 0
      m_TileObjectToInstantiateIndex: 65535
      m_AllTileFlags: 1073741825
  - first: {x: 3, y: 2, z: 0}
    second:
      serializedVersion: 2
      m_TileIndex: 4
      m_TileSpriteIndex: 4
      m_TileMatrixIndex: 0
      m_TileColorIndex: 0
      m_TileObjectToInstantiateIndex: 65535
      m_AllTileFlags: 1073741825
  m_AnimatedTiles: {}
  m_TileAssetArray:
  - m_RefCount: 1
    m_Data: {fileID: 11400000, guid: aa033f747e82284458bee0127ac868c3, type: 2}
  - m_RefCount: 1
    m_Data: {fileID: 11400000, guid: aca30bc7affe02547b7eb71613c13f9a, type: 2}
  - m_RefCount: 1
    m_Data: {fileID: 11400000, guid: 2e06d14f7a2f1ae40843ab76e0a1a9d6, type: 2}
  - m_RefCount: 1
    m_Data: {fileID: 11400000, guid: 1ee3865d32989fe44aaa135b2ef7aefa, type: 2}
  - m_RefCount: 1
    m_Data: {fileID: 11400000, guid: 44e6c1a1d4983e94f8edb11c331e7cf3, type: 2}
  - m_RefCount: 1
    m_Data: {fileID: 11400000, guid: 1a69b33b6b7fdb64fa879f0441bc24c4, type: 2}
  - m_RefCount: 1
    m_Data: {fileID: 11400000, guid: e0060a6ccaa881f44b45e1e499fbe454, type: 2}
  - m_RefCount: 1
    m_Data: {fileID: 11400000, guid: 38eb443bc2f0f3f49b82a333763c212a, type: 2}
  - m_RefCount: 1
    m_Data: {fileID: 11400000, guid: e5c42ebe5b09b234b9427ddd80648eb5, type: 2}
  - m_RefCount: 1
    m_Data: {fileID: 11400000, guid: 96380bb7e8414ea4bb61270f26d8b962, type: 2}
  - m_RefCount: 1
    m_Data: {fileID: 11400000, guid: 112f1b8711bf76a4c83e861fd8545ba9, type: 2}
  - m_RefCount: 1
    m_Data: {fileID: 11400000, guid: a1d5dd53761d4644494d3c89df22734d, type: 2}
  - m_RefCount: 1
    m_Data: {fileID: 11400000, guid: 71fc26052be32dd4ba61c9d313f6213e, type: 2}
  - m_RefCount: 1
    m_Data: {fileID: 11400000, guid: 925e8356eb4418445b82ade5a0967c03, type: 2}
  - m_RefCount: 1
    m_Data: {fileID: 11400000, guid: df8d279db0723964a818ff84eebbe103, type: 2}
  - m_RefCount: 1
    m_Data: {fileID: 11400000, guid: d8441d3f1aeb1ef40b9d199df59d14c3, type: 2}
  - m_RefCount: 1
    m_Data: {fileID: 11400000, guid: dfd986bdb3833ac469b4e793f0cb795a, type: 2}
  - m_RefCount: 1
    m_Data: {fileID: 11400000, guid: 4d5f65bddcc92ba4e984b8e0d6ddd909, type: 2}
  - m_RefCount: 1
    m_Data: {fileID: 11400000, guid: 8373fba9b5e21b245bbe1a5886b4dee7, type: 2}
  - m_RefCount: 1
    m_Data: {fileID: 11400000, guid: 69998332ac57c3240b85d8703ee1d3e8, type: 2}
  - m_RefCount: 1
    m_Data: {fileID: 11400000, guid: 36ecfd50eb1b88b409bac7d523454b97, type: 2}
  - m_RefCount: 1
    m_Data: {fileID: 11400000, guid: a58241021a66f3d449931298fe938f90, type: 2}
  - m_RefCount: 1
    m_Data: {fileID: 11400000, guid: 5d0deec9f593c50449518514416a6ec0, type: 2}
  - m_RefCount: 1
    m_Data: {fileID: 11400000, guid: 4b80bf9a62300cf42bbc0dcf3ba394b8, type: 2}
  - m_RefCount: 1
    m_Data: {fileID: 11400000, guid: 2dc73d7eeacae714f8ce4bcc6eab955f, type: 2}
  - m_RefCount: 1
    m_Data: {fileID: 11400000, guid: 0594bb25f3d954b4d9e5aae87e867479, type: 2}
  - m_RefCount: 1
    m_Data: {fileID: 11400000, guid: 7551e72dfc268774a88bae8525d6dbff, type: 2}
  - m_RefCount: 1
    m_Data: {fileID: 11400000, guid: 3e3ae1c8c0810d34fa2888726a65edd9, type: 2}
  - m_RefCount: 1
    m_Data: {fileID: 11400000, guid: be91b45396087e44d978196d8c24ddbb, type: 2}
  - m_RefCount: 1
    m_Data: {fileID: 11400000, guid: be77da53c6dd97e4cafb04c2c7874bcb, type: 2}
  - m_RefCount: 1
    m_Data: {fileID: 11400000, guid: 35f82386743c5fd439638589bb8da1f2, type: 2}
  - m_RefCount: 1
    m_Data: {fileID: 11400000, guid: 051f5b3c194f60845a13b741c58091a3, type: 2}
  - m_RefCount: 1
    m_Data: {fileID: 11400000, guid: cd6137443baca684e9e74834945f7d17, type: 2}
  - m_RefCount: 1
    m_Data: {fileID: 11400000, guid: 76ad2c8c8b545e143b3617e104108b92, type: 2}
  - m_RefCount: 1
    m_Data: {fileID: 11400000, guid: 237e7711cbfab7f4291456e42c6c420b, type: 2}
  - m_RefCount: 1
    m_Data: {fileID: 11400000, guid: cb0428c25af43b44c859cff5b60bdd11, type: 2}
  - m_RefCount: 1
    m_Data: {fileID: 11400000, guid: 2fa0dfb5f406c06479222e4525635080, type: 2}
  - m_RefCount: 1
    m_Data: {fileID: 11400000, guid: 37e2096bf7fc3514a975ff7a7e6273eb, type: 2}
  - m_RefCount: 1
    m_Data: {fileID: 11400000, guid: 5c1c7625c0fd0f3489ca7dcbc9c1e97d, type: 2}
  - m_RefCount: 1
    m_Data: {fileID: 11400000, guid: 1f5a25d929d92954684ef2eed8a86f63, type: 2}
  - m_RefCount: 1
    m_Data: {fileID: 11400000, guid: c08e423d856a4ca41b6bd928a13ca19c, type: 2}
  - m_RefCount: 1
    m_Data: {fileID: 11400000, guid: b4520f726aaa38343bc74af1946d0085, type: 2}
  - m_RefCount: 1
    m_Data: {fileID: 11400000, guid: 340cda38c5a01284a8fcfe65d3762958, type: 2}
  - m_RefCount: 1
    m_Data: {fileID: 11400000, guid: 6976d5e903bf6b44e980dc4733cad0f1, type: 2}
  - m_RefCount: 1
    m_Data: {fileID: 11400000, guid: 24167ed9e1a86f249af0b787d3cbf226, type: 2}
  - m_RefCount: 1
    m_Data: {fileID: 11400000, guid: 013cccef260d12b44ba58710bfed820a, type: 2}
  - m_RefCount: 1
    m_Data: {fileID: 11400000, guid: 6bf7c54d962fdcf49b4cfb59fad0a31d, type: 2}
  - m_RefCount: 1
    m_Data: {fileID: 11400000, guid: d7cb97a004874374eabc6c66231d95ce, type: 2}
  - m_RefCount: 1
    m_Data: {fileID: 11400000, guid: 9d75c4269b67b0a4d836073680192382, type: 2}
  m_TileSpriteArray:
  - m_RefCount: 1
    m_Data: {fileID: 6682738439518977790, guid: 613295c0ea667f24088bef9071e5c5ee,
      type: 3}
  - m_RefCount: 1
    m_Data: {fileID: -562605217060080129, guid: 613295c0ea667f24088bef9071e5c5ee,
      type: 3}
  - m_RefCount: 1
    m_Data: {fileID: -4970410492042351176, guid: 613295c0ea667f24088bef9071e5c5ee,
      type: 3}
  - m_RefCount: 1
    m_Data: {fileID: -5930158604282628446, guid: 613295c0ea667f24088bef9071e5c5ee,
      type: 3}
  - m_RefCount: 1
    m_Data: {fileID: -4233739483619845583, guid: 613295c0ea667f24088bef9071e5c5ee,
      type: 3}
  - m_RefCount: 1
    m_Data: {fileID: -6551456632857933372, guid: 613295c0ea667f24088bef9071e5c5ee,
      type: 3}
  - m_RefCount: 1
    m_Data: {fileID: 4717279005209572468, guid: 613295c0ea667f24088bef9071e5c5ee,
      type: 3}
  - m_RefCount: 1
    m_Data: {fileID: -232304020389510235, guid: 613295c0ea667f24088bef9071e5c5ee,
      type: 3}
  - m_RefCount: 1
    m_Data: {fileID: -2542073858232844238, guid: 613295c0ea667f24088bef9071e5c5ee,
      type: 3}
  - m_RefCount: 1
    m_Data: {fileID: 4362130248060910229, guid: 613295c0ea667f24088bef9071e5c5ee,
      type: 3}
  - m_RefCount: 1
    m_Data: {fileID: 5331757720867617967, guid: 613295c0ea667f24088bef9071e5c5ee,
      type: 3}
  - m_RefCount: 1
    m_Data: {fileID: 5743168839956448968, guid: 613295c0ea667f24088bef9071e5c5ee,
      type: 3}
  - m_RefCount: 1
    m_Data: {fileID: 1940044384358670937, guid: 613295c0ea667f24088bef9071e5c5ee,
      type: 3}
  - m_RefCount: 1
    m_Data: {fileID: 7903714108508714464, guid: 613295c0ea667f24088bef9071e5c5ee,
      type: 3}
  - m_RefCount: 1
    m_Data: {fileID: 3912554482014063563, guid: 613295c0ea667f24088bef9071e5c5ee,
      type: 3}
  - m_RefCount: 1
    m_Data: {fileID: -5970157769536964832, guid: 613295c0ea667f24088bef9071e5c5ee,
      type: 3}
  - m_RefCount: 1
    m_Data: {fileID: 289909530908896649, guid: 613295c0ea667f24088bef9071e5c5ee, type: 3}
  - m_RefCount: 1
    m_Data: {fileID: -942494204440328609, guid: 613295c0ea667f24088bef9071e5c5ee,
      type: 3}
  - m_RefCount: 1
    m_Data: {fileID: 1603184614873367213, guid: 613295c0ea667f24088bef9071e5c5ee,
      type: 3}
  - m_RefCount: 1
    m_Data: {fileID: -1986604703071005312, guid: 613295c0ea667f24088bef9071e5c5ee,
      type: 3}
  - m_RefCount: 1
    m_Data: {fileID: 2971426260718290345, guid: 613295c0ea667f24088bef9071e5c5ee,
      type: 3}
  - m_RefCount: 1
    m_Data: {fileID: 4556602332822886861, guid: 613295c0ea667f24088bef9071e5c5ee,
      type: 3}
  - m_RefCount: 1
    m_Data: {fileID: -8962348942449561705, guid: 613295c0ea667f24088bef9071e5c5ee,
      type: 3}
  - m_RefCount: 1
    m_Data: {fileID: 6012075677060953230, guid: 613295c0ea667f24088bef9071e5c5ee,
      type: 3}
  - m_RefCount: 1
    m_Data: {fileID: -2801654775933646049, guid: 613295c0ea667f24088bef9071e5c5ee,
      type: 3}
  - m_RefCount: 1
    m_Data: {fileID: -8780798934548743478, guid: 613295c0ea667f24088bef9071e5c5ee,
      type: 3}
  - m_RefCount: 1
    m_Data: {fileID: 955270936876841680, guid: 613295c0ea667f24088bef9071e5c5ee, type: 3}
  - m_RefCount: 1
    m_Data: {fileID: -8441922457720628055, guid: 613295c0ea667f24088bef9071e5c5ee,
      type: 3}
  - m_RefCount: 1
    m_Data: {fileID: 4474571884964807243, guid: 613295c0ea667f24088bef9071e5c5ee,
      type: 3}
  - m_RefCount: 1
    m_Data: {fileID: 5357474440129519165, guid: 613295c0ea667f24088bef9071e5c5ee,
      type: 3}
  - m_RefCount: 1
    m_Data: {fileID: -5315828571106901945, guid: 613295c0ea667f24088bef9071e5c5ee,
      type: 3}
  - m_RefCount: 1
    m_Data: {fileID: 4322028927912867057, guid: 613295c0ea667f24088bef9071e5c5ee,
      type: 3}
  - m_RefCount: 1
    m_Data: {fileID: 1680713046501002167, guid: 613295c0ea667f24088bef9071e5c5ee,
      type: 3}
  - m_RefCount: 1
    m_Data: {fileID: 5244099617911280066, guid: 613295c0ea667f24088bef9071e5c5ee,
      type: 3}
  - m_RefCount: 1
    m_Data: {fileID: -5274270234370642987, guid: 613295c0ea667f24088bef9071e5c5ee,
      type: 3}
  - m_RefCount: 1
    m_Data: {fileID: 8075736937004810761, guid: 613295c0ea667f24088bef9071e5c5ee,
      type: 3}
  - m_RefCount: 1
    m_Data: {fileID: 2294257664494850697, guid: 613295c0ea667f24088bef9071e5c5ee,
      type: 3}
  - m_RefCount: 1
    m_Data: {fileID: -3896513430485607000, guid: 613295c0ea667f24088bef9071e5c5ee,
      type: 3}
  - m_RefCount: 1
    m_Data: {fileID: -7698955255190142280, guid: 613295c0ea667f24088bef9071e5c5ee,
      type: 3}
  - m_RefCount: 1
    m_Data: {fileID: 1030480857436771457, guid: 613295c0ea667f24088bef9071e5c5ee,
      type: 3}
  - m_RefCount: 1
    m_Data: {fileID: 8052831962113911555, guid: 613295c0ea667f24088bef9071e5c5ee,
      type: 3}
  - m_RefCount: 1
    m_Data: {fileID: -7106342086530502622, guid: 613295c0ea667f24088bef9071e5c5ee,
      type: 3}
  - m_RefCount: 1
    m_Data: {fileID: 8618503003260914962, guid: 613295c0ea667f24088bef9071e5c5ee,
      type: 3}
  - m_RefCount: 1
    m_Data: {fileID: 4520358840631008433, guid: 613295c0ea667f24088bef9071e5c5ee,
      type: 3}
  - m_RefCount: 1
    m_Data: {fileID: -8686585952007644489, guid: 613295c0ea667f24088bef9071e5c5ee,
      type: 3}
  - m_RefCount: 1
    m_Data: {fileID: -1067884814678109173, guid: 613295c0ea667f24088bef9071e5c5ee,
      type: 3}
  - m_RefCount: 1
    m_Data: {fileID: -6421702572434001699, guid: 613295c0ea667f24088bef9071e5c5ee,
      type: 3}
  - m_RefCount: 1
    m_Data: {fileID: -7001908263141272159, guid: 613295c0ea667f24088bef9071e5c5ee,
      type: 3}
  - m_RefCount: 1
    m_Data: {fileID: -5432749014195666866, guid: 613295c0ea667f24088bef9071e5c5ee,
      type: 3}
  m_TileMatrixArray:
  - m_RefCount: 49
    m_Data:
      e00: 1
      e01: 0
      e02: 0
      e03: 0
      e10: 0
      e11: 1
      e12: 0
      e13: 0
      e20: 0
      e21: 0
      e22: 1
      e23: 0
      e30: 0
      e31: 0
      e32: 0
      e33: 1
  m_TileColorArray:
  - m_RefCount: 49
    m_Data: {r: 1, g: 1, b: 1, a: 1}
  m_TileObjectToInstantiateArray: []
  m_AnimationFrameRate: 1
  m_Color: {r: 1, g: 1, b: 1, a: 1}
  m_Origin: {x: -2, y: -5, z: 0}
  m_Size: {x: 8, y: 8, z: 1}
  m_TileAnchor: {x: 0.5, y: 0.5, z: 0}
  m_TileOrientation: 0
  m_TileOrientationMatrix:
    e00: 1
    e01: 0
    e02: 0
    e03: 0
    e10: 0
    e11: 1
    e12: 0
    e13: 0
    e20: 0
    e21: 0
    e22: 1
    e23: 0
    e30: 0
    e31: 0
    e32: 0
    e33: 1
--- !u!483693784 &8402181660349667256
TilemapRenderer:
  m_ObjectHideFlags: 0
  m_CorrespondingSourceObject: {fileID: 0}
  m_PrefabInstance: {fileID: 0}
  m_PrefabAsset: {fileID: 0}
  m_GameObject: {fileID: 4175124285439598330}
  m_Enabled: 0
  m_CastShadows: 0
  m_ReceiveShadows: 0
  m_DynamicOccludee: 0
  m_MotionVectors: 1
  m_LightProbeUsage: 0
  m_ReflectionProbeUsage: 0
  m_RayTracingMode: 0
  m_RenderingLayerMask: 1
  m_RendererPriority: 0
  m_Materials:
  - {fileID: 10754, guid: 0000000000000000f000000000000000, type: 0}
  m_StaticBatchInfo:
    firstSubMesh: 0
    subMeshCount: 0
  m_StaticBatchRoot: {fileID: 0}
  m_ProbeAnchor: {fileID: 0}
  m_LightProbeVolumeOverride: {fileID: 0}
  m_ScaleInLightmap: 1
  m_ReceiveGI: 1
  m_PreserveUVs: 0
  m_IgnoreNormalsForChartDetection: 0
  m_ImportantGI: 0
  m_StitchLightmapSeams: 1
  m_SelectedEditorRenderState: 0
  m_MinimumChartSize: 4
  m_AutoUVMaxDistance: 0.5
  m_AutoUVMaxAngle: 89
  m_LightmapParameters: {fileID: 0}
  m_SortingLayerID: 0
  m_SortingLayer: 0
  m_SortingOrder: 0
  m_ChunkSize: {x: 32, y: 32, z: 32}
  m_ChunkCullingBounds: {x: 0, y: 0, z: 0}
  m_MaxChunkCount: 16
  m_MaxFrameAge: 16
  m_SortOrder: 0
  m_Mode: 0
  m_DetectChunkCullingBounds: 0
  m_MaskInteraction: 0
--- !u!114 &6859604060421187610
MonoBehaviour:
  m_ObjectHideFlags: 0
  m_CorrespondingSourceObject: {fileID: 0}
  m_PrefabInstance: {fileID: 0}
  m_PrefabAsset: {fileID: 0}
  m_GameObject: {fileID: 0}
  m_Enabled: 1
  m_EditorHideFlags: 0
  m_Script: {fileID: 12395, guid: 0000000000000000e000000000000000, type: 0}
  m_Name: Palette Settings
  m_EditorClassIdentifier: 
  cellSizing: 0
