{
  "formatVersion": 1,
  "database": {
    "version": 38,
    "identityHash": "caf9552695b2e64244bd433746b7d2c2",
    "entities": [
      {
        "tableName": "annotations",
        "createSql": "CREATE TABLE IF NOT EXISTS `${TABLE_NAME}` (`id` INTEGER PRIMARY KEY AUTOINCREMENT NOT NULL, `pictures` TEXT, `text` TEXT, `author_id` INTEGER NOT NULL, `project_id` INTEGER NOT NULL, `status` INTEGER, `created_at` INTEGER, `authorId` INTEGER, `firstname` TEXT, `lastname` TEXT, `email` TEXT, `username` TEXT, `password` TEXT, `role` INTEGER, `author_updated_at` INTEGER, `author_POS_internal_code` TEXT, `projectId` INTEGER, `project_name` TEXT, `project_updated_at` INTEGER, `project_POS_internal_code` TEXT, `project_manager_id` INTEGER, FOREIGN KEY(`author_id`) REFERENCES `authors`(`authorId`) ON UPDATE NO ACTION ON DELETE CASCADE , FOREIGN KEY(`project_id`) REFERENCES `projects`(`projectId`) ON UPDATE NO ACTION ON DELETE CASCADE )",
        "fields": [
          {
            "fieldPath": "id",
            "columnName": "id",
            "affinity": "INTEGER",
            "notNull": true
          },
          {
            "fieldPath": "pictures",
            "columnName": "pictures",
            "affinity": "TEXT",
            "notNull": false
          },
          {
            "fieldPath": "text",
            "columnName": "text",
            "affinity": "TEXT",
            "notNull": false
          },
          {
            "fieldPath": "authorId",
            "columnName": "author_id",
            "affinity": "INTEGER",
            "notNull": true
          },
          {
            "fieldPath": "projectId",
            "columnName": "project_id",
            "affinity": "INTEGER",
            "notNull": true
          },
          {
            "fieldPath": "status",
            "columnName": "status",
            "affinity": "INTEGER",
            "notNull": false
          },
          {
            "fieldPath": "created_at",
            "columnName": "created_at",
            "affinity": "INTEGER",
            "notNull": false
          },
          {
            "fieldPath": "author.authorId",
            "columnName": "authorId",
            "affinity": "INTEGER",
            "notNull": false
          },
          {
            "fieldPath": "author.firstName",
            "columnName": "firstname",
            "affinity": "TEXT",
            "notNull": false
          },
          {
            "fieldPath": "author.lastName",
            "columnName": "lastname",
            "affinity": "TEXT",
            "notNull": false
          },
          {
            "fieldPath": "author.email",
            "columnName": "email",
            "affinity": "TEXT",
            "notNull": false
          },
          {
            "fieldPath": "author.username",
            "columnName": "username",
            "affinity": "TEXT",
            "notNull": false
          },
          {
            "fieldPath": "author.password",
            "columnName": "password",
            "affinity": "TEXT",
            "notNull": false
          },
          {
            "fieldPath": "author.role",
            "columnName": "role",
            "affinity": "INTEGER",
            "notNull": false
          },
          {
            "fieldPath": "author.updated_at",
            "columnName": "author_updated_at",
            "affinity": "INTEGER",
            "notNull": false
          },
          {
            "fieldPath": "author.POS_internal_code",
            "columnName": "author_POS_internal_code",
            "affinity": "TEXT",
            "notNull": false
          },
          {
            "fieldPath": "project.projectId",
            "columnName": "projectId",
            "affinity": "INTEGER",
            "notNull": false
          },
          {
            "fieldPath": "project.projectName",
            "columnName": "project_name",
            "affinity": "TEXT",
            "notNull": false
          },
          {
            "fieldPath": "project.updated_at",
            "columnName": "project_updated_at",
            "affinity": "INTEGER",
            "notNull": false
          },
          {
            "fieldPath": "project.POSInternalCode",
            "columnName": "project_POS_internal_code",
            "affinity": "TEXT",
            "notNull": false
          },
          {
            "fieldPath": "project.projectManagerId",
            "columnName": "project_manager_id",
            "affinity": "INTEGER",
            "notNull": false
          }
        ],
        "primaryKey": {
          "columnNames": [
            "id"
          ],
          "autoGenerate": true
        },
        "indices": [],
        "foreignKeys": [
          {
            "table": "authors",
            "onDelete": "CASCADE",
            "onUpdate": "NO ACTION",
            "columns": [
              "author_id"
            ],
            "referencedColumns": [
              "authorId"
            ]
          },
          {
            "table": "projects",
            "onDelete": "CASCADE",
            "onUpdate": "NO ACTION",
            "columns": [
              "project_id"
            ],
            "referencedColumns": [
              "projectId"
            ]
          }
        ]
      },
      {
        "tableName": "authors",
        "createSql": "CREATE TABLE IF NOT EXISTS `${TABLE_NAME}` (`authorId` INTEGER NOT NULL, `firstname` TEXT, `lastname` TEXT, `email` TEXT, `username` TEXT, `password` TEXT, `role` INTEGER, `author_updated_at` INTEGER, `author_POS_internal_code` TEXT, PRIMARY KEY(`authorId`))",
        "fields": [
          {
            "fieldPath": "authorId",
            "columnName": "authorId",
            "affinity": "INTEGER",
            "notNull": true
          },
          {
            "fieldPath": "firstName",
            "columnName": "firstname",
            "affinity": "TEXT",
            "notNull": false
          },
          {
            "fieldPath": "lastName",
            "columnName": "lastname",
            "affinity": "TEXT",
            "notNull": false
          },
          {
            "fieldPath": "email",
            "columnName": "email",
            "affinity": "TEXT",
            "notNull": false
          },
          {
            "fieldPath": "username",
            "columnName": "username",
            "affinity": "TEXT",
            "notNull": false
          },
          {
            "fieldPath": "password",
            "columnName": "password",
            "affinity": "TEXT",
            "notNull": false
          },
          {
            "fieldPath": "role",
            "columnName": "role",
            "affinity": "INTEGER",
            "notNull": false
          },
          {
            "fieldPath": "updated_at",
            "columnName": "author_updated_at",
            "affinity": "INTEGER",
            "notNull": false
          },
          {
            "fieldPath": "POS_internal_code",
            "columnName": "author_POS_internal_code",
            "affinity": "TEXT",
            "notNull": false
          }
        ],
        "primaryKey": {
          "columnNames": [
            "authorId"
          ],
          "autoGenerate": false
        },
        "indices": [],
        "foreignKeys": []
      },
      {
        "tableName": "projects",
        "createSql": "CREATE TABLE IF NOT EXISTS `${TABLE_NAME}` (`projectId` INTEGER NOT NULL, `project_name` TEXT, `project_updated_at` INTEGER, `project_POS_internal_code` TEXT, `project_manager_id` INTEGER NOT NULL, PRIMARY KEY(`projectId`), FOREIGN KEY(`project_manager_id`) REFERENCES `authors`(`authorId`) ON UPDATE NO ACTION ON DELETE CASCADE )",
        "fields": [
          {
            "fieldPath": "projectId",
            "columnName": "projectId",
            "affinity": "INTEGER",
            "notNull": true
          },
          {
            "fieldPath": "projectName",
            "columnName": "project_name",
            "affinity": "TEXT",
            "notNull": false
          },
          {
            "fieldPath": "updated_at",
            "columnName": "project_updated_at",
            "affinity": "INTEGER",
            "notNull": false
          },
          {
            "fieldPath": "POSInternalCode",
            "columnName": "project_POS_internal_code",
            "affinity": "TEXT",
            "notNull": false
          },
          {
            "fieldPath": "projectManagerId",
            "columnName": "project_manager_id",
            "affinity": "INTEGER",
            "notNull": true
          }
        ],
        "primaryKey": {
          "columnNames": [
            "projectId"
          ],
          "autoGenerate": false
        },
        "indices": [],
        "foreignKeys": [
          {
            "table": "authors",
            "onDelete": "CASCADE",
            "onUpdate": "NO ACTION",
            "columns": [
              "project_manager_id"
            ],
            "referencedColumns": [
              "authorId"
            ]
          }
        ]
      },
      {
        "tableName": "generaldata",
        "createSql": "CREATE TABLE IF NOT EXISTS `${TABLE_NAME}` (`id` INTEGER PRIMARY KEY AUTOINCREMENT NOT NULL, `name` TEXT, `value` TEXT)",
        "fields": [
          {
            "fieldPath": "id",
            "columnName": "id",
            "affinity": "INTEGER",
            "notNull": true
          },
          {
            "fieldPath": "name",
            "columnName": "name",
            "affinity": "TEXT",
            "notNull": false
          },
          {
            "fieldPath": "value",
            "columnName": "value",
            "affinity": "TEXT",
            "notNull": false
          }
        ],
        "primaryKey": {
          "columnNames": [
            "id"
          ],
          "autoGenerate": true
        },
        "indices": [],
        "foreignKeys": []
      }
    ],
    "setupQueries": [
      "CREATE TABLE IF NOT EXISTS room_master_table (id INTEGER PRIMARY KEY,identity_hash TEXT)",
      "INSERT OR REPLACE INTO room_master_table (id,identity_hash) VALUES(42, \"caf9552695b2e64244bd433746b7d2c2\")"
    ]
  }
}