{
  "formatVersion": 1,
  "database": {
    "version": 34,
    "identityHash": "88bab54a57c39e841855f9ba236c21b6",
    "entities": [
      {
        "tableName": "annotations",
        "createSql": "CREATE TABLE IF NOT EXISTS `${TABLE_NAME}` (`id` INTEGER PRIMARY KEY AUTOINCREMENT NOT NULL, `picture` TEXT, `text` TEXT, `author_id` INTEGER NOT NULL, `project_id` INTEGER NOT NULL, `status` INTEGER, `created_at` INTEGER, FOREIGN KEY(`author_id`) REFERENCES `authors`(`authorId`) ON UPDATE NO ACTION ON DELETE CASCADE , FOREIGN KEY(`project_id`) REFERENCES `projects`(`projectId`) ON UPDATE NO ACTION ON DELETE CASCADE )",
        "fields": [
          {
            "fieldPath": "id",
            "columnName": "id",
            "affinity": "INTEGER",
            "notNull": true
          },
          {
            "fieldPath": "picture",
            "columnName": "picture",
            "affinity": "TEXT",
            "notNull": false
          },
          {
            "fieldPath": "text",
            "columnName": "text",
            "affinity": "TEXT",
            "notNull": false
          },
          {
            "fieldPath": "authorId",
            "columnName": "author_id",
            "affinity": "INTEGER",
            "notNull": true
          },
          {
            "fieldPath": "projectId",
            "columnName": "project_id",
            "affinity": "INTEGER",
            "notNull": true
          },
          {
            "fieldPath": "status",
            "columnName": "status",
            "affinity": "INTEGER",
            "notNull": false
          },
          {
            "fieldPath": "created_at",
            "columnName": "created_at",
            "affinity": "INTEGER",
            "notNull": false
          }
        ],
        "primaryKey": {
          "columnNames": [
            "id"
          ],
          "autoGenerate": true
        },
        "indices": [],
        "foreignKeys": [
          {
            "table": "authors",
            "onDelete": "CASCADE",
            "onUpdate": "NO ACTION",
            "columns": [
              "author_id"
            ],
            "referencedColumns": [
              "authorId"
            ]
          },
          {
            "table": "projects",
            "onDelete": "CASCADE",
            "onUpdate": "NO ACTION",
            "columns": [
              "project_id"
            ],
            "referencedColumns": [
              "projectId"
            ]
          }
        ]
      },
      {
        "tableName": "authors",
        "createSql": "CREATE TABLE IF NOT EXISTS `${TABLE_NAME}` (`authorId` INTEGER NOT NULL, `firstname` TEXT, `lastname` TEXT, `email` TEXT, `username` TEXT, `password` TEXT, `role` INTEGER, `modified_at` INTEGER, `POS_internal_code` TEXT, PRIMARY KEY(`authorId`))",
        "fields": [
          {
            "fieldPath": "authorId",
            "columnName": "authorId",
            "affinity": "INTEGER",
            "notNull": true
          },
          {
            "fieldPath": "firstName",
            "columnName": "firstname",
            "affinity": "TEXT",
            "notNull": false
          },
          {
            "fieldPath": "lastName",
            "columnName": "lastname",
            "affinity": "TEXT",
            "notNull": false
          },
          {
            "fieldPath": "email",
            "columnName": "email",
            "affinity": "TEXT",
            "notNull": false
          },
          {
            "fieldPath": "username",
            "columnName": "username",
            "affinity": "TEXT",
            "notNull": false
          },
          {
            "fieldPath": "password",
            "columnName": "password",
            "affinity": "TEXT",
            "notNull": false
          },
          {
            "fieldPath": "role",
            "columnName": "role",
            "affinity": "INTEGER",
            "notNull": false
          },
          {
            "fieldPath": "modified_at",
            "columnName": "modified_at",
            "affinity": "INTEGER",
            "notNull": false
          },
          {
            "fieldPath": "POS_internal_code",
            "columnName": "POS_internal_code",
            "affinity": "TEXT",
            "notNull": false
          }
        ],
        "primaryKey": {
          "columnNames": [
            "authorId"
          ],
          "autoGenerate": false
        },
        "indices": [],
        "foreignKeys": []
      },
      {
        "tableName": "projects",
        "createSql": "CREATE TABLE IF NOT EXISTS `${TABLE_NAME}` (`projectId` INTEGER NOT NULL, `project_name` TEXT, `modified_at` INTEGER, `POS_internal_code` TEXT, `project_manager_id` INTEGER NOT NULL, PRIMARY KEY(`projectId`), FOREIGN KEY(`project_manager_id`) REFERENCES `authors`(`authorId`) ON UPDATE NO ACTION ON DELETE CASCADE )",
        "fields": [
          {
            "fieldPath": "projectId",
            "columnName": "projectId",
            "affinity": "INTEGER",
            "notNull": true
          },
          {
            "fieldPath": "projectName",
            "columnName": "project_name",
            "affinity": "TEXT",
            "notNull": false
          },
          {
            "fieldPath": "modified_at",
            "columnName": "modified_at",
            "affinity": "INTEGER",
            "notNull": false
          },
          {
            "fieldPath": "POSInternalCode",
            "columnName": "POS_internal_code",
            "affinity": "TEXT",
            "notNull": false
          },
          {
            "fieldPath": "projectManagerId",
            "columnName": "project_manager_id",
            "affinity": "INTEGER",
            "notNull": true
          }
        ],
        "primaryKey": {
          "columnNames": [
            "projectId"
          ],
          "autoGenerate": false
        },
        "indices": [],
        "foreignKeys": [
          {
            "table": "authors",
            "onDelete": "CASCADE",
            "onUpdate": "NO ACTION",
            "columns": [
              "project_manager_id"
            ],
            "referencedColumns": [
              "authorId"
            ]
          }
        ]
      }
    ],
    "setupQueries": [
      "CREATE TABLE IF NOT EXISTS room_master_table (id INTEGER PRIMARY KEY,identity_hash TEXT)",
      "INSERT OR REPLACE INTO room_master_table (id,identity_hash) VALUES(42, \"88bab54a57c39e841855f9ba236c21b6\")"
    ]
  }
}