{
    "name": "dan.test.js",
    "repo": "mykola-danylov/dan.test.js",
    "version": "0.0.1",
    "description": "Probe file for github js component",
    "license": "MIT",
    "keywords": [
        "probe",
        "component"
    ],
    "main": "test.js",
    "scripts": [
        "test.js"
    ]
}