{
    "config": {
        "enable-led-control-example": true,
        "LED": "LED1",
        "BUTTON": "BUTTON1",
        "RELAY_CONTROL": "NC",
        "BUTTON_MODE": "PullUp"
    },
    "macros": ["MBEDTLS_USER_CONFIG_FILE=\"mbedtls_wisun_config.h\""],
    "target_overrides": {
        "*": {
            "nsapi.default-mesh-type": "WISUN",
            "mbed-mesh-api.wisun-network-name": "\"RADRANE\"",
            "nanostack.configuration": "ws_router",
            "mbed-mesh-api.wisun-network-size": "NETWORK_SIZE_SMALL",
            "mbed-mesh-api.certificate-header": "\"wisun_certificates.h\"",
            "mbed-mesh-api.root-certificate": "WISUN_ROOT_CERTIFICATE",
            "mbed-mesh-api.own-certificate": "WISUN_CLIENT_CERTIFICATE",
            "mbed-mesh-api.own-certificate-key": "WISUN_CLIENT_KEY",
            "mbed-trace.enable": true,
            "platform.stdio-convert-newlines": true,
            "platform.stdio-baud-rate": 115200,
            "platform.stdio-buffered-serial": true,
            "platform.callback-nontrivial": true,
            "platform.all-stats-enabled": true,
            "platform.sys-stats-enabled": true,
            "platform.heap-stats-enabled": true,
            "platform.stack-stats-enabled": true,
            "s2lp.provide-default": true,
            "target.device_has_add": ["802_15_4_PHY"]
        },
        "K64F": {
            "LED": "LED1",
            "BUTTON": "SW2"
        },
        "K66F": {
            "LED": "LED1",
            "BUTTON": "SW2"
        },
        "NUCLEO_F429ZI":  {
            "LED": "LED1",
            "BUTTON": "BUTTON1",
            "BUTTON_MODE": "PullDown"
        },
        "DISCO_F769NI": {
            "LED": "LED1",
            "BUTTON": "BUTTON1"
        }
    }
}
