TITLE , PLACE , LAT , LON
MS Ff.1.25.5 , England , 53 , -2
MS Ii.6.2 , Bruges - Flanders , 51.210933 , 3.225971
MS Gg.4.31 , Bruges - Flanders , 51.210933 , 3.225971
MS Nn.4.1 , Bruges , 51.210933 , 3.225971
Inc.7.F.6.2[4653] , Antwerp , 51.213886 , 4.401514
MS Ii.6.32 , Scotland? , 57 , -4
MS Kk.1.24 , Northumbria , 55 , -2.5
Inc.5.F.6.3[3409] , Westminster , 51.5 , -0.1667
MS Add. 4126 , England , 55 , -2.5
MS Ff.1.25.4 , England , 53 , -2
MS Ff.1.25.1 , England , 53 , -2
MS Ff.1.6 , England , 53 , -2
MS Add. 10185 , England (Ipswich) , 52.083333 , 1.166667
MS Dd.4.24 , England (Ipswich) , 52.083333 , 1.166667
Inc.0.A.1.2[6] , Germany; Mainz , 50 , 8.271111
MS Ii.1.33 , Barnwell , 52.45 , -0.45
MS Add.6190 , Barnwell , 52.45 , -0.45
MS Add. 3479 , Francia (?Lyons) , 45.748457 , 4.846711
MS Ii.4.26 , England , 53 , -2
K*.7.15-(A) , London , 51.514248 , -0.093145
MS Dd.4.17 , East Anglia , 55 , -2.5
MS Gg.5.35 , England - Canterbury - Benedictine abbey of St Augustine , 53 , -2
BSS.604.E82.1 , Shenyang - China: Munkwang Syŏwŏn , 35 , 105
MS Ii.2.4 , Exeter , 50.7 , -3.533333
Inc.1.F.3.1[3304] , Bruges , 51.210933 , 3.225971
Inc.5.B.7.18 [1908] , Milan , 45.466667 , 9.2
MS Add. 10139 , At or near Lund - East Riding of Yorkshire , 53.916667 , -0.516667
MS Kk.3.18 , Worcester , 52.2 , -2.2
MS Ff.4.42 , Wales , 52.5 , -3.5
Inc.3.J.4.1[3636] , St. Albans , 51.75 , -0.333333
MS Ll.5.18 , St. Albans , 51.75 , -0.333333
Inc.5.A.4.9[514] , Cologne , 47.009909 , 2.32114
Inc.5.J.2.2 [3589] , Oxford , 51.75 , -1.25
MS Ff.6.8 , Bruges - Flanders , 51.210933 , 3.225971
MS Ff.1.25.3 , England , 53 , -2
MS Dd.1.14 , Italy(text); England - ?London (decoration) , 42.8333 , 12.8333
MS Ll.1.10 , Cerne Abbey - Dorset , 50.8 , -2.466667
MS Dd.5.5 , France - Paris , 48.866667 , 2.333333
MS Add. 6594 , Near Nikisiani , 40.95 , 24.15
MS Kk.5.16 , Wearmouth Jarrow , 54.980556 , -1.450833
MS Kk.4.25 , England - ?London , 53 , -2
Inc.5.B.7.23 [1922] , Impressus Mediola[n]i , 45.466667 , 9.2
MS Ff.1.24 , Constantinople , 41.011046 , 28.957798
MS Ff.1.23 , Possibly Winchcombe or Canterbury , 51.95 , -1.966667
MS Nn.2.41 , Possibly Beirut , 33.8667 , 35.5
MS Ii.6.31 , England , 53 , -2
MS Add. 3021 , Thorney - Cambridgeshire , 52.616667 , -0.1
Inc.5.D.1.19[2530] , France; Paris , 48.866667 , 2.333333
UL MS Ll.1.18 , England , 53 , -2
Inc.4.B.7.1 [4354] , Opus Imp[re]ssum M[edio]l[an]i , 45.466667 , 9.2
MS Ee.4.24 , Paris , 52.5 , -3.5
MS Ff.1.27 , Bury St. Edmunds , 52.5 , -3.5
MS Gg.1.1 , England , 53 , -2
Gg.4.18 , England , 53 , -2
MS Hh.1.10 , Exeter , 50.7 , -3.533333
MS Mm.5.31 , Germany - Cologne or Lower Saxony , 51.5 , 10.5
Inc.Frags.4[3739] , Netherlands; Northern Netherlands ? , 52.5 , 5.75
Inc.7.B.2.27[3660] , Rome , 41.9 , 12.483333
MS Gg.4.6 , Paris , 48.866667 , 2.333333
SSS.34.2 , Venice , 45.438611 , 12.326667
MS Add.9308 , Venice , 45.438611 , 12.326667
MS Dd.12.23 , England - perhaps Oxford , 51.75 , -1.25
Ii. vi. 33 , Britain , 54 , -2
BSS.604.E83.3 , Shenyang - China: Munkwang Syŏwŏn , 35 , 105
Inc.3[4245] , Germany , 51.5 , 10.5
SSS.54.33 , Vinegia , 45.438611 , 12.326667
MS Gg.4.27.1 , Vinegia , 45.438611 , 12.326667
MS Ff.1.25.2 , England , 53 , -2
MS Ee.3.59 , England - London/Westminster , 51.5 , -0.1667
MS Add. 3020 , Thorney - Cambridgeshire , 52.616667 , -0.1
Inc.5.B.3.2[4321] , Italy; Venice , 45.438611 , 12.326667
UL MS Add. 8460 , England , 53 , -2
MS Ii.3.21 , England , 53 , -2
Inc.1.A.3.3[4187a] , Germany , 51.5 , 10.5
