<kml xmlns="http://earth.google.com/kml/2.0">
<document>
<style id="red_dot"> <IconStyle><scale>0.06</scale><Icon><href>icons/red_dot.png</href></Icon></IconStyle></style> 
<style id="red_line"><LineStyle><color>ff0000ff</color><width>1.5</width></LineStyle></style>
<style id="orange_line"><LineStyle><color>ed2d87ff</color><width>1.5</width></LineStyle></style>









<placemark>
<name></name>
<description></description>
<styleurl>#red_line</styleurl>
<linestring>
<altitudemode>Absolute</altitudemode>
<coordinates>
10.26574999094,55.258480031044,251
10.266079986468,55.258989986033,244
10.266639981419,55.259670009837,251
10.266969976947,55.260250037537,251
10.267940014601,55.26173003018,251
10.267940014601,55.26173003018,251
10.268820030615,55.263199964539,251
10.268820030615,55.263199964539,251
10.276380004361,55.275290021673,259
10.276659959927,55.275739962236,251
10.27697998099,55.276250001044,251
10.27697998099,55.276250001044,251
10.27697998099,55.276250001044,251
10.277869971469,55.277569983155,251
10.278110029176,55.278080021963,259
10.27851998806,55.278580002487,251
10.278840009123,55.279130022973,251
10.279239993543,55.279820021242,251
10.27956998907,55.280359983445,251
10.27956998907,55.280359983445,244
10.27956998907,55.280359983445,251
10.27956998907,55.280359983445,251
10.280940011144,55.282420003787,251
10.281100021675,55.282749999315,251
10.281699998304,55.283620040864,251
10.281830001623,55.283890021965,251
10.282039968297,55.284180035815,251
10.282039968297,55.284180035815,251
10.282039968297,55.284180035815,251
10.282039968297,55.284180035815,251
10.282039968297,55.284180035815,251
10.282039968297,55.284180035815,251
10.282039968297,55.284180035815,251
10.285119982436,55.288840038702,251
10.285119982436,55.288840038702,251
10.285119982436,55.288840038702,251
10.285790031776,55.289930021391,251
10.285790031776,55.289930021391,251
10.285790031776,55.289930021391,244
10.285790031776,55.289930021391,244
10.28735996224,55.292369993404,251
10.28735996224,55.292369993404,251
10.28735996224,55.292369993404,251
10.28735996224,55.292369993404,251
10.28735996224,55.292369993404,251
10.294439988211,55.302890036256,251
10.294439988211,55.302890036256,251
10.294439988211,55.302890036256,251
10.295240040869,55.304170036689,251
10.295719988644,55.304900016636,251
10.296209994704,55.305590014905,251
10.296209994704,55.305590014905,251
10.296209994704,55.305590014905,251
10.296209994704,55.305590014905,251
10.297259995714,55.307239992545,251
10.297659980133,55.307969972492,251
10.297659980133,55.307969972492,251
10.297659980133,55.307969972492,251
10.298549970612,55.309300012887,251
10.299770040438,55.311130033806,251
10.299099991098,55.31011004001,251
10.299439961091,55.31058001332,259
10.300010014325,55.311400014908,259
10.300010014325,55.311400014908,259
10.300890030339,55.312640033663,251
10.301350029186,55.313319973648,251
10.301699973643,55.313830012456,251
10.302010020241,55.314299985767,251
10.302349990234,55.314810024575,251
10.302349990234,55.314810024575,251
10.302349990234,55.314810024575,251
10.303260013461,55.316120032222,251
10.303260013461,55.316120032222,251
10.303959986195,55.31721001491,244
10.304610002786,55.318179968745,244
10.304930023849,55.318629993126,244
10.305179972202,55.318959988654,244
10.30550996773,55.319470027462,244
10.306089995429,55.320309977979,251
10.306089995429,55.320309977979,251
10.306840008125,55.321329971776,251
10.306840008125,55.321329971776,251
10.307420035824,55.322170006112,251
10.307420035824,55.322170006112,251
10.307920016348,55.322939967737,251
10.308340033516,55.323519995437,251
10.308649996296,55.323989968747,251
10.309209991247,55.324809970335,251
10.309590026736,55.325290001929,251
10.310350013897,55.326279988513,259
10.30999998562,55.325800040737,251
10.31067003496,55.326830008999,259
10.31124997884,55.327610028908,251
10.311639988795,55.32805996947,259
10.311639988795,55.32805996947,251
10.311639988795,55.32805996947,251
10.312580019236,55.329520013184,244
10.3131700214,55.33027002588,244
10.313249984756,55.330500025303,244
10.313670001924,55.331109976396,244
10.313670001924,55.331109976396,244
10.31422002241,55.331910029054,244
10.31422002241,55.331910029054,244
10.314910020679,55.332870008424,244
10.315330037847,55.33362002112,244
10.315920040012,55.334380008281,251
10.315920040012,55.334380008281,251
10.316250035539,55.334919970483,251
10.316569972783,55.335390027613,251
10.317939994857,55.337309986353,259
10.31826001592,55.337809966878,259
10.318590011448,55.338229984046,251
10.318750021979,55.338410027326,259
10.319319991395,55.339160040021,251
10.319879986346,55.339920027182,251
10.320160025731,55.340420007706,251
10.32036001794,55.340650007129,251
10.320910038427,55.341440001503,251
10.321069965139,55.341630019248,251
10.321570029482,55.342299984769,251
10.32190002501,55.342880012468,251
10.32230000943,55.343440007419,251
10.322709968314,55.343990027905,244
10.323069971055,55.344559997321,251
10.32335001044,55.344999963418,244
10.323759969324,55.345500027761,244
10.324070015922,55.346000008286,244
10.32449003309,55.346609959379,251
10.324639985338,55.346829984338,251
10.325150024146,55.347630036995,251
10.325480019674,55.348139991984,251
10.325610022992,55.348390024156,251
10.326019981876,55.34898002632,251
10.326419966295,55.349489981309,251
10.326579976827,55.349810002372,259
10.326979961246,55.350379971788,259
10.327550014481,55.351139958948,259
10.327629977837,55.351359983907,259
10.328200031072,55.352100022138,259
10.328600015491,55.352600002662,251
10.329009974375,55.353099983186,259
10.329329995439,55.353650003672,251
10.329569969326,55.353970024735,251
10.329569969326,55.353970024735,251
10.330560039729,55.355269974098,251
10.330979973078,55.355819994584,251
10.330979973078,55.355819994584,251
10.331560000777,55.35666002892,244
10.331560000777,55.35666002892,244
10.331560000777,55.35666002892,244
10.331560000777,55.35666002892,244
10.331560000777,55.35666002892,236
10.331560000777,55.35666002892,236
10.333850020543,55.359920002521,236
10.334419989959,55.360660040752,236
10.33458000049,55.360840000213,236
10.334970010445,55.361409969628,228
10.334970010445,55.361409969628,228
10.335890008137,55.36261998117,228
10.33612000756,55.362849980593,228
10.336470035836,55.363409975544,228
10.33697001636,55.364020010457,221
10.33697001636,55.364020010457,221
10.337549960241,55.364810004831,221
10.33812998794,55.365599999205,213
10.338629968464,55.366210034118,213
10.338940015063,55.366650000215,213
10.339430021122,55.367249976844,213
10.339749958366,55.36770997569,213
10.339749958366,55.36770997569,213
10.340150026605,55.368210040033,213
10.340550011024,55.368719995022,206
10.34121000208,55.369600011036,198
10.34121000208,55.369600011036,198
10.341630019248,55.370160005987,190
10.341630019248,55.370160005987,190
10.342380031943,55.371189974249,190
10.342959975824,55.37193001248,183
10.343300029636,55.372329996899,183
10.343630025163,55.372789995745,183
10.344030009583,55.373249994591,183
10.344380037859,55.373649979011,183
10.344629986212,55.373890036718,183
10.345040028915,55.374350035564,183
10.345040028915,55.374350035564,183
10.346039989963,55.375419985503,175
10.346039989963,55.375419985503,175
10.346539970487,55.375900017098,168
10.34725997597,55.376720018685,168
10.34745996818,55.37691003643,168
10.348039995879,55.377470031381,168
10.348230013624,55.377640016377,160
10.348620023579,55.378079982475,160
10.348869971931,55.378309981898,160
10.348869971931,55.378309981898,160
10.348869971931,55.378309981898,160
10.350950025022,55.380219966174,152
10.351540027186,55.380709972233,145
10.352279981598,55.381239959971,129
10.352509981021,55.381389996037,129
10.352509981021,55.381389996037,129
10.352509981021,55.381389996037,129
10.352509981021,55.381389996037,129
10.352509981021,55.381389996037,129
10.352509981021,55.381389996037,129
10.352509981021,55.381389996037,84
10.352509981021,55.381389996037,84
10.352509981021,55.381389996037,84
10.352509981021,55.381389996037,84
10.352509981021,55.381389996037,84
10.352509981021,55.381389996037,84
10.352509981021,55.381389996037,84
10.352509981021,55.381389996037,84
10.352509981021,55.381389996037,84
10.352509981021,55.381389996037,53
10.352509981021,55.381389996037,46
10.352509981021,55.381389996037,46
10.352509981021,55.381389996037,38
10.352509981021,55.381389996037,38
10.352509981021,55.381389996037,38
10.352509981021,55.381389996037,38
10.352509981021,55.381389996037,38
10.352509981021,55.381389996037,38
10.352509981021,55.381389996037,15
10.352509981021,55.381389996037,15
10.352509981021,55.381389996037,8
10.352509981021,55.381389996037,8
10.352509981021,55.381389996037,8
10.352509981021,55.381389996037,8
10.363349961117,55.384549973533,0
10.363339986652,55.384549973533,0
10.363439982757,55.384549973533,0
10.363439982757,55.384549973533,0
10.363520029932,55.384549973533,-8
10.363520029932,55.384549973533,-8
10.363520029932,55.384549973533,-8
10.363520029932,55.384549973533,-8
10.363690014929,55.38450001739,-15
10.363739971072,55.384509991855,-30
10.363739971072,55.384509991855,-30
10.363739971072,55.384509991855,-30
10.363739971072,55.384509991855,-30
10.363739971072,55.384509991855,-30
10.363739971072,55.384509991855,-30
10.363739971072,55.384509991855,-30
10.363739971072,55.384509991855,-30
10.363739971072,55.384509991855,-30
10.363739971072,55.384509991855,-30
10.363739971072,55.384509991855,-30
</coordinates>
</linestring>
</placemark>
<placemark><name>First heard</name><description>Track id: 4 Time: 2020-06-14 15:54:13 Altitude: 251 m Speed: 61.73 m/s</description><styleurl>#red_dot</styleurl><point><coordinates>10.26574999094,55.258480031044,251</coordinates></point><extendeddata><data name="type"><value>trkpt</value></data></extendeddata></placemark>
<placemark><name></name><description>Track id: 5 Time: 2020-06-14 15:54:14 Altitude: 244 m Speed: 61.73 m/s</description><styleurl>#red_dot</styleurl><point><coordinates>10.266079986468,55.258989986033,244</coordinates></point><extendeddata><data name="type"><value>trkpt</value></data></extendeddata></placemark>
<placemark><name></name><description>Track id: 6 Time: 2020-06-14 15:54:15 Altitude: 251 m Speed: 61.73 m/s</description><styleurl>#red_dot</styleurl><point><coordinates>10.266639981419,55.259670009837,251</coordinates></point><extendeddata><data name="type"><value>trkpt</value></data></extendeddata></placemark>
<placemark><name></name><description>Track id: 7 Time: 2020-06-14 15:54:16 Altitude: 251 m Speed: 61.73 m/s</description><styleurl>#red_dot</styleurl><point><coordinates>10.266969976947,55.260250037537,251</coordinates></point><extendeddata><data name="type"><value>trkpt</value></data></extendeddata></placemark>
<placemark><name></name><description>Track id: 8 Time: 2020-06-14 15:54:19 Altitude: 251 m Speed: 61.73 m/s</description><styleurl>#red_dot</styleurl><point><coordinates>10.267940014601,55.26173003018,251</coordinates></point><extendeddata><data name="type"><value>trkpt</value></data></extendeddata></placemark>
<placemark><name></name><description>Track id: 9 Time: 2020-06-14 15:54:21 Altitude: 251 m Speed: 61.22 m/s</description><styleurl>#red_dot</styleurl><point><coordinates>10.267940014601,55.26173003018,251</coordinates></point><extendeddata><data name="type"><value>trkpt</value></data></extendeddata></placemark>
<placemark><name></name><description>Track id: 10 Time: 2020-06-14 15:54:23 Altitude: 251 m Speed: 61.22 m/s</description><styleurl>#red_dot</styleurl><point><coordinates>10.268820030615,55.263199964539,251</coordinates></point><extendeddata><data name="type"><value>trkpt</value></data></extendeddata></placemark>
<placemark><name></name><description>Track id: 11 Time: 2020-06-14 15:54:43 Altitude: 251 m Speed: 61.22 m/s</description><styleurl>#red_dot</styleurl><point><coordinates>10.268820030615,55.263199964539,251</coordinates></point><extendeddata><data name="type"><value>trkpt</value></data></extendeddata></placemark>
<placemark><name></name><description>Track id: 12 Time: 2020-06-14 15:54:46 Altitude: 259 m Speed: 61.22 m/s</description><styleurl>#red_dot</styleurl><point><coordinates>10.276380004361,55.275290021673,259</coordinates></point><extendeddata><data name="type"><value>trkpt</value></data></extendeddata></placemark>
<placemark><name></name><description>Track id: 13 Time: 2020-06-14 15:54:46 Altitude: 251 m Speed: 61.22 m/s</description><styleurl>#red_dot</styleurl><point><coordinates>10.276659959927,55.275739962236,251</coordinates></point><extendeddata><data name="type"><value>trkpt</value></data></extendeddata></placemark>
<placemark><name></name><description>Track id: 14 Time: 2020-06-14 15:54:47 Altitude: 251 m Speed: 60.7 m/s</description><styleurl>#red_dot</styleurl><point><coordinates>10.27697998099,55.276250001044,251</coordinates></point><extendeddata><data name="type"><value>trkpt</value></data></extendeddata></placemark>
<placemark><name></name><description>Track id: 15 Time: 2020-06-14 15:54:48 Altitude: 251 m Speed: 61.22 m/s</description><styleurl>#red_dot</styleurl><point><coordinates>10.27697998099,55.276250001044,251</coordinates></point><extendeddata><data name="type"><value>trkpt</value></data></extendeddata></placemark>
<placemark><name></name><description>Track id: 16 Time: 2020-06-14 15:54:50 Altitude: 251 m Speed: 60.7 m/s</description><styleurl>#red_dot</styleurl><point><coordinates>10.27697998099,55.276250001044,251</coordinates></point><extendeddata><data name="type"><value>trkpt</value></data></extendeddata></placemark>
<placemark><name></name><description>Track id: 17 Time: 2020-06-14 15:54:50 Altitude: 251 m Speed: 61.22 m/s</description><styleurl>#red_dot</styleurl><point><coordinates>10.277869971469,55.277569983155,251</coordinates></point><extendeddata><data name="type"><value>trkpt</value></data></extendeddata></placemark>
<placemark><name></name><description>Track id: 18 Time: 2020-06-14 15:54:51 Altitude: 259 m Speed: 61.22 m/s</description><styleurl>#red_dot</styleurl><point><coordinates>10.278110029176,55.278080021963,259</coordinates></point><extendeddata><data name="type"><value>trkpt</value></data></extendeddata></placemark>
<placemark><name></name><description>Track id: 19 Time: 2020-06-14 15:54:52 Altitude: 251 m Speed: 61.22 m/s</description><styleurl>#red_dot</styleurl><point><coordinates>10.27851998806,55.278580002487,251</coordinates></point><extendeddata><data name="type"><value>trkpt</value></data></extendeddata></placemark>
<placemark><name></name><description>Track id: 20 Time: 2020-06-14 15:54:54 Altitude: 251 m Speed: 61.22 m/s</description><styleurl>#red_dot</styleurl><point><coordinates>10.278840009123,55.279130022973,251</coordinates></point><extendeddata><data name="type"><value>trkpt</value></data></extendeddata></placemark>
<placemark><name></name><description>Track id: 21 Time: 2020-06-14 15:54:54 Altitude: 251 m Speed: 61.22 m/s</description><styleurl>#red_dot</styleurl><point><coordinates>10.279239993543,55.279820021242,251</coordinates></point><extendeddata><data name="type"><value>trkpt</value></data></extendeddata></placemark>
<placemark><name></name><description>Track id: 22 Time: 2020-06-14 15:54:56 Altitude: 251 m Speed: 61.22 m/s</description><styleurl>#red_dot</styleurl><point><coordinates>10.27956998907,55.280359983445,251</coordinates></point><extendeddata><data name="type"><value>trkpt</value></data></extendeddata></placemark>
<placemark><name></name><description>Track id: 23 Time: 2020-06-14 15:54:57 Altitude: 244 m Speed: 61.22 m/s</description><styleurl>#red_dot</styleurl><point><coordinates>10.27956998907,55.280359983445,244</coordinates></point><extendeddata><data name="type"><value>trkpt</value></data></extendeddata></placemark>
<placemark><name></name><description>Track id: 24 Time: 2020-06-14 15:54:57 Altitude: 251 m Speed: 61.22 m/s</description><styleurl>#red_dot</styleurl><point><coordinates>10.27956998907,55.280359983445,251</coordinates></point><extendeddata><data name="type"><value>trkpt</value></data></extendeddata></placemark>
<placemark><name></name><description>Track id: 25 Time: 2020-06-14 15:54:59 Altitude: 251 m Speed: 62.25 m/s</description><styleurl>#red_dot</styleurl><point><coordinates>10.27956998907,55.280359983445,251</coordinates></point><extendeddata><data name="type"><value>trkpt</value></data></extendeddata></placemark>
<placemark><name></name><description>Track id: 26 Time: 2020-06-14 15:54:59 Altitude: 251 m Speed: 62.25 m/s</description><styleurl>#red_dot</styleurl><point><coordinates>10.280940011144,55.282420003787,251</coordinates></point><extendeddata><data name="type"><value>trkpt</value></data></extendeddata></placemark>
<placemark><name></name><description>Track id: 27 Time: 2020-06-14 15:55:00 Altitude: 251 m Speed: 62.25 m/s</description><styleurl>#red_dot</styleurl><point><coordinates>10.281100021675,55.282749999315,251</coordinates></point><extendeddata><data name="type"><value>trkpt</value></data></extendeddata></placemark>
<placemark><name></name><description>Track id: 28 Time: 2020-06-14 15:55:02 Altitude: 251 m Speed: 62.25 m/s</description><styleurl>#red_dot</styleurl><point><coordinates>10.281699998304,55.283620040864,251</coordinates></point><extendeddata><data name="type"><value>trkpt</value></data></extendeddata></placemark>
<placemark><name></name><description>Track id: 29 Time: 2020-06-14 15:55:03 Altitude: 251 m Speed: 62.25 m/s</description><styleurl>#red_dot</styleurl><point><coordinates>10.281830001623,55.283890021965,251</coordinates></point><extendeddata><data name="type"><value>trkpt</value></data></extendeddata></placemark>
<placemark><name></name><description>Track id: 30 Time: 2020-06-14 15:55:05 Altitude: 251 m Speed: 62.76 m/s</description><styleurl>#red_dot</styleurl><point><coordinates>10.282039968297,55.284180035815,251</coordinates></point><extendeddata><data name="type"><value>trkpt</value></data></extendeddata></placemark>
<placemark><name></name><description>Track id: 31 Time: 2020-06-14 15:55:05 Altitude: 251 m Speed: 62.76 m/s</description><styleurl>#red_dot</styleurl><point><coordinates>10.282039968297,55.284180035815,251</coordinates></point><extendeddata><data name="type"><value>trkpt</value></data></extendeddata></placemark>
<placemark><name></name><description>Track id: 32 Time: 2020-06-14 15:55:05 Altitude: 251 m Speed: 62.76 m/s</description><styleurl>#red_dot</styleurl><point><coordinates>10.282039968297,55.284180035815,251</coordinates></point><extendeddata><data name="type"><value>trkpt</value></data></extendeddata></placemark>
<placemark><name></name><description>Track id: 33 Time: 2020-06-14 15:55:06 Altitude: 251 m Speed: 63.28 m/s</description><styleurl>#red_dot</styleurl><point><coordinates>10.282039968297,55.284180035815,251</coordinates></point><extendeddata><data name="type"><value>trkpt</value></data></extendeddata></placemark>
<placemark><name></name><description>Track id: 34 Time: 2020-06-14 15:55:08 Altitude: 251 m Speed: 63.28 m/s</description><styleurl>#red_dot</styleurl><point><coordinates>10.282039968297,55.284180035815,251</coordinates></point><extendeddata><data name="type"><value>trkpt</value></data></extendeddata></placemark>
<placemark><name></name><description>Track id: 35 Time: 2020-06-14 15:55:09 Altitude: 251 m Speed: 63.79 m/s</description><styleurl>#red_dot</styleurl><point><coordinates>10.282039968297,55.284180035815,251</coordinates></point><extendeddata><data name="type"><value>trkpt</value></data></extendeddata></placemark>
<placemark><name></name><description>Track id: 36 Time: 2020-06-14 15:55:10 Altitude: 251 m Speed: 63.79 m/s</description><styleurl>#red_dot</styleurl><point><coordinates>10.282039968297,55.284180035815,251</coordinates></point><extendeddata><data name="type"><value>trkpt</value></data></extendeddata></placemark>
<placemark><name></name><description>Track id: 37 Time: 2020-06-14 15:55:13 Altitude: 251 m Speed: 64.31 m/s</description><styleurl>#red_dot</styleurl><point><coordinates>10.285119982436,55.288840038702,251</coordinates></point><extendeddata><data name="type"><value>trkpt</value></data></extendeddata></placemark>
<placemark><name></name><description>Track id: 38 Time: 2020-06-14 15:55:13 Altitude: 251 m Speed: 64.31 m/s</description><styleurl>#red_dot</styleurl><point><coordinates>10.285119982436,55.288840038702,251</coordinates></point><extendeddata><data name="type"><value>trkpt</value></data></extendeddata></placemark>
<placemark><name></name><description>Track id: 39 Time: 2020-06-14 15:55:14 Altitude: 251 m Speed: 64.31 m/s</description><styleurl>#red_dot</styleurl><point><coordinates>10.285119982436,55.288840038702,251</coordinates></point><extendeddata><data name="type"><value>trkpt</value></data></extendeddata></placemark>
<placemark><name></name><description>Track id: 40 Time: 2020-06-14 15:55:15 Altitude: 251 m Speed: 64.31 m/s</description><styleurl>#red_dot</styleurl><point><coordinates>10.285790031776,55.289930021391,251</coordinates></point><extendeddata><data name="type"><value>trkpt</value></data></extendeddata></placemark>
<placemark><name></name><description>Track id: 41 Time: 2020-06-14 15:55:16 Altitude: 251 m Speed: 64.31 m/s</description><styleurl>#red_dot</styleurl><point><coordinates>10.285790031776,55.289930021391,251</coordinates></point><extendeddata><data name="type"><value>trkpt</value></data></extendeddata></placemark>
<placemark><name></name><description>Track id: 42 Time: 2020-06-14 15:55:17 Altitude: 244 m Speed: 64.31 m/s</description><styleurl>#red_dot</styleurl><point><coordinates>10.285790031776,55.289930021391,244</coordinates></point><extendeddata><data name="type"><value>trkpt</value></data></extendeddata></placemark>
<placemark><name></name><description>Track id: 43 Time: 2020-06-14 15:55:17 Altitude: 244 m Speed: 64.31 m/s</description><styleurl>#red_dot</styleurl><point><coordinates>10.285790031776,55.289930021391,244</coordinates></point><extendeddata><data name="type"><value>trkpt</value></data></extendeddata></placemark>
<placemark><name></name><description>Track id: 44 Time: 2020-06-14 15:55:19 Altitude: 251 m Speed: 64.31 m/s</description><styleurl>#red_dot</styleurl><point><coordinates>10.28735996224,55.292369993404,251</coordinates></point><extendeddata><data name="type"><value>trkpt</value></data></extendeddata></placemark>
<placemark><name></name><description>Track id: 45 Time: 2020-06-14 15:55:19 Altitude: 251 m Speed: 64.31 m/s</description><styleurl>#red_dot</styleurl><point><coordinates>10.28735996224,55.292369993404,251</coordinates></point><extendeddata><data name="type"><value>trkpt</value></data></extendeddata></placemark>
<placemark><name></name><description>Track id: 46 Time: 2020-06-14 15:55:29 Altitude: 251 m Speed: 64.31 m/s</description><styleurl>#red_dot</styleurl><point><coordinates>10.28735996224,55.292369993404,251</coordinates></point><extendeddata><data name="type"><value>trkpt</value></data></extendeddata></placemark>
<placemark><name></name><description>Track id: 47 Time: 2020-06-14 15:55:36 Altitude: 251 m Speed: 61.22 m/s</description><styleurl>#red_dot</styleurl><point><coordinates>10.28735996224,55.292369993404,251</coordinates></point><extendeddata><data name="type"><value>trkpt</value></data></extendeddata></placemark>
<placemark><name></name><description>Track id: 48 Time: 2020-06-14 15:55:38 Altitude: 251 m Speed: 61.22 m/s</description><styleurl>#red_dot</styleurl><point><coordinates>10.28735996224,55.292369993404,251</coordinates></point><extendeddata><data name="type"><value>trkpt</value></data></extendeddata></placemark>
<placemark><name></name><description>Track id: 49 Time: 2020-06-14 15:55:39 Altitude: 251 m Speed: 61.22 m/s</description><styleurl>#red_dot</styleurl><point><coordinates>10.294439988211,55.302890036256,251</coordinates></point><extendeddata><data name="type"><value>trkpt</value></data></extendeddata></placemark>
<placemark><name></name><description>Track id: 50 Time: 2020-06-14 15:55:39 Altitude: 251 m Speed: 61.22 m/s</description><styleurl>#red_dot</styleurl><point><coordinates>10.294439988211,55.302890036256,251</coordinates></point><extendeddata><data name="type"><value>trkpt</value></data></extendeddata></placemark>
<placemark><name></name><description>Track id: 51 Time: 2020-06-14 15:55:40 Altitude: 251 m Speed: 61.22 m/s</description><styleurl>#red_dot</styleurl><point><coordinates>10.294439988211,55.302890036256,251</coordinates></point><extendeddata><data name="type"><value>trkpt</value></data></extendeddata></placemark>
<placemark><name></name><description>Track id: 52 Time: 2020-06-14 15:55:41 Altitude: 251 m Speed: 60.7 m/s</description><styleurl>#red_dot</styleurl><point><coordinates>10.295240040869,55.304170036689,251</coordinates></point><extendeddata><data name="type"><value>trkpt</value></data></extendeddata></placemark>
<placemark><name></name><description>Track id: 53 Time: 2020-06-14 15:55:42 Altitude: 251 m Speed: 60.7 m/s</description><styleurl>#red_dot</styleurl><point><coordinates>10.295719988644,55.304900016636,251</coordinates></point><extendeddata><data name="type"><value>trkpt</value></data></extendeddata></placemark>
<placemark><name></name><description>Track id: 54 Time: 2020-06-14 15:55:45 Altitude: 251 m Speed: 60.7 m/s</description><styleurl>#red_dot</styleurl><point><coordinates>10.296209994704,55.305590014905,251</coordinates></point><extendeddata><data name="type"><value>trkpt</value></data></extendeddata></placemark>
<placemark><name></name><description>Track id: 55 Time: 2020-06-14 15:55:46 Altitude: 251 m Speed: 61.22 m/s</description><styleurl>#red_dot</styleurl><point><coordinates>10.296209994704,55.305590014905,251</coordinates></point><extendeddata><data name="type"><value>trkpt</value></data></extendeddata></placemark>
<placemark><name></name><description>Track id: 56 Time: 2020-06-14 15:55:46 Altitude: 251 m Speed: 61.22 m/s</description><styleurl>#red_dot</styleurl><point><coordinates>10.296209994704,55.305590014905,251</coordinates></point><extendeddata><data name="type"><value>trkpt</value></data></extendeddata></placemark>
<placemark><name></name><description>Track id: 57 Time: 2020-06-14 15:55:46 Altitude: 251 m Speed: 61.73 m/s</description><styleurl>#red_dot</styleurl><point><coordinates>10.296209994704,55.305590014905,251</coordinates></point><extendeddata><data name="type"><value>trkpt</value></data></extendeddata></placemark>
<placemark><name></name><description>Track id: 58 Time: 2020-06-14 15:55:47 Altitude: 251 m Speed: 61.73 m/s</description><styleurl>#red_dot</styleurl><point><coordinates>10.297259995714,55.307239992545,251</coordinates></point><extendeddata><data name="type"><value>trkpt</value></data></extendeddata></placemark>
<placemark><name></name><description>Track id: 59 Time: 2020-06-14 15:55:49 Altitude: 251 m Speed: 61.73 m/s</description><styleurl>#red_dot</styleurl><point><coordinates>10.297659980133,55.307969972492,251</coordinates></point><extendeddata><data name="type"><value>trkpt</value></data></extendeddata></placemark>
<placemark><name></name><description>Track id: 60 Time: 2020-06-14 15:55:50 Altitude: 251 m Speed: 61.73 m/s</description><styleurl>#red_dot</styleurl><point><coordinates>10.297659980133,55.307969972492,251</coordinates></point><extendeddata><data name="type"><value>trkpt</value></data></extendeddata></placemark>
<placemark><name></name><description>Track id: 61 Time: 2020-06-14 15:55:51 Altitude: 251 m Speed: 61.73 m/s</description><styleurl>#red_dot</styleurl><point><coordinates>10.297659980133,55.307969972492,251</coordinates></point><extendeddata><data name="type"><value>trkpt</value></data></extendeddata></placemark>
<placemark><name></name><description>Track id: 62 Time: 2020-06-14 15:55:51 Altitude: 251 m Speed: 61.73 m/s</description><styleurl>#red_dot</styleurl><point><coordinates>10.298549970612,55.309300012887,251</coordinates></point><extendeddata><data name="type"><value>trkpt</value></data></extendeddata></placemark>
<placemark><name></name><description>Track id: 63 Time: 2020-06-14 15:55:54 Altitude: 251 m Speed: 62.76 m/s</description><styleurl>#red_dot</styleurl><point><coordinates>10.299770040438,55.311130033806,251</coordinates></point><extendeddata><data name="type"><value>trkpt</value></data></extendeddata></placemark>
<placemark><name></name><description>Track id: 64 Time: 2020-06-14 15:55:55 Altitude: 251 m Speed: 61.73 m/s</description><styleurl>#red_dot</styleurl><point><coordinates>10.299099991098,55.31011004001,251</coordinates></point><extendeddata><data name="type"><value>trkpt</value></data></extendeddata></placemark>
<placemark><name></name><description>Track id: 65 Time: 2020-06-14 15:55:55 Altitude: 259 m Speed: 62.76 m/s</description><styleurl>#red_dot</styleurl><point><coordinates>10.299439961091,55.31058001332,259</coordinates></point><extendeddata><data name="type"><value>trkpt</value></data></extendeddata></placemark>
<placemark><name></name><description>Track id: 66 Time: 2020-06-14 15:55:55 Altitude: 259 m Speed: 62.76 m/s</description><styleurl>#red_dot</styleurl><point><coordinates>10.300010014325,55.311400014908,259</coordinates></point><extendeddata><data name="type"><value>trkpt</value></data></extendeddata></placemark>
<placemark><name></name><description>Track id: 67 Time: 2020-06-14 15:55:56 Altitude: 259 m Speed: 62.76 m/s</description><styleurl>#red_dot</styleurl><point><coordinates>10.300010014325,55.311400014908,259</coordinates></point><extendeddata><data name="type"><value>trkpt</value></data></extendeddata></placemark>
<placemark><name></name><description>Track id: 68 Time: 2020-06-14 15:55:58 Altitude: 251 m Speed: 62.76 m/s</description><styleurl>#red_dot</styleurl><point><coordinates>10.300890030339,55.312640033663,251</coordinates></point><extendeddata><data name="type"><value>trkpt</value></data></extendeddata></placemark>
<placemark><name></name><description>Track id: 69 Time: 2020-06-14 15:55:59 Altitude: 251 m Speed: 63.28 m/s</description><styleurl>#red_dot</styleurl><point><coordinates>10.301350029186,55.313319973648,251</coordinates></point><extendeddata><data name="type"><value>trkpt</value></data></extendeddata></placemark>
<placemark><name></name><description>Track id: 70 Time: 2020-06-14 15:56:00 Altitude: 251 m Speed: 63.79 m/s</description><styleurl>#red_dot</styleurl><point><coordinates>10.301699973643,55.313830012456,251</coordinates></point><extendeddata><data name="type"><value>trkpt</value></data></extendeddata></placemark>
<placemark><name></name><description>Track id: 71 Time: 2020-06-14 15:56:00 Altitude: 251 m Speed: 63.79 m/s</description><styleurl>#red_dot</styleurl><point><coordinates>10.302010020241,55.314299985767,251</coordinates></point><extendeddata><data name="type"><value>trkpt</value></data></extendeddata></placemark>
<placemark><name></name><description>Track id: 72 Time: 2020-06-14 15:56:01 Altitude: 251 m Speed: 63.79 m/s</description><styleurl>#red_dot</styleurl><point><coordinates>10.302349990234,55.314810024575,251</coordinates></point><extendeddata><data name="type"><value>trkpt</value></data></extendeddata></placemark>
<placemark><name></name><description>Track id: 73 Time: 2020-06-14 15:56:02 Altitude: 251 m Speed: 63.79 m/s</description><styleurl>#red_dot</styleurl><point><coordinates>10.302349990234,55.314810024575,251</coordinates></point><extendeddata><data name="type"><value>trkpt</value></data></extendeddata></placemark>
<placemark><name></name><description>Track id: 74 Time: 2020-06-14 15:56:04 Altitude: 251 m Speed: 63.79 m/s</description><styleurl>#red_dot</styleurl><point><coordinates>10.302349990234,55.314810024575,251</coordinates></point><extendeddata><data name="type"><value>trkpt</value></data></extendeddata></placemark>
<placemark><name></name><description>Track id: 75 Time: 2020-06-14 15:56:04 Altitude: 251 m Speed: 63.79 m/s</description><styleurl>#red_dot</styleurl><point><coordinates>10.303260013461,55.316120032222,251</coordinates></point><extendeddata><data name="type"><value>trkpt</value></data></extendeddata></placemark>
<placemark><name></name><description>Track id: 76 Time: 2020-06-14 15:56:05 Altitude: 251 m Speed: 63.79 m/s</description><styleurl>#red_dot</styleurl><point><coordinates>10.303260013461,55.316120032222,251</coordinates></point><extendeddata><data name="type"><value>trkpt</value></data></extendeddata></placemark>
<placemark><name></name><description>Track id: 77 Time: 2020-06-14 15:56:06 Altitude: 244 m Speed: 63.79 m/s</description><styleurl>#red_dot</styleurl><point><coordinates>10.303959986195,55.31721001491,244</coordinates></point><extendeddata><data name="type"><value>trkpt</value></data></extendeddata></placemark>
<placemark><name></name><description>Track id: 78 Time: 2020-06-14 15:56:08 Altitude: 244 m Speed: 62.76 m/s</description><styleurl>#red_dot</styleurl><point><coordinates>10.304610002786,55.318179968745,244</coordinates></point><extendeddata><data name="type"><value>trkpt</value></data></extendeddata></placemark>
<placemark><name></name><description>Track id: 79 Time: 2020-06-14 15:56:09 Altitude: 244 m Speed: 62.76 m/s</description><styleurl>#red_dot</styleurl><point><coordinates>10.304930023849,55.318629993126,244</coordinates></point><extendeddata><data name="type"><value>trkpt</value></data></extendeddata></placemark>
<placemark><name></name><description>Track id: 80 Time: 2020-06-14 15:56:10 Altitude: 244 m Speed: 62.25 m/s</description><styleurl>#red_dot</styleurl><point><coordinates>10.305179972202,55.318959988654,244</coordinates></point><extendeddata><data name="type"><value>trkpt</value></data></extendeddata></placemark>
<placemark><name></name><description>Track id: 81 Time: 2020-06-14 15:56:10 Altitude: 244 m Speed: 62.25 m/s</description><styleurl>#red_dot</styleurl><point><coordinates>10.30550996773,55.319470027462,244</coordinates></point><extendeddata><data name="type"><value>trkpt</value></data></extendeddata></placemark>
<placemark><name></name><description>Track id: 82 Time: 2020-06-14 15:56:12 Altitude: 251 m Speed: 62.25 m/s</description><styleurl>#red_dot</styleurl><point><coordinates>10.306089995429,55.320309977979,251</coordinates></point><extendeddata><data name="type"><value>trkpt</value></data></extendeddata></placemark>
<placemark><name></name><description>Track id: 83 Time: 2020-06-14 15:56:13 Altitude: 251 m Speed: 62.25 m/s</description><styleurl>#red_dot</styleurl><point><coordinates>10.306089995429,55.320309977979,251</coordinates></point><extendeddata><data name="type"><value>trkpt</value></data></extendeddata></placemark>
<placemark><name></name><description>Track id: 84 Time: 2020-06-14 15:56:14 Altitude: 251 m Speed: 62.25 m/s</description><styleurl>#red_dot</styleurl><point><coordinates>10.306840008125,55.321329971776,251</coordinates></point><extendeddata><data name="type"><value>trkpt</value></data></extendeddata></placemark>
<placemark><name></name><description>Track id: 85 Time: 2020-06-14 15:56:15 Altitude: 251 m Speed: 62.76 m/s</description><styleurl>#red_dot</styleurl><point><coordinates>10.306840008125,55.321329971776,251</coordinates></point><extendeddata><data name="type"><value>trkpt</value></data></extendeddata></placemark>
<placemark><name></name><description>Track id: 86 Time: 2020-06-14 15:56:16 Altitude: 251 m Speed: 62.76 m/s</description><styleurl>#red_dot</styleurl><point><coordinates>10.307420035824,55.322170006112,251</coordinates></point><extendeddata><data name="type"><value>trkpt</value></data></extendeddata></placemark>
<placemark><name></name><description>Track id: 87 Time: 2020-06-14 15:56:16 Altitude: 251 m Speed: 62.76 m/s</description><styleurl>#red_dot</styleurl><point><coordinates>10.307420035824,55.322170006112,251</coordinates></point><extendeddata><data name="type"><value>trkpt</value></data></extendeddata></placemark>
<placemark><name></name><description>Track id: 88 Time: 2020-06-14 15:56:17 Altitude: 251 m Speed: 62.76 m/s</description><styleurl>#red_dot</styleurl><point><coordinates>10.307920016348,55.322939967737,251</coordinates></point><extendeddata><data name="type"><value>trkpt</value></data></extendeddata></placemark>
<placemark><name></name><description>Track id: 89 Time: 2020-06-14 15:56:19 Altitude: 251 m Speed: 62.76 m/s</description><styleurl>#red_dot</styleurl><point><coordinates>10.308340033516,55.323519995437,251</coordinates></point><extendeddata><data name="type"><value>trkpt</value></data></extendeddata></placemark>
<placemark><name></name><description>Track id: 90 Time: 2020-06-14 15:56:19 Altitude: 251 m Speed: 62.76 m/s</description><styleurl>#red_dot</styleurl><point><coordinates>10.308649996296,55.323989968747,251</coordinates></point><extendeddata><data name="type"><value>trkpt</value></data></extendeddata></placemark>
<placemark><name></name><description>Track id: 91 Time: 2020-06-14 15:56:21 Altitude: 251 m Speed: 62.76 m/s</description><styleurl>#red_dot</styleurl><point><coordinates>10.309209991247,55.324809970335,251</coordinates></point><extendeddata><data name="type"><value>trkpt</value></data></extendeddata></placemark>
<placemark><name></name><description>Track id: 92 Time: 2020-06-14 15:56:23 Altitude: 251 m Speed: 62.76 m/s</description><styleurl>#red_dot</styleurl><point><coordinates>10.309590026736,55.325290001929,251</coordinates></point><extendeddata><data name="type"><value>trkpt</value></data></extendeddata></placemark>
<placemark><name></name><description>Track id: 93 Time: 2020-06-14 15:56:23 Altitude: 259 m Speed: 63.79 m/s</description><styleurl>#red_dot</styleurl><point><coordinates>10.310350013897,55.326279988513,259</coordinates></point><extendeddata><data name="type"><value>trkpt</value></data></extendeddata></placemark>
<placemark><name></name><description>Track id: 94 Time: 2020-06-14 15:56:24 Altitude: 251 m Speed: 63.79 m/s</description><styleurl>#red_dot</styleurl><point><coordinates>10.30999998562,55.325800040737,251</coordinates></point><extendeddata><data name="type"><value>trkpt</value></data></extendeddata></placemark>
<placemark><name></name><description>Track id: 95 Time: 2020-06-14 15:56:24 Altitude: 259 m Speed: 64.31 m/s</description><styleurl>#red_dot</styleurl><point><coordinates>10.31067003496,55.326830008999,259</coordinates></point><extendeddata><data name="type"><value>trkpt</value></data></extendeddata></placemark>
<placemark><name></name><description>Track id: 96 Time: 2020-06-14 15:56:26 Altitude: 251 m Speed: 64.31 m/s</description><styleurl>#red_dot</styleurl><point><coordinates>10.31124997884,55.327610028908,251</coordinates></point><extendeddata><data name="type"><value>trkpt</value></data></extendeddata></placemark>
<placemark><name></name><description>Track id: 97 Time: 2020-06-14 15:56:27 Altitude: 259 m Speed: 64.82 m/s</description><styleurl>#red_dot</styleurl><point><coordinates>10.311639988795,55.32805996947,259</coordinates></point><extendeddata><data name="type"><value>trkpt</value></data></extendeddata></placemark>
<placemark><name></name><description>Track id: 98 Time: 2020-06-14 15:56:28 Altitude: 251 m Speed: 64.82 m/s</description><styleurl>#red_dot</styleurl><point><coordinates>10.311639988795,55.32805996947,251</coordinates></point><extendeddata><data name="type"><value>trkpt</value></data></extendeddata></placemark>
<placemark><name></name><description>Track id: 99 Time: 2020-06-14 15:56:28 Altitude: 251 m Speed: 63.79 m/s</description><styleurl>#red_dot</styleurl><point><coordinates>10.311639988795,55.32805996947,251</coordinates></point><extendeddata><data name="type"><value>trkpt</value></data></extendeddata></placemark>
<placemark><name></name><description>Track id: 100 Time: 2020-06-14 15:56:30 Altitude: 244 m Speed: 64.31 m/s</description><styleurl>#red_dot</styleurl><point><coordinates>10.312580019236,55.329520013184,244</coordinates></point><extendeddata><data name="type"><value>trkpt</value></data></extendeddata></placemark>
<placemark><name></name><description>Track id: 101 Time: 2020-06-14 15:56:31 Altitude: 244 m Speed: 63.79 m/s</description><styleurl>#red_dot</styleurl><point><coordinates>10.3131700214,55.33027002588,244</coordinates></point><extendeddata><data name="type"><value>trkpt</value></data></extendeddata></placemark>
<placemark><name></name><description>Track id: 102 Time: 2020-06-14 15:56:32 Altitude: 244 m Speed: 63.79 m/s</description><styleurl>#red_dot</styleurl><point><coordinates>10.313249984756,55.330500025303,244</coordinates></point><extendeddata><data name="type"><value>trkpt</value></data></extendeddata></placemark>
<placemark><name></name><description>Track id: 103 Time: 2020-06-14 15:56:34 Altitude: 244 m Speed: 63.28 m/s</description><styleurl>#red_dot</styleurl><point><coordinates>10.313670001924,55.331109976396,244</coordinates></point><extendeddata><data name="type"><value>trkpt</value></data></extendeddata></placemark>
<placemark><name></name><description>Track id: 104 Time: 2020-06-14 15:56:34 Altitude: 244 m Speed: 63.28 m/s</description><styleurl>#red_dot</styleurl><point><coordinates>10.313670001924,55.331109976396,244</coordinates></point><extendeddata><data name="type"><value>trkpt</value></data></extendeddata></placemark>
<placemark><name></name><description>Track id: 105 Time: 2020-06-14 15:56:34 Altitude: 244 m Speed: 62.76 m/s</description><styleurl>#red_dot</styleurl><point><coordinates>10.31422002241,55.331910029054,244</coordinates></point><extendeddata><data name="type"><value>trkpt</value></data></extendeddata></placemark>
<placemark><name></name><description>Track id: 106 Time: 2020-06-14 15:56:35 Altitude: 244 m Speed: 62.25 m/s</description><styleurl>#red_dot</styleurl><point><coordinates>10.31422002241,55.331910029054,244</coordinates></point><extendeddata><data name="type"><value>trkpt</value></data></extendeddata></placemark>
<placemark><name></name><description>Track id: 107 Time: 2020-06-14 15:56:36 Altitude: 244 m Speed: 61.73 m/s</description><styleurl>#red_dot</styleurl><point><coordinates>10.314910020679,55.332870008424,244</coordinates></point><extendeddata><data name="type"><value>trkpt</value></data></extendeddata></placemark>
<placemark><name></name><description>Track id: 108 Time: 2020-06-14 15:56:38 Altitude: 244 m Speed: 61.22 m/s</description><styleurl>#red_dot</styleurl><point><coordinates>10.315330037847,55.33362002112,244</coordinates></point><extendeddata><data name="type"><value>trkpt</value></data></extendeddata></placemark>
<placemark><name></name><description>Track id: 109 Time: 2020-06-14 15:56:39 Altitude: 251 m Speed: 61.22 m/s</description><styleurl>#red_dot</styleurl><point><coordinates>10.315920040012,55.334380008281,251</coordinates></point><extendeddata><data name="type"><value>trkpt</value></data></extendeddata></placemark>
<placemark><name></name><description>Track id: 110 Time: 2020-06-14 15:56:40 Altitude: 251 m Speed: 61.22 m/s</description><styleurl>#red_dot</styleurl><point><coordinates>10.315920040012,55.334380008281,251</coordinates></point><extendeddata><data name="type"><value>trkpt</value></data></extendeddata></placemark>
<placemark><name></name><description>Track id: 111 Time: 2020-06-14 15:56:40 Altitude: 251 m Speed: 60.7 m/s</description><styleurl>#red_dot</styleurl><point><coordinates>10.316250035539,55.334919970483,251</coordinates></point><extendeddata><data name="type"><value>trkpt</value></data></extendeddata></placemark>
<placemark><name></name><description>Track id: 112 Time: 2020-06-14 15:56:41 Altitude: 251 m Speed: 60.7 m/s</description><styleurl>#red_dot</styleurl><point><coordinates>10.316569972783,55.335390027613,251</coordinates></point><extendeddata><data name="type"><value>trkpt</value></data></extendeddata></placemark>
<placemark><name></name><description>Track id: 113 Time: 2020-06-14 15:56:44 Altitude: 259 m Speed: 60.7 m/s</description><styleurl>#red_dot</styleurl><point><coordinates>10.317939994857,55.337309986353,259</coordinates></point><extendeddata><data name="type"><value>trkpt</value></data></extendeddata></placemark>
<placemark><name></name><description>Track id: 114 Time: 2020-06-14 15:56:45 Altitude: 259 m Speed: 61.22 m/s</description><styleurl>#red_dot</styleurl><point><coordinates>10.31826001592,55.337809966878,259</coordinates></point><extendeddata><data name="type"><value>trkpt</value></data></extendeddata></placemark>
<placemark><name></name><description>Track id: 115 Time: 2020-06-14 15:56:47 Altitude: 251 m Speed: 61.22 m/s</description><styleurl>#red_dot</styleurl><point><coordinates>10.318590011448,55.338229984046,251</coordinates></point><extendeddata><data name="type"><value>trkpt</value></data></extendeddata></placemark>
<placemark><name></name><description>Track id: 116 Time: 2020-06-14 15:56:47 Altitude: 259 m Speed: 61.73 m/s</description><styleurl>#red_dot</styleurl><point><coordinates>10.318750021979,55.338410027326,259</coordinates></point><extendeddata><data name="type"><value>trkpt</value></data></extendeddata></placemark>
<placemark><name></name><description>Track id: 117 Time: 2020-06-14 15:56:49 Altitude: 251 m Speed: 61.73 m/s</description><styleurl>#red_dot</styleurl><point><coordinates>10.319319991395,55.339160040021,251</coordinates></point><extendeddata><data name="type"><value>trkpt</value></data></extendeddata></placemark>
<placemark><name></name><description>Track id: 118 Time: 2020-06-14 15:56:50 Altitude: 251 m Speed: 61.73 m/s</description><styleurl>#red_dot</styleurl><point><coordinates>10.319879986346,55.339920027182,251</coordinates></point><extendeddata><data name="type"><value>trkpt</value></data></extendeddata></placemark>
<placemark><name></name><description>Track id: 119 Time: 2020-06-14 15:56:50 Altitude: 251 m Speed: 62.25 m/s</description><styleurl>#red_dot</styleurl><point><coordinates>10.320160025731,55.340420007706,251</coordinates></point><extendeddata><data name="type"><value>trkpt</value></data></extendeddata></placemark>
<placemark><name></name><description>Track id: 120 Time: 2020-06-14 15:56:51 Altitude: 251 m Speed: 62.25 m/s</description><styleurl>#red_dot</styleurl><point><coordinates>10.32036001794,55.340650007129,251</coordinates></point><extendeddata><data name="type"><value>trkpt</value></data></extendeddata></placemark>
<placemark><name></name><description>Track id: 121 Time: 2020-06-14 15:56:52 Altitude: 251 m Speed: 62.76 m/s</description><styleurl>#red_dot</styleurl><point><coordinates>10.320910038427,55.341440001503,251</coordinates></point><extendeddata><data name="type"><value>trkpt</value></data></extendeddata></placemark>
<placemark><name></name><description>Track id: 122 Time: 2020-06-14 15:56:54 Altitude: 251 m Speed: 62.76 m/s</description><styleurl>#red_dot</styleurl><point><coordinates>10.321069965139,55.341630019248,251</coordinates></point><extendeddata><data name="type"><value>trkpt</value></data></extendeddata></placemark>
<placemark><name></name><description>Track id: 123 Time: 2020-06-14 15:56:55 Altitude: 251 m Speed: 62.25 m/s</description><styleurl>#red_dot</styleurl><point><coordinates>10.321570029482,55.342299984769,251</coordinates></point><extendeddata><data name="type"><value>trkpt</value></data></extendeddata></placemark>
<placemark><name></name><description>Track id: 124 Time: 2020-06-14 15:56:55 Altitude: 251 m Speed: 62.25 m/s</description><styleurl>#red_dot</styleurl><point><coordinates>10.32190002501,55.342880012468,251</coordinates></point><extendeddata><data name="type"><value>trkpt</value></data></extendeddata></placemark>
<placemark><name></name><description>Track id: 125 Time: 2020-06-14 15:56:56 Altitude: 251 m Speed: 62.76 m/s</description><styleurl>#red_dot</styleurl><point><coordinates>10.32230000943,55.343440007419,251</coordinates></point><extendeddata><data name="type"><value>trkpt</value></data></extendeddata></placemark>
<placemark><name></name><description>Track id: 126 Time: 2020-06-14 15:56:57 Altitude: 244 m Speed: 62.25 m/s</description><styleurl>#red_dot</styleurl><point><coordinates>10.322709968314,55.343990027905,244</coordinates></point><extendeddata><data name="type"><value>trkpt</value></data></extendeddata></placemark>
<placemark><name></name><description>Track id: 127 Time: 2020-06-14 15:57:00 Altitude: 251 m Speed: 62.25 m/s</description><styleurl>#red_dot</styleurl><point><coordinates>10.323069971055,55.344559997321,251</coordinates></point><extendeddata><data name="type"><value>trkpt</value></data></extendeddata></placemark>
<placemark><name></name><description>Track id: 128 Time: 2020-06-14 15:57:00 Altitude: 244 m Speed: 62.25 m/s</description><styleurl>#red_dot</styleurl><point><coordinates>10.32335001044,55.344999963418,244</coordinates></point><extendeddata><data name="type"><value>trkpt</value></data></extendeddata></placemark>
<placemark><name></name><description>Track id: 129 Time: 2020-06-14 15:57:00 Altitude: 244 m Speed: 62.25 m/s</description><styleurl>#red_dot</styleurl><point><coordinates>10.323759969324,55.345500027761,244</coordinates></point><extendeddata><data name="type"><value>trkpt</value></data></extendeddata></placemark>
<placemark><name></name><description>Track id: 130 Time: 2020-06-14 15:57:01 Altitude: 244 m Speed: 62.25 m/s</description><styleurl>#red_dot</styleurl><point><coordinates>10.324070015922,55.346000008286,244</coordinates></point><extendeddata><data name="type"><value>trkpt</value></data></extendeddata></placemark>
<placemark><name></name><description>Track id: 131 Time: 2020-06-14 15:57:02 Altitude: 251 m Speed: 61.22 m/s</description><styleurl>#red_dot</styleurl><point><coordinates>10.32449003309,55.346609959379,251</coordinates></point><extendeddata><data name="type"><value>trkpt</value></data></extendeddata></placemark>
<placemark><name></name><description>Track id: 132 Time: 2020-06-14 15:57:04 Altitude: 251 m Speed: 61.22 m/s</description><styleurl>#red_dot</styleurl><point><coordinates>10.324639985338,55.346829984338,251</coordinates></point><extendeddata><data name="type"><value>trkpt</value></data></extendeddata></placemark>
<placemark><name></name><description>Track id: 133 Time: 2020-06-14 15:57:05 Altitude: 251 m Speed: 61.22 m/s</description><styleurl>#red_dot</styleurl><point><coordinates>10.325150024146,55.347630036995,251</coordinates></point><extendeddata><data name="type"><value>trkpt</value></data></extendeddata></placemark>
<placemark><name></name><description>Track id: 134 Time: 2020-06-14 15:57:05 Altitude: 251 m Speed: 60.7 m/s</description><styleurl>#red_dot</styleurl><point><coordinates>10.325480019674,55.348139991984,251</coordinates></point><extendeddata><data name="type"><value>trkpt</value></data></extendeddata></placemark>
<placemark><name></name><description>Track id: 135 Time: 2020-06-14 15:57:06 Altitude: 251 m Speed: 60.7 m/s</description><styleurl>#red_dot</styleurl><point><coordinates>10.325610022992,55.348390024156,251</coordinates></point><extendeddata><data name="type"><value>trkpt</value></data></extendeddata></placemark>
<placemark><name></name><description>Track id: 136 Time: 2020-06-14 15:57:09 Altitude: 251 m Speed: 61.22 m/s</description><styleurl>#red_dot</styleurl><point><coordinates>10.326019981876,55.34898002632,251</coordinates></point><extendeddata><data name="type"><value>trkpt</value></data></extendeddata></placemark>
<placemark><name></name><description>Track id: 137 Time: 2020-06-14 15:57:10 Altitude: 251 m Speed: 61.22 m/s</description><styleurl>#red_dot</styleurl><point><coordinates>10.326419966295,55.349489981309,251</coordinates></point><extendeddata><data name="type"><value>trkpt</value></data></extendeddata></placemark>
<placemark><name></name><description>Track id: 138 Time: 2020-06-14 15:57:10 Altitude: 259 m Speed: 61.73 m/s</description><styleurl>#red_dot</styleurl><point><coordinates>10.326579976827,55.349810002372,259</coordinates></point><extendeddata><data name="type"><value>trkpt</value></data></extendeddata></placemark>
<placemark><name></name><description>Track id: 139 Time: 2020-06-14 15:57:10 Altitude: 259 m Speed: 61.73 m/s</description><styleurl>#red_dot</styleurl><point><coordinates>10.326979961246,55.350379971788,259</coordinates></point><extendeddata><data name="type"><value>trkpt</value></data></extendeddata></placemark>
<placemark><name></name><description>Track id: 140 Time: 2020-06-14 15:57:11 Altitude: 259 m Speed: 62.76 m/s</description><styleurl>#red_dot</styleurl><point><coordinates>10.327550014481,55.351139958948,259</coordinates></point><extendeddata><data name="type"><value>trkpt</value></data></extendeddata></placemark>
<placemark><name></name><description>Track id: 141 Time: 2020-06-14 15:57:13 Altitude: 259 m Speed: 62.76 m/s</description><styleurl>#red_dot</styleurl><point><coordinates>10.327629977837,55.351359983907,259</coordinates></point><extendeddata><data name="type"><value>trkpt</value></data></extendeddata></placemark>
<placemark><name></name><description>Track id: 142 Time: 2020-06-14 15:57:13 Altitude: 259 m Speed: 62.25 m/s</description><styleurl>#red_dot</styleurl><point><coordinates>10.328200031072,55.352100022138,259</coordinates></point><extendeddata><data name="type"><value>trkpt</value></data></extendeddata></placemark>
<placemark><name></name><description>Track id: 143 Time: 2020-06-14 15:57:14 Altitude: 251 m Speed: 62.76 m/s</description><styleurl>#red_dot</styleurl><point><coordinates>10.328600015491,55.352600002662,251</coordinates></point><extendeddata><data name="type"><value>trkpt</value></data></extendeddata></placemark>
<placemark><name></name><description>Track id: 144 Time: 2020-06-14 15:57:16 Altitude: 259 m Speed: 63.79 m/s</description><styleurl>#red_dot</styleurl><point><coordinates>10.329009974375,55.353099983186,259</coordinates></point><extendeddata><data name="type"><value>trkpt</value></data></extendeddata></placemark>
<placemark><name></name><description>Track id: 145 Time: 2020-06-14 15:57:16 Altitude: 251 m Speed: 63.79 m/s</description><styleurl>#red_dot</styleurl><point><coordinates>10.329329995439,55.353650003672,251</coordinates></point><extendeddata><data name="type"><value>trkpt</value></data></extendeddata></placemark>
<placemark><name></name><description>Track id: 146 Time: 2020-06-14 15:57:17 Altitude: 251 m Speed: 64.31 m/s</description><styleurl>#red_dot</styleurl><point><coordinates>10.329569969326,55.353970024735,251</coordinates></point><extendeddata><data name="type"><value>trkpt</value></data></extendeddata></placemark>
<placemark><name></name><description>Track id: 147 Time: 2020-06-14 15:57:19 Altitude: 251 m Speed: 64.82 m/s</description><styleurl>#red_dot</styleurl><point><coordinates>10.329569969326,55.353970024735,251</coordinates></point><extendeddata><data name="type"><value>trkpt</value></data></extendeddata></placemark>
<placemark><name></name><description>Track id: 148 Time: 2020-06-14 15:57:19 Altitude: 251 m Speed: 64.82 m/s</description><styleurl>#red_dot</styleurl><point><coordinates>10.330560039729,55.355269974098,251</coordinates></point><extendeddata><data name="type"><value>trkpt</value></data></extendeddata></placemark>
<placemark><name></name><description>Track id: 149 Time: 2020-06-14 15:57:20 Altitude: 251 m Speed: 64.82 m/s</description><styleurl>#red_dot</styleurl><point><coordinates>10.330979973078,55.355819994584,251</coordinates></point><extendeddata><data name="type"><value>trkpt</value></data></extendeddata></placemark>
<placemark><name></name><description>Track id: 150 Time: 2020-06-14 15:57:21 Altitude: 251 m Speed: 64.82 m/s</description><styleurl>#red_dot</styleurl><point><coordinates>10.330979973078,55.355819994584,251</coordinates></point><extendeddata><data name="type"><value>trkpt</value></data></extendeddata></placemark>
<placemark><name></name><description>Track id: 151 Time: 2020-06-14 15:57:22 Altitude: 244 m Speed: 64.82 m/s</description><styleurl>#red_dot</styleurl><point><coordinates>10.331560000777,55.35666002892,244</coordinates></point><extendeddata><data name="type"><value>trkpt</value></data></extendeddata></placemark>
<placemark><name></name><description>Track id: 152 Time: 2020-06-14 15:57:24 Altitude: 244 m Speed: 64.82 m/s</description><styleurl>#red_dot</styleurl><point><coordinates>10.331560000777,55.35666002892,244</coordinates></point><extendeddata><data name="type"><value>trkpt</value></data></extendeddata></placemark>
<placemark><name></name><description>Track id: 153 Time: 2020-06-14 15:57:25 Altitude: 244 m Speed: 64.82 m/s</description><styleurl>#red_dot</styleurl><point><coordinates>10.331560000777,55.35666002892,244</coordinates></point><extendeddata><data name="type"><value>trkpt</value></data></extendeddata></placemark>
<placemark><name></name><description>Track id: 154 Time: 2020-06-14 15:57:25 Altitude: 244 m Speed: 64.31 m/s</description><styleurl>#red_dot</styleurl><point><coordinates>10.331560000777,55.35666002892,244</coordinates></point><extendeddata><data name="type"><value>trkpt</value></data></extendeddata></placemark>
<placemark><name></name><description>Track id: 155 Time: 2020-06-14 15:57:26 Altitude: 236 m Speed: 63.79 m/s</description><styleurl>#red_dot</styleurl><point><coordinates>10.331560000777,55.35666002892,236</coordinates></point><extendeddata><data name="type"><value>trkpt</value></data></extendeddata></placemark>
<placemark><name></name><description>Track id: 156 Time: 2020-06-14 15:57:27 Altitude: 236 m Speed: 63.28 m/s</description><styleurl>#red_dot</styleurl><point><coordinates>10.331560000777,55.35666002892,236</coordinates></point><extendeddata><data name="type"><value>trkpt</value></data></extendeddata></placemark>
<placemark><name></name><description>Track id: 157 Time: 2020-06-14 15:57:29 Altitude: 236 m Speed: 62.76 m/s</description><styleurl>#red_dot</styleurl><point><coordinates>10.333850020543,55.359920002521,236</coordinates></point><extendeddata><data name="type"><value>trkpt</value></data></extendeddata></placemark>
<placemark><name></name><description>Track id: 158 Time: 2020-06-14 15:57:29 Altitude: 236 m Speed: 62.76 m/s</description><styleurl>#red_dot</styleurl><point><coordinates>10.334419989959,55.360660040752,236</coordinates></point><extendeddata><data name="type"><value>trkpt</value></data></extendeddata></placemark>
<placemark><name></name><description>Track id: 159 Time: 2020-06-14 15:57:30 Altitude: 236 m Speed: 61.73 m/s</description><styleurl>#red_dot</styleurl><point><coordinates>10.33458000049,55.360840000213,236</coordinates></point><extendeddata><data name="type"><value>trkpt</value></data></extendeddata></placemark>
<placemark><name></name><description>Track id: 160 Time: 2020-06-14 15:57:31 Altitude: 228 m Speed: 61.73 m/s</description><styleurl>#red_dot</styleurl><point><coordinates>10.334970010445,55.361409969628,228</coordinates></point><extendeddata><data name="type"><value>trkpt</value></data></extendeddata></placemark>
<placemark><name></name><description>Track id: 161 Time: 2020-06-14 15:57:33 Altitude: 228 m Speed: 61.73 m/s</description><styleurl>#red_dot</styleurl><point><coordinates>10.334970010445,55.361409969628,228</coordinates></point><extendeddata><data name="type"><value>trkpt</value></data></extendeddata></placemark>
<placemark><name></name><description>Track id: 162 Time: 2020-06-14 15:57:34 Altitude: 228 m Speed: 61.73 m/s</description><styleurl>#red_dot</styleurl><point><coordinates>10.335890008137,55.36261998117,228</coordinates></point><extendeddata><data name="type"><value>trkpt</value></data></extendeddata></placemark>
<placemark><name></name><description>Track id: 163 Time: 2020-06-14 15:57:34 Altitude: 228 m Speed: 61.73 m/s</description><styleurl>#red_dot</styleurl><point><coordinates>10.33612000756,55.362849980593,228</coordinates></point><extendeddata><data name="type"><value>trkpt</value></data></extendeddata></placemark>
<placemark><name></name><description>Track id: 164 Time: 2020-06-14 15:57:35 Altitude: 228 m Speed: 61.22 m/s</description><styleurl>#red_dot</styleurl><point><coordinates>10.336470035836,55.363409975544,228</coordinates></point><extendeddata><data name="type"><value>trkpt</value></data></extendeddata></placemark>
<placemark><name></name><description>Track id: 165 Time: 2020-06-14 15:57:36 Altitude: 221 m Speed: 61.22 m/s</description><styleurl>#red_dot</styleurl><point><coordinates>10.33697001636,55.364020010457,221</coordinates></point><extendeddata><data name="type"><value>trkpt</value></data></extendeddata></placemark>
<placemark><name></name><description>Track id: 166 Time: 2020-06-14 15:57:38 Altitude: 221 m Speed: 61.22 m/s</description><styleurl>#red_dot</styleurl><point><coordinates>10.33697001636,55.364020010457,221</coordinates></point><extendeddata><data name="type"><value>trkpt</value></data></extendeddata></placemark>
<placemark><name></name><description>Track id: 167 Time: 2020-06-14 15:57:38 Altitude: 221 m Speed: 61.22 m/s</description><styleurl>#red_dot</styleurl><point><coordinates>10.337549960241,55.364810004831,221</coordinates></point><extendeddata><data name="type"><value>trkpt</value></data></extendeddata></placemark>
<placemark><name></name><description>Track id: 168 Time: 2020-06-14 15:57:39 Altitude: 213 m Speed: 61.22 m/s</description><styleurl>#red_dot</styleurl><point><coordinates>10.33812998794,55.365599999205,213</coordinates></point><extendeddata><data name="type"><value>trkpt</value></data></extendeddata></placemark>
<placemark><name></name><description>Track id: 169 Time: 2020-06-14 15:57:40 Altitude: 213 m Speed: 60.7 m/s</description><styleurl>#red_dot</styleurl><point><coordinates>10.338629968464,55.366210034118,213</coordinates></point><extendeddata><data name="type"><value>trkpt</value></data></extendeddata></placemark>
<placemark><name></name><description>Track id: 170 Time: 2020-06-14 15:57:42 Altitude: 213 m Speed: 60.19 m/s</description><styleurl>#red_dot</styleurl><point><coordinates>10.338940015063,55.366650000215,213</coordinates></point><extendeddata><data name="type"><value>trkpt</value></data></extendeddata></placemark>
<placemark><name></name><description>Track id: 171 Time: 2020-06-14 15:57:43 Altitude: 213 m Speed: 60.19 m/s</description><styleurl>#red_dot</styleurl><point><coordinates>10.339430021122,55.367249976844,213</coordinates></point><extendeddata><data name="type"><value>trkpt</value></data></extendeddata></placemark>
<placemark><name></name><description>Track id: 172 Time: 2020-06-14 15:57:44 Altitude: 213 m Speed: 60.19 m/s</description><styleurl>#red_dot</styleurl><point><coordinates>10.339749958366,55.36770997569,213</coordinates></point><extendeddata><data name="type"><value>trkpt</value></data></extendeddata></placemark>
<placemark><name></name><description>Track id: 173 Time: 2020-06-14 15:57:44 Altitude: 213 m Speed: 59.16 m/s</description><styleurl>#red_dot</styleurl><point><coordinates>10.339749958366,55.36770997569,213</coordinates></point><extendeddata><data name="type"><value>trkpt</value></data></extendeddata></placemark>
<placemark><name></name><description>Track id: 174 Time: 2020-06-14 15:57:47 Altitude: 213 m Speed: 59.16 m/s</description><styleurl>#red_dot</styleurl><point><coordinates>10.340150026605,55.368210040033,213</coordinates></point><extendeddata><data name="type"><value>trkpt</value></data></extendeddata></placemark>
<placemark><name></name><description>Track id: 175 Time: 2020-06-14 15:57:47 Altitude: 206 m Speed: 58.65 m/s</description><styleurl>#red_dot</styleurl><point><coordinates>10.340550011024,55.368719995022,206</coordinates></point><extendeddata><data name="type"><value>trkpt</value></data></extendeddata></placemark>
<placemark><name></name><description>Track id: 176 Time: 2020-06-14 15:57:47 Altitude: 198 m Speed: 58.65 m/s</description><styleurl>#red_dot</styleurl><point><coordinates>10.34121000208,55.369600011036,198</coordinates></point><extendeddata><data name="type"><value>trkpt</value></data></extendeddata></placemark>
<placemark><name></name><description>Track id: 177 Time: 2020-06-14 15:57:48 Altitude: 198 m Speed: 58.65 m/s</description><styleurl>#red_dot</styleurl><point><coordinates>10.34121000208,55.369600011036,198</coordinates></point><extendeddata><data name="type"><value>trkpt</value></data></extendeddata></placemark>
<placemark><name></name><description>Track id: 178 Time: 2020-06-14 15:57:50 Altitude: 190 m Speed: 58.65 m/s</description><styleurl>#red_dot</styleurl><point><coordinates>10.341630019248,55.370160005987,190</coordinates></point><extendeddata><data name="type"><value>trkpt</value></data></extendeddata></placemark>
<placemark><name></name><description>Track id: 179 Time: 2020-06-14 15:57:50 Altitude: 190 m Speed: 57.1 m/s</description><styleurl>#red_dot</styleurl><point><coordinates>10.341630019248,55.370160005987,190</coordinates></point><extendeddata><data name="type"><value>trkpt</value></data></extendeddata></placemark>
<placemark><name></name><description>Track id: 180 Time: 2020-06-14 15:57:51 Altitude: 190 m Speed: 57.1 m/s</description><styleurl>#red_dot</styleurl><point><coordinates>10.342380031943,55.371189974249,190</coordinates></point><extendeddata><data name="type"><value>trkpt</value></data></extendeddata></placemark>
<placemark><name></name><description>Track id: 181 Time: 2020-06-14 15:57:52 Altitude: 183 m Speed: 57.1 m/s</description><styleurl>#red_dot</styleurl><point><coordinates>10.342959975824,55.37193001248,183</coordinates></point><extendeddata><data name="type"><value>trkpt</value></data></extendeddata></placemark>
<placemark><name></name><description>Track id: 182 Time: 2020-06-14 15:57:54 Altitude: 183 m Speed: 57.1 m/s</description><styleurl>#red_dot</styleurl><point><coordinates>10.343300029636,55.372329996899,183</coordinates></point><extendeddata><data name="type"><value>trkpt</value></data></extendeddata></placemark>
<placemark><name></name><description>Track id: 183 Time: 2020-06-14 15:57:54 Altitude: 183 m Speed: 55.56 m/s</description><styleurl>#red_dot</styleurl><point><coordinates>10.343630025163,55.372789995745,183</coordinates></point><extendeddata><data name="type"><value>trkpt</value></data></extendeddata></placemark>
<placemark><name></name><description>Track id: 184 Time: 2020-06-14 15:57:55 Altitude: 183 m Speed: 55.56 m/s</description><styleurl>#red_dot</styleurl><point><coordinates>10.344030009583,55.373249994591,183</coordinates></point><extendeddata><data name="type"><value>trkpt</value></data></extendeddata></placemark>
<placemark><name></name><description>Track id: 185 Time: 2020-06-14 15:57:56 Altitude: 183 m Speed: 55.56 m/s</description><styleurl>#red_dot</styleurl><point><coordinates>10.344380037859,55.373649979011,183</coordinates></point><extendeddata><data name="type"><value>trkpt</value></data></extendeddata></placemark>
<placemark><name></name><description>Track id: 186 Time: 2020-06-14 15:57:58 Altitude: 183 m Speed: 54.53 m/s</description><styleurl>#red_dot</styleurl><point><coordinates>10.344629986212,55.373890036718,183</coordinates></point><extendeddata><data name="type"><value>trkpt</value></data></extendeddata></placemark>
<placemark><name></name><description>Track id: 187 Time: 2020-06-14 15:57:59 Altitude: 183 m Speed: 54.53 m/s</description><styleurl>#red_dot</styleurl><point><coordinates>10.345040028915,55.374350035564,183</coordinates></point><extendeddata><data name="type"><value>trkpt</value></data></extendeddata></placemark>
<placemark><name></name><description>Track id: 188 Time: 2020-06-14 15:57:59 Altitude: 183 m Speed: 54.02 m/s</description><styleurl>#red_dot</styleurl><point><coordinates>10.345040028915,55.374350035564,183</coordinates></point><extendeddata><data name="type"><value>trkpt</value></data></extendeddata></placemark>
<placemark><name></name><description>Track id: 189 Time: 2020-06-14 15:58:00 Altitude: 175 m Speed: 54.02 m/s</description><styleurl>#red_dot</styleurl><point><coordinates>10.346039989963,55.375419985503,175</coordinates></point><extendeddata><data name="type"><value>trkpt</value></data></extendeddata></placemark>
<placemark><name></name><description>Track id: 190 Time: 2020-06-14 15:58:02 Altitude: 175 m Speed: 52.99 m/s</description><styleurl>#red_dot</styleurl><point><coordinates>10.346039989963,55.375419985503,175</coordinates></point><extendeddata><data name="type"><value>trkpt</value></data></extendeddata></placemark>
<placemark><name></name><description>Track id: 191 Time: 2020-06-14 15:58:04 Altitude: 168 m Speed: 52.47 m/s</description><styleurl>#red_dot</styleurl><point><coordinates>10.346539970487,55.375900017098,168</coordinates></point><extendeddata><data name="type"><value>trkpt</value></data></extendeddata></placemark>
<placemark><name></name><description>Track id: 192 Time: 2020-06-14 15:58:04 Altitude: 168 m Speed: 52.47 m/s</description><styleurl>#red_dot</styleurl><point><coordinates>10.34725997597,55.376720018685,168</coordinates></point><extendeddata><data name="type"><value>trkpt</value></data></extendeddata></placemark>
<placemark><name></name><description>Track id: 193 Time: 2020-06-14 15:58:04 Altitude: 168 m Speed: 52.47 m/s</description><styleurl>#red_dot</styleurl><point><coordinates>10.34745996818,55.37691003643,168</coordinates></point><extendeddata><data name="type"><value>trkpt</value></data></extendeddata></placemark>
<placemark><name></name><description>Track id: 194 Time: 2020-06-14 15:58:05 Altitude: 168 m Speed: 50.93 m/s</description><styleurl>#red_dot</styleurl><point><coordinates>10.348039995879,55.377470031381,168</coordinates></point><extendeddata><data name="type"><value>trkpt</value></data></extendeddata></placemark>
<placemark><name></name><description>Track id: 195 Time: 2020-06-14 15:58:07 Altitude: 160 m Speed: 49.9 m/s</description><styleurl>#red_dot</styleurl><point><coordinates>10.348230013624,55.377640016377,160</coordinates></point><extendeddata><data name="type"><value>trkpt</value></data></extendeddata></placemark>
<placemark><name></name><description>Track id: 196 Time: 2020-06-14 15:58:07 Altitude: 160 m Speed: 49.9 m/s</description><styleurl>#red_dot</styleurl><point><coordinates>10.348620023579,55.378079982475,160</coordinates></point><extendeddata><data name="type"><value>trkpt</value></data></extendeddata></placemark>
<placemark><name></name><description>Track id: 197 Time: 2020-06-14 15:58:08 Altitude: 160 m Speed: 49.9 m/s</description><styleurl>#red_dot</styleurl><point><coordinates>10.348869971931,55.378309981898,160</coordinates></point><extendeddata><data name="type"><value>trkpt</value></data></extendeddata></placemark>
<placemark><name></name><description>Track id: 198 Time: 2020-06-14 15:58:09 Altitude: 160 m Speed: 48.87 m/s</description><styleurl>#red_dot</styleurl><point><coordinates>10.348869971931,55.378309981898,160</coordinates></point><extendeddata><data name="type"><value>trkpt</value></data></extendeddata></placemark>
<placemark><name></name><description>Track id: 199 Time: 2020-06-14 15:58:12 Altitude: 160 m Speed: 45.27 m/s</description><styleurl>#red_dot</styleurl><point><coordinates>10.348869971931,55.378309981898,160</coordinates></point><extendeddata><data name="type"><value>trkpt</value></data></extendeddata></placemark>
<placemark><name></name><description>Track id: 200 Time: 2020-06-14 15:58:13 Altitude: 152 m Speed: 44.76 m/s</description><styleurl>#red_dot</styleurl><point><coordinates>10.350950025022,55.380219966174,152</coordinates></point><extendeddata><data name="type"><value>trkpt</value></data></extendeddata></placemark>
<placemark><name></name><description>Track id: 201 Time: 2020-06-14 15:58:16 Altitude: 145 m Speed: 44.76 m/s</description><styleurl>#red_dot</styleurl><point><coordinates>10.351540027186,55.380709972233,145</coordinates></point><extendeddata><data name="type"><value>trkpt</value></data></extendeddata></placemark>
<placemark><name></name><description>Track id: 202 Time: 2020-06-14 15:58:17 Altitude: 129 m Speed: 42.18 m/s</description><styleurl>#red_dot</styleurl><point><coordinates>10.352279981598,55.381239959971,129</coordinates></point><extendeddata><data name="type"><value>trkpt</value></data></extendeddata></placemark>
<placemark><name></name><description>Track id: 203 Time: 2020-06-14 15:58:17 Altitude: 129 m Speed: 42.18 m/s</description><styleurl>#red_dot</styleurl><point><coordinates>10.352509981021,55.381389996037,129</coordinates></point><extendeddata><data name="type"><value>trkpt</value></data></extendeddata></placemark>
<placemark><name></name><description>Track id: 204 Time: 2020-06-14 15:58:19 Altitude: 129 m Speed: 42.18 m/s</description><styleurl>#red_dot</styleurl><point><coordinates>10.352509981021,55.381389996037,129</coordinates></point><extendeddata><data name="type"><value>trkpt</value></data></extendeddata></placemark>
<placemark><name></name><description>Track id: 205 Time: 2020-06-14 15:58:19 Altitude: 129 m Speed: 42.18 m/s</description><styleurl>#red_dot</styleurl><point><coordinates>10.352509981021,55.381389996037,129</coordinates></point><extendeddata><data name="type"><value>trkpt</value></data></extendeddata></placemark>
<placemark><name></name><description>Track id: 206 Time: 2020-06-14 15:58:21 Altitude: 129 m Speed: 37.04 m/s</description><styleurl>#red_dot</styleurl><point><coordinates>10.352509981021,55.381389996037,129</coordinates></point><extendeddata><data name="type"><value>trkpt</value></data></extendeddata></placemark>
<placemark><name></name><description>Track id: 207 Time: 2020-06-14 15:58:21 Altitude: 129 m Speed: 36.01 m/s</description><styleurl>#red_dot</styleurl><point><coordinates>10.352509981021,55.381389996037,129</coordinates></point><extendeddata><data name="type"><value>trkpt</value></data></extendeddata></placemark>
<placemark><name></name><description>Track id: 208 Time: 2020-06-14 15:58:23 Altitude: 129 m Speed: 33.95 m/s</description><styleurl>#red_dot</styleurl><point><coordinates>10.352509981021,55.381389996037,129</coordinates></point><extendeddata><data name="type"><value>trkpt</value></data></extendeddata></placemark>
<placemark><name></name><description>Track id: 209 Time: 2020-06-14 15:58:31 Altitude: 84 m Speed: 33.95 m/s</description><styleurl>#red_dot</styleurl><point><coordinates>10.352509981021,55.381389996037,84</coordinates></point><extendeddata><data name="type"><value>trkpt</value></data></extendeddata></placemark>
<placemark><name></name><description>Track id: 210 Time: 2020-06-14 15:58:31 Altitude: 84 m Speed: 33.95 m/s</description><styleurl>#red_dot</styleurl><point><coordinates>10.352509981021,55.381389996037,84</coordinates></point><extendeddata><data name="type"><value>trkpt</value></data></extendeddata></placemark>
<placemark><name></name><description>Track id: 211 Time: 2020-06-14 15:58:34 Altitude: 84 m Speed: 33.95 m/s</description><styleurl>#red_dot</styleurl><point><coordinates>10.352509981021,55.381389996037,84</coordinates></point><extendeddata><data name="type"><value>trkpt</value></data></extendeddata></placemark>
<placemark><name></name><description>Track id: 212 Time: 2020-06-14 15:58:35 Altitude: 84 m Speed: 33.95 m/s</description><styleurl>#red_dot</styleurl><point><coordinates>10.352509981021,55.381389996037,84</coordinates></point><extendeddata><data name="type"><value>trkpt</value></data></extendeddata></placemark>
<placemark><name></name><description>Track id: 213 Time: 2020-06-14 15:58:36 Altitude: 84 m Speed: 33.95 m/s</description><styleurl>#red_dot</styleurl><point><coordinates>10.352509981021,55.381389996037,84</coordinates></point><extendeddata><data name="type"><value>trkpt</value></data></extendeddata></placemark>
<placemark><name></name><description>Track id: 214 Time: 2020-06-14 15:58:38 Altitude: 84 m Speed: 16.46 m/s</description><styleurl>#red_dot</styleurl><point><coordinates>10.352509981021,55.381389996037,84</coordinates></point><extendeddata><data name="type"><value>trkpt</value></data></extendeddata></placemark>
<placemark><name></name><description>Track id: 215 Time: 2020-06-14 15:58:39 Altitude: 84 m Speed: 16.46 m/s</description><styleurl>#red_dot</styleurl><point><coordinates>10.352509981021,55.381389996037,84</coordinates></point><extendeddata><data name="type"><value>trkpt</value></data></extendeddata></placemark>
<placemark><name></name><description>Track id: 216 Time: 2020-06-14 15:58:39 Altitude: 84 m Speed: 15.95 m/s</description><styleurl>#red_dot</styleurl><point><coordinates>10.352509981021,55.381389996037,84</coordinates></point><extendeddata><data name="type"><value>trkpt</value></data></extendeddata></placemark>
<placemark><name></name><description>Track id: 217 Time: 2020-06-14 15:58:40 Altitude: 84 m Speed: 15.95 m/s</description><styleurl>#red_dot</styleurl><point><coordinates>10.352509981021,55.381389996037,84</coordinates></point><extendeddata><data name="type"><value>trkpt</value></data></extendeddata></placemark>
<placemark><name></name><description>Track id: 218 Time: 2020-06-14 15:58:41 Altitude: 53 m Speed: 15.95 m/s</description><styleurl>#red_dot</styleurl><point><coordinates>10.352509981021,55.381389996037,53</coordinates></point><extendeddata><data name="type"><value>trkpt</value></data></extendeddata></placemark>
<placemark><name></name><description>Track id: 219 Time: 2020-06-14 15:58:43 Altitude: 46 m Speed: 14.4 m/s</description><styleurl>#red_dot</styleurl><point><coordinates>10.352509981021,55.381389996037,46</coordinates></point><extendeddata><data name="type"><value>trkpt</value></data></extendeddata></placemark>
<placemark><name></name><description>Track id: 220 Time: 2020-06-14 15:58:44 Altitude: 46 m Speed: 14.4 m/s</description><styleurl>#red_dot</styleurl><point><coordinates>10.352509981021,55.381389996037,46</coordinates></point><extendeddata><data name="type"><value>trkpt</value></data></extendeddata></placemark>
<placemark><name></name><description>Track id: 221 Time: 2020-06-14 15:58:44 Altitude: 38 m Speed: 14.4 m/s</description><styleurl>#red_dot</styleurl><point><coordinates>10.352509981021,55.381389996037,38</coordinates></point><extendeddata><data name="type"><value>trkpt</value></data></extendeddata></placemark>
<placemark><name></name><description>Track id: 222 Time: 2020-06-14 15:58:45 Altitude: 38 m Speed: 12.86 m/s</description><styleurl>#red_dot</styleurl><point><coordinates>10.352509981021,55.381389996037,38</coordinates></point><extendeddata><data name="type"><value>trkpt</value></data></extendeddata></placemark>
<placemark><name></name><description>Track id: 223 Time: 2020-06-14 15:58:47 Altitude: 38 m Speed: 11.83 m/s</description><styleurl>#red_dot</styleurl><point><coordinates>10.352509981021,55.381389996037,38</coordinates></point><extendeddata><data name="type"><value>trkpt</value></data></extendeddata></placemark>
<placemark><name></name><description>Track id: 224 Time: 2020-06-14 15:58:48 Altitude: 38 m Speed: 11.32 m/s</description><styleurl>#red_dot</styleurl><point><coordinates>10.352509981021,55.381389996037,38</coordinates></point><extendeddata><data name="type"><value>trkpt</value></data></extendeddata></placemark>
<placemark><name></name><description>Track id: 225 Time: 2020-06-14 15:58:51 Altitude: 38 m Speed: 9.26 m/s</description><styleurl>#red_dot</styleurl><point><coordinates>10.352509981021,55.381389996037,38</coordinates></point><extendeddata><data name="type"><value>trkpt</value></data></extendeddata></placemark>
<placemark><name></name><description>Track id: 226 Time: 2020-06-14 15:58:52 Altitude: 38 m Speed: 8.75 m/s</description><styleurl>#red_dot</styleurl><point><coordinates>10.352509981021,55.381389996037,38</coordinates></point><extendeddata><data name="type"><value>trkpt</value></data></extendeddata></placemark>
<placemark><name></name><description>Track id: 227 Time: 2020-06-14 15:58:55 Altitude: 15 m Speed: 8.75 m/s</description><styleurl>#red_dot</styleurl><point><coordinates>10.352509981021,55.381389996037,15</coordinates></point><extendeddata><data name="type"><value>trkpt</value></data></extendeddata></placemark>
<placemark><name></name><description>Track id: 228 Time: 2020-06-14 15:58:56 Altitude: 15 m Speed: 8.75 m/s</description><styleurl>#red_dot</styleurl><point><coordinates>10.352509981021,55.381389996037,15</coordinates></point><extendeddata><data name="type"><value>trkpt</value></data></extendeddata></placemark>
<placemark><name></name><description>Track id: 229 Time: 2020-06-14 15:58:56 Altitude: 8 m Speed: 6.17 m/s</description><styleurl>#red_dot</styleurl><point><coordinates>10.352509981021,55.381389996037,8</coordinates></point><extendeddata><data name="type"><value>trkpt</value></data></extendeddata></placemark>
<placemark><name></name><description>Track id: 230 Time: 2020-06-14 15:58:57 Altitude: 8 m Speed: 6.17 m/s</description><styleurl>#red_dot</styleurl><point><coordinates>10.352509981021,55.381389996037,8</coordinates></point><extendeddata><data name="type"><value>trkpt</value></data></extendeddata></placemark>
<placemark><name></name><description>Track id: 231 Time: 2020-06-14 15:58:58 Altitude: 8 m Speed: 6.17 m/s</description><styleurl>#red_dot</styleurl><point><coordinates>10.352509981021,55.381389996037,8</coordinates></point><extendeddata><data name="type"><value>trkpt</value></data></extendeddata></placemark>
<placemark><name></name><description>Track id: 232 Time: 2020-06-14 15:59:00 Altitude: 8 m Speed: 5.14 m/s</description><styleurl>#red_dot</styleurl><point><coordinates>10.352509981021,55.381389996037,8</coordinates></point><extendeddata><data name="type"><value>trkpt</value></data></extendeddata></placemark>
<placemark><name></name><description>Track id: 233 Time: 2020-06-14 15:59:01 Altitude: 0 m Speed: 5.14 m/s</description><styleurl>#red_dot</styleurl><point><coordinates>10.363349961117,55.384549973533,0</coordinates></point><extendeddata><data name="type"><value>trkpt</value></data></extendeddata></placemark>
<placemark><name></name><description>Track id: 234 Time: 2020-06-14 15:59:01 Altitude: 0 m Speed: 5.14 m/s</description><styleurl>#red_dot</styleurl><point><coordinates>10.363339986652,55.384549973533,0</coordinates></point><extendeddata><data name="type"><value>trkpt</value></data></extendeddata></placemark>
<placemark><name></name><description>Track id: 235 Time: 2020-06-14 15:59:03 Altitude: 0 m Speed: 3.6 m/s</description><styleurl>#red_dot</styleurl><point><coordinates>10.363439982757,55.384549973533,0</coordinates></point><extendeddata><data name="type"><value>trkpt</value></data></extendeddata></placemark>
<placemark><name></name><description>Track id: 236 Time: 2020-06-14 15:59:03 Altitude: 0 m Speed: 3.6 m/s</description><styleurl>#red_dot</styleurl><point><coordinates>10.363439982757,55.384549973533,0</coordinates></point><extendeddata><data name="type"><value>trkpt</value></data></extendeddata></placemark>
<placemark><name></name><description>Track id: 237 Time: 2020-06-14 15:59:04 Altitude: -8 m Speed: 3.6 m/s</description><styleurl>#red_dot</styleurl><point><coordinates>10.363520029932,55.384549973533,-8</coordinates></point><extendeddata><data name="type"><value>trkpt</value></data></extendeddata></placemark>
<placemark><name></name><description>Track id: 238 Time: 2020-06-14 15:59:06 Altitude: -8 m Speed: 3.6 m/s</description><styleurl>#red_dot</styleurl><point><coordinates>10.363520029932,55.384549973533,-8</coordinates></point><extendeddata><data name="type"><value>trkpt</value></data></extendeddata></placemark>
<placemark><name></name><description>Track id: 239 Time: 2020-06-14 15:59:08 Altitude: -8 m Speed: 3.09 m/s</description><styleurl>#red_dot</styleurl><point><coordinates>10.363520029932,55.384549973533,-8</coordinates></point><extendeddata><data name="type"><value>trkpt</value></data></extendeddata></placemark>
<placemark><name></name><description>Track id: 240 Time: 2020-06-14 15:59:08 Altitude: -8 m Speed: 2.57 m/s</description><styleurl>#red_dot</styleurl><point><coordinates>10.363520029932,55.384549973533,-8</coordinates></point><extendeddata><data name="type"><value>trkpt</value></data></extendeddata></placemark>
<placemark><name></name><description>Track id: 241 Time: 2020-06-14 15:59:10 Altitude: -15 m Speed: 2.57 m/s</description><styleurl>#red_dot</styleurl><point><coordinates>10.363690014929,55.38450001739,-15</coordinates></point><extendeddata><data name="type"><value>trkpt</value></data></extendeddata></placemark>
<placemark><name></name><description>Track id: 242 Time: 2020-06-14 15:59:13 Altitude: -30 m Speed: 2.57 m/s</description><styleurl>#red_dot</styleurl><point><coordinates>10.363739971072,55.384509991855,-30</coordinates></point><extendeddata><data name="type"><value>trkpt</value></data></extendeddata></placemark>
<placemark><name></name><description>Track id: 243 Time: 2020-06-14 15:59:13 Altitude: -30 m Speed: 2.57 m/s</description><styleurl>#red_dot</styleurl><point><coordinates>10.363739971072,55.384509991855,-30</coordinates></point><extendeddata><data name="type"><value>trkpt</value></data></extendeddata></placemark>
<placemark><name></name><description>Track id: 244 Time: 2020-06-14 15:59:13 Altitude: -30 m Speed: 2.57 m/s</description><styleurl>#red_dot</styleurl><point><coordinates>10.363739971072,55.384509991855,-30</coordinates></point><extendeddata><data name="type"><value>trkpt</value></data></extendeddata></placemark>
<placemark><name></name><description>Track id: 245 Time: 2020-06-14 15:59:14 Altitude: -30 m Speed: 2.57 m/s</description><styleurl>#red_dot</styleurl><point><coordinates>10.363739971072,55.384509991855,-30</coordinates></point><extendeddata><data name="type"><value>trkpt</value></data></extendeddata></placemark>
<placemark><name></name><description>Track id: 246 Time: 2020-06-14 15:59:15 Altitude: -30 m Speed: 2.57 m/s</description><styleurl>#red_dot</styleurl><point><coordinates>10.363739971072,55.384509991855,-30</coordinates></point><extendeddata><data name="type"><value>trkpt</value></data></extendeddata></placemark>
<placemark><name></name><description>Track id: 247 Time: 2020-06-14 15:59:17 Altitude: -30 m Speed: 2.57 m/s</description><styleurl>#red_dot</styleurl><point><coordinates>10.363739971072,55.384509991855,-30</coordinates></point><extendeddata><data name="type"><value>trkpt</value></data></extendeddata></placemark>
<placemark><name></name><description>Track id: 248 Time: 2020-06-14 15:59:19 Altitude: -30 m Speed: 2.57 m/s</description><styleurl>#red_dot</styleurl><point><coordinates>10.363739971072,55.384509991855,-30</coordinates></point><extendeddata><data name="type"><value>trkpt</value></data></extendeddata></placemark>
<placemark><name></name><description>Track id: 249 Time: 2020-06-14 15:59:20 Altitude: -30 m Speed: 2.57 m/s</description><styleurl>#red_dot</styleurl><point><coordinates>10.363739971072,55.384509991855,-30</coordinates></point><extendeddata><data name="type"><value>trkpt</value></data></extendeddata></placemark>
<placemark><name></name><description>Track id: 250 Time: 2020-06-14 15:59:23 Altitude: -30 m Speed: 2.57 m/s</description><styleurl>#red_dot</styleurl><point><coordinates>10.363739971072,55.384509991855,-30</coordinates></point><extendeddata><data name="type"><value>trkpt</value></data></extendeddata></placemark>
<placemark><name></name><description>Track id: 251 Time: 2020-06-14 15:59:25 Altitude: -30 m Speed: 2.57 m/s</description><styleurl>#red_dot</styleurl><point><coordinates>10.363739971072,55.384509991855,-30</coordinates></point><extendeddata><data name="type"><value>trkpt</value></data></extendeddata></placemark>
<placemark><name></name><description>Track id: 252 Time: 2020-06-14 15:59:25 Altitude: -30 m Speed: 2.57 m/s</description><styleurl>#red_dot</styleurl><point><coordinates>10.363739971072,55.384509991855,-30</coordinates></point><extendeddata><data name="type"><value>trkpt</value></data></extendeddata></placemark>
</document>
</kml>