{
  "swagger": "2.0",
  "info": {
    "description": "Ini adalah dokumentasi API challenge-5",
    "version": "1.0.0",
    "title": "User Game",
    "termsOfService": "http://swagger.io/terms/",
    "contact": {
      "email": "bejs3@binaracademy.co.id"
    }
  },
  "host": "localhost:3000",
  "basePath": "/",
  "tags": [
    {
      "name": "User Game",
      "description": "Semua tentang user game"
    },
    {
      "name": "User Biodata",
      "description": "Semua tentang User Biodata"
    },
    {
      "name": "User History",
      "description": "Semua tentang User History"
    }
  ],
  "schemes": [
    "http"
  ],
  "paths": {
    "/users": {
      "post": {
        "tags": [
          "User Game"
        ],
        "consumes": [
          "application/json"
        ],
        "produces": [
          "application/json"
        ],
        "parameters": [
          {
            "in": "body",
            "name": "body",
            "required": true,
            "schema": {
              "type": "object",
              "properties": {
                "name": {
                  "type": "string"
                },
                "email": {
                  "type": "string"
                },
                "password": {
                  "type": "string"
                }
              }
            }
          }
        ],
        "responses": {
          "200": {
            "description": "berhasil membuat user",
            "schema": {
              "type": "object",
              "properties": {
                "success": {
                  "type": "boolean"
                },
                "message": {
                  "type": "string",
                  "example": "success create data"
                },
                "data": {
                  "$ref": "#/definitions/User"
                }
              }
            }
          },
          "400": {
            "description": "bad request",
            "schema": {
              "type": "object",
              "properties": {
                "success": {
                  "type": "boolean",
                  "example": false
                },
                "message": {
                  "type": "string"
                },
                "errors": {
                  "type": "object",
                  "properties": {
                    "username": {
                      "type": "string",
                      "example": "email is already exists"
                    },
                    "email": {
                      "type": "string",
                      "example": "password is already exists"
                    }
                  }
                }
              }
            }
          }
        }
      },
      "get": {
        "tags": [
          "User Game"
        ],
        "produces": [
          "application/json"
        ],
        "responses": {
          "200": {
            "description": "berhasil mengambil data",
            "schema": {
              "type": "object",
              "properties": {
                "success": {
                  "type": "boolean"
                },
                "message": {
                  "type": "string",
                  "example": "success"
                },
                "data": {
                  "type": "array",
                  "items": {
                    "$ref": "#/definitions/User"
                  }
                }
              }
            }
          }
        }
      }
    },
    "/users/{user_id}": {
      "get": {
        "tags": [
          "User Game"
        ],
        "produces": [
          "application/json"
        ],
        "parameters": [
          {
            "in": "path",
            "name": "user_id",
            "required": true,
            "type": "integer"
          }
        ],
        "responses": {
          "200": {
            "description": "berhasil mengambil data",
            "schema": {
              "type": "object",
              "properties": {
                "success": {
                  "type": "boolean"
                },
                "message": {
                  "type": "string",
                  "example": "success"
                },
                "data": {
                  "$ref": "#/definitions/User"
                }
              }
            }
          },
          "404": {
            "description": "user tidak ditemukan",
            "schema": {
              "type": "object",
              "properties": {
                "success": {
                  "type": "boolean",
                  "example": false
                },
                "message": {
                  "type": "string",
                  "example": "cant find user with id "
                },
                "data": {
                  "example": null
                }
              }
            }
          }
        }
      },
      "put": {
        "tags": [
          "User Game"
        ],
        "consumes": [
          "application/json"
        ],
        "produces": [
          "application/json"
        ],
        "parameters": [
          {
            "in": "path",
            "name": "user_id",
            "required": true,
            "type": "integer"
          },
          {
            "in": "body",
            "name": "body",
            "required": false,
            "schema": {
              "type": "object",
              "properties": {
                "name": {
                  "type": "string"
                },
                "email": {
                  "type": "string"
                },
                "password": {
                  "type": "string"
                }
              }
            }
          }
        ],
        "responses": {
          "200": {
            "description": "ok",
            "schema": {
              "type": "object",
              "properties": {
                "success": {
                  "type": "boolean"
                },
                "message": {
                  "type": "string",
                  "example": "success update data"
                },
                "data": {
                  "$ref": "#/definitions/User"
                }
              }
            }
          },
          "404": {
            "description": "user tidak ditemukan",
            "schema": {
              "type": "object",
              "properties": {
                "success": {
                  "type": "boolean",
                  "example": false
                },
                "message": {
                  "type": "string",
                  "example": "cant find user with id"
                },
                "data": {
                  "example": null
                }
              }
            }
          }
        }
      },
      "delete": {
        "tags": [
          "User Game"
        ],
        "consumes": [
          "application/json"
        ],
        "produces": [
          "applicaton/json"
        ],
        "parameters": [
          {
            "in": "path",
            "name": "user_id",
            "required": true,
            "type": "integer"
          }
        ],
        "responses": {
          "200": {
            "description": "ok",
            "schema": {
              "type": "object",
              "properties": {
                "success": {
                  "type": "boolean"
                },
                "message": {
                  "type": "string",
                  "example": 1
                },
                "data": {
                  "example": null
                }
              }
            }
          },
          "404": {
            "description": "user tidak ditemukan",
            "schema": {
              "type": "object",
              "properties": {
                "success": {
                  "type": "boolean",
                  "example": false
                },
                "message": {
                  "type": "string",
                  "example": "cant find user with id"
                },
                "data": {
                  "example": null
                }
              }
            }
          }
        }
      }
    },
    "/biodata": {
      "post": {
        "tags": [
          "User Biodata"
        ],
        "consumes": [
          "application/json"
        ],
        "produces": [
          "application/json"
        ],
        "parameters": [
          {
            "in": "body",
            "name": "body",
            "required": true,
            "schema": {
              "type": "object",
              "properties": {
                "user_id": {
                  "type": "integer"
                },
                "fullname": {
                  "type": "string"
                },
                "city": {
                  "type": "string"
                }
              }
            }
          }
        ],
        "responses": {
          "200": {
            "description": "ok",
            "schema": {
              "type": "object",
              "properties": {
                "success": {
                  "type": "boolean"
                },
                "message": {
                  "type": "string",
                  "example": "success create data"
                },
                "data": {
                  "$ref": "#/definitions/UserBiodata"
                }
              }
            }
          },
          "400": {
            "description": "bad request",
            "schema": {
              "type": "object",
              "properties": {
                "success": {
                  "type": "boolean",
                  "example": false
                },
                "message": {
                  "type": "string",
                  "example": "Biodata with 1 is already exist"
                },
                "data": {
                  "example": null
                }
              }
            }
          },
          "404": {
            "description": "not found",
            "schema": {
              "type": "object",
              "properties": {
                "success": {
                  "type": "boolean",
                  "example": false
                },
                "message": {
                  "type": "string",
                  "example": "Biodata with user_id not found"
                },
                "data": {
                  "example": null
                }
              }
            }
          }
        }
      },
      "get": {
        "tags": [
          "User Biodata"
        ],
        "produces": [
          "application/json"
        ],
        "responses": {
          "200": {
            "description": "ok",
            "schema": {
              "type": "object",
              "properties": {
                "success": {
                  "type": "boolean"
                },
                "message": {
                  "type": "string",
                  "example": "success"
                },
                "data": {
                  "$ref": "#/definitions/UserBiodata"
                }
              }
            }
          }
        }
      }
    },
    "/biodata/{biodata_id}": {
      "get": {
        "tags": [
          "User Biodata"
        ],
        "produces": [
          "application/json"
        ],
        "parameters": [
          {
            "in": "path",
            "name": "biodata_id",
            "required": true,
            "type": "integer"
          }
        ],
        "responses": {
          "200": {
            "description": "ok",
            "schema": {
              "type": "object",
              "properties": {
                "success": {
                  "type": "boolean"
                },
                "message": {
                  "example": "success"
                },
                "data": {
                  "$ref": "#/definitions/UserBiodata"
                }
              }
            }
          },
          "404": {
            "description": "not found",
            "schema": {
              "type": "object",
              "properties": {
                "success": {
                  "type": "boolean",
                  "example": false
                },
                "message": {
                  "type": "string",
                  "example": "cant find User with id "
                },
                "data": {
                  "example": null
                }
              }
            }
          }
        }
      },
      "put": {
        "tags": [
          "User Biodata"
        ],
        "consumes": [
          "application/json"
        ],
        "produces": [
          "application/json"
        ],
        "parameters": [
          {
            "in": "path",
            "name": "biodata_id",
            "required": true,
            "type": "integer"
          },
          {
            "in": "body",
            "name": "body",
            "required": false,
            "schema": {
              "type": "object",
              "properties": {
                "user_id": {
                  "type": "integer"
                },
                "fullname": {
                  "type": "string"
                },
                "city": {
                  "type": "string"
                }
              }
            }
          }
        ],
        "responses": {
          "200": {
            "description": "ok",
            "schema": {
              "type": "object",
              "properties": {
                "success": {
                  "type": "boolean"
                },
                "message": {
                  "type": "string",
                  "example": "success update data"
                },
                "data": {
                  "$ref": "#/definitions/UserBiodata"
                }
              }
            }
          },
          "404": {
            "description": "not found",
            "schema": {
              "type": "object",
              "properties": {
                "success": {
                  "type": "boolean",
                  "example": false
                },
                "message": {
                  "type": "string",
                  "example": "cant find biodata with id "
                },
                "data": {
                  "example": null
                }
              }
            }
          }
        }
      },
      "delete": {
        "tags": [
          "User Biodata"
        ],
        "consumes": [
          "application/json"
        ],
        "produces": [
          "applicaton/json"
        ],
        "parameters": [
          {
            "in": "path",
            "name": "biodata_id",
            "required": true,
            "type": "integer"
          }
        ],
        "responses": {
          "200": {
            "description": "ok",
            "schema": {
              "type": "object",
              "properties": {
                "success": {
                  "type": "boolean"
                },
                "message": {
                  "type": "string",
                  "example": 1
                },
                "data": {
                  "example": null
                }
              }
            }
          },
          "404": {
            "description": "biodata tidak ditemukan",
            "schema": {
              "type": "object",
              "properties": {
                "success": {
                  "type": "boolean",
                  "example": false
                },
                "message": {
                  "type": "string",
                  "example": "not found"
                },
                "data": {
                  "example": null
                }
              }
            }
          }
        }
      }
    },
    "/history": {
      "post": {
        "tags": [
          "User History"
        ],
        "consumes": [
          "application/json"
        ],
        "produces": [
          "application/json"
        ],
        "parameters": [
          {
            "in": "body",
            "name": "body",
            "required": true,
            "schema": {
              "type": "object",
              "properties": {
                "user_id": {
                  "type": "integer",
                  "example": 1
                },
                "score": {
                  "type": "integer",
                  "example": 500
                }
              }
            }
          }
        ],
        "responses": {
          "200": {
            "description": "ok",
            "schema": {
              "type": "object",
              "properties": {
                "success": {
                  "type": "boolean"
                },
                "message": {
                  "type": "string",
                  "example": "success create data"
                },
                "data": {
                  "$ref": "#/definitions/UserHistory"
                }
              }
            }
          },
          "404": {
            "description": "not found",
            "schema": {
              "type": "object",
              "properties": {
                "success": {
                  "type": "boolean",
                  "example": false
                },
                "message": {
                  "type": "string",
                  "example": "User with 6 not found"
                },
                "data": {
                  "example": null
                }
              }
            }
          }
        }
      },
      "get": {
        "tags": [
          "User History"
        ],
        "produces": [
          "application/json"
        ],
        "responses": {
          "200": {
            "description": "ok",
            "schema": {
              "type": "object",
              "properties": {
                "success": {
                  "type": "boolean"
                },
                "message": {
                  "type": "string",
                  "example": "success"
                },
                "data": {
                  "$ref": "#/definitions/UserHistory"
                }
              }
            }
          }
        }
      }
    },
    "/history/{history_id}": {
      "get": {
        "tags": [
          "User History"
        ],
        "produces": [
          "application/json"
        ],
        "parameters": [
          {
            "in": "path",
            "name": "history_id",
            "required": true,
            "type": "integer"
          }
        ],
        "responses": {
          "200": {
            "description": "ok",
            "schema": {
              "type": "object",
              "properties": {
                "success": {
                  "type": "boolean"
                },
                "message": {
                  "example": "success"
                },
                "data": {
                  "$ref": "#/definitions/UserHistory"
                }
              }
            }
          },
          "404": {
            "description": "not found",
            "schema": {
              "type": "object",
              "properties": {
                "success": {
                  "type": "boolean",
                  "example": false
                },
                "message": {
                  "type": "string",
                  "example": "cant find history with id 5"
                },
                "data": {
                  "example": null
                }
              }
            }
          }
        }
      },
      "put": {
        "tags": [
          "User History"
        ],
        "consumes": [
          "application/json"
        ],
        "produces": [
          "application/json"
        ],
        "parameters": [
          {
            "in": "path",
            "name": "history_id",
            "required": true,
            "type": "integer"
          },
          {
            "in": "body",
            "name": "body",
            "required": false,
            "schema": {
              "type": "object",
              "properties": {
                "user_id": {
                  "type": "integer"
                },
                "score": {
                  "type": "integer"
                }
              }
            }
          }
        ],
        "responses": {
          "200": {
            "description": "ok",
            "schema": {
              "type": "object",
              "properties": {
                "success": {
                  "type": "boolean"
                },
                "message": {
                  "type": "string",
                  "example": "success update data"
                },
                "data": {
                  "$ref": "#/definitions/UserHistory"
                }
              }
            }
          },
          "404": {
            "description": "not found",
            "schema": {
              "type": "object",
              "properties": {
                "success": {
                  "type": "boolean",
                  "example": false
                },
                "message": {
                  "type": "string",
                  "example": "scant find history with id"
                },
                "data": {
                  "example": null
                }
              }
            }
          }
        }
      },
      "delete": {
        "tags": [
          "User History"
        ],
        "consumes": [
          "application/json"
        ],
        "produces": [
          "applicaton/json"
        ],
        "parameters": [
          {
            "in": "path",
            "name": "history_id",
            "required": true,
            "type": "integer"
          }
        ],
        "responses": {
          "200": {
            "description": "ok",
            "schema": {
              "type": "object",
              "properties": {
                "success": {
                  "type": "boolean"
                },
                "message": {
                  "type": "string",
                  "example": 1
                },
                "data": {
                  "example": null
                }
              }
            }
          },
          "404": {
            "description": "history tidak ditemukan",
            "schema": {
              "type": "object",
              "properties": {
                "success": {
                  "type": "boolean",
                  "example": false
                },
                "message": {
                  "type": "string",
                  "example": "cant find history with id"
                },
                "data": {
                  "example": null
                }
              }
            }
          }
        }
      }
    }
  },
  "definitions": {
    "User": {
      "type": "object",
      "properties": {
        "id": {
          "type": "integer",
          "example": 1
        },
        "name": {
          "type": "string",
          "example": "ridho"
        },
        "email": {
          "type": "string",
          "example": "ridho@mail.com"
        },
        "password": {
          "type": "string",
          "example": "ridho123"
        }
      }
    },
    "UserBiodata": {
      "type": "object",
      "properties": {
        "id": {
          "type": "integer",
          "example": 1
        },
        "user_id": {
          "type": "integer",
          "example": 1
        },
        "fullname": {
          "type": "string",
          "example": "Sabrina"
        },
        "city": {
          "type": "string",
          "example": "Jakarta"
        }
      }
    },
    "UserHistory": {
      "type": "object",
      "properties": {
        "id": {
          "type": "integer",
          "example": 1
        },
        "user_id": {
          "type": "integer",
          "example": 1
        },
        "score": {
          "type": "integer",
          "example": 500
        }
      }
    }
  }
}