{"id":32,"token":"eyJ0eXAiOiJKV1QiLCJhbGciOiJSUzI1NiJ9.eyJhdWQiOiIxIiwianRpIjoiZWQxN2ZkMDhmMmQzZWE2YzdlYjNlNDU4OGMwMmFmYmYwZDRmODlmMjRlNWU3OTU2OWUxOGYzOWIwNDU4NzEyMzYxYWFjODJkYWY3NzFkZDgiLCJpYXQiOjE1NzczNzcyODksIm5iZiI6MTU3NzM3NzI4OSwiZXhwIjoxNjA4OTk5Njg5LCJzdWIiOiIzMiIsInNjb3BlcyI6W119.Ma6nprdwal5aRu_Ko9yNTXR1qfR67XvPgIjo3sPN5VQAFV2bzWth3GrpW2jRco18rFnWJb0xhFiXhaY254CQ603bQH9Rg3cRBJiVgF6s0tVk351lutPdhk9WgPohWJABnzVj-YYCA_t_TCYdwLwiLA4cpDvRUsrM9RbXiGFj__7a45j3Z8M3CuJA7tQ5YkNQq2BY5OIdpUafTHw4e_Rgj68OQj_zV5-nh6aDyuIFYRcgMyUzxeBH353NCTnjMydARZ-DFKFGhs0E8maJw9zgUdRXJ2apP9qSK1r42y3QX_u_MFsw2FuoqK2WCb6zdeQ6DDisfLJMNJFnNXY80JVERjjFJHjzNKB-aFwHzPGps-gV366aEqGEsF0cAHpXW1HTzbjaG9e3JmOUJXiDjTgQPeXPX-W_7ngALM3VIFbNu_LUntfzU6Sm2kV4WjtLNMbGUH_SVotEQNGaXFMwLfnCJ8pN4xkN0zr3SPvq9SkmUHZ_qGjvmXcMfDqPBLMrATyPJTORXp1aK18bfVM637VMAX4yrDewbwNmlr63-Tuo6aJkwFDNNmr7wU9-6AjNBlN4Qay3owN5LvFHyZUscntqSCkaH6XUOhzwxruQ4zFAVY5ajQx5B-KwPcRlLJZEv-b4rgpMprA9rZfHPMXCNpEX8MKExLAbz0AL51csrazfUfE"}
{"id":33,"token":"eyJ0eXAiOiJKV1QiLCJhbGciOiJSUzI1NiJ9.eyJhdWQiOiIxIiwianRpIjoiNzc5YjljOTMyNjhlNTVlNDllMWE0MzQ5MGE1YTVlODRhY2E2MGZmMDhhMTU1MDJjOTNlYjMzMThjY2Y4YmJkNDc1M2QxZGY5MjZjMTRkMjMiLCJpYXQiOjE1NzczNzcyOTYsIm5iZiI6MTU3NzM3NzI5NiwiZXhwIjoxNjA4OTk5Njk2LCJzdWIiOiIzMyIsInNjb3BlcyI6W119.jm-AEJsFjLwKRREoG869xhvOts8nUIi9HB6yZ1ZY7VsnuP3BIrLUNoRvoKZ27OHxTFyoIAY9JpVw9CMJOqh-_QJ4pf_Z7CVLNlumBzj6gfWQn5TLNqS3j8wTQsjJe_6mN_rtxm_iYmer0d3H2-XRYJliKTpNr4aHX_hJvR_0WFAE_kxt7Ce58ELowmP-M-z4C0mVO-kKA9IYYvf_ldbVKcOAt9hubfhgGzhiS4-pHhzBoh2khGE-vwXVrBLrKFNRzmFXJELJxHXPwHhCgEqb4kmUiiadQCYyta3TEh1HpoavCCMizY8qs2sm0RpDhTu4Qsmb7_A8PypqziZcO4IlkjtikEvTJVVHbs1SQSw0DbJHtIWFzNJ0RSLNPti2DAORIy80AEcjK_XgUarHR8XMzSPAObw7v9-OpjHoV4RB8iK6ffvpGeZESMwKiTyt-Y6IwUhGMVwvQQKXCIAnfpB5z9zdOmImEUxtUnm66ay14OK0vfpLuaL98mfh356YQ-rOdlmF8iCQdEwNQipyAfpJ5MX8tNuv4Pitdj_dDNEu-VfVKb3-4kHWy0elHamwECaIUS8maqXGrvhMKjLInhQGoJkbtWEw9fH0FS8taHe-4s_QAAsE-WLts78qkHq-Nq8eZitg8bUqtE8CdI88dm_s-e8n-YtUoesKyyzem5y-Ta4"}
{"id":3,"token":"eyJ0eXAiOiJKV1QiLCJhbGciOiJSUzI1NiJ9.eyJhdWQiOiIxIiwianRpIjoiMzI1NTMxZmI5YjhmZjQ0NzRiYzE2MjY4NGFlZTU3YTk3NGMzY2RkZTQ2ZDgwN2MxN2JhOTg0ZWVmMTkwZjFmZmZiNjk2NTM0YWY5ZjJmOTciLCJpYXQiOjE1Nzc2OTU2MTQsIm5iZiI6MTU3NzY5NTYxNCwiZXhwIjoxNjA5MzE4MDE0LCJzdWIiOiIzIiwic2NvcGVzIjpbXX0.Wg8jKHgfUjWruGoPQTuMxJisDaGvBIn56CSG7NudB4SzLS4B7oExxmDACtyAAwKRixD8yJuDDIphHs8gB6MZZ0wAfNIile3K-ytJMJwaeSt7Kv3tIywcfTr393GSNRJVX4e9TRnt9sO1-hLFhlzp8-hKiH7DIQsvjFg07yMfNBBnj0Bvd6L1TveABatZ9Cq71kkzpTCSIg8LVg8gLwSDwp4O8xnIsuxPuDsdiYXaE9Ih64o6FpKA6kpLXpT3Niht_nDic4KwUIUBephhydW7bZeyndItNw8EBJfhTtGRRY_5rwVx-_1KGj6JZJZsbTNA5MQAlqdWK3yHua5LGU0Yl_1Y6-Vqq-Sjn-DAHFGbd0f8RjBpNaVIdG3p8rCD6HMqk-Lz-3AuKGsKTCUubx5GWePYOXzz2qPra19l164_6HcMN7n-ft1XpZnad30mhhK9LYnaZ7SNrjvyj5lw5OOWJb6zTOFH2Y_lnEbKvvxjCQR7A2JeCqsKNZ2fEoKMcxf07l8X5vdPfVOcn5bSp-i_cYApf7WOc_5SW4jy4Pdq7ZDoUBIopQv3Xt9zt62GDncpbSdR2vMbuWqerd9hFZhEiEZrmXaKTz3WSrdA3tVWRGcnXTkxsu-lXXSjj1r35Z8Zx8jt5fkyEaAuV2t-pcWtM6BcHTm-Qa062bN7VpHt5Po"}
{"id":6,"token":"eyJ0eXAiOiJKV1QiLCJhbGciOiJSUzI1NiJ9.eyJhdWQiOiIxIiwianRpIjoiNTUyNWQyM2U5YzZhY2MzZDdjODgwNDI4ZWVlZDVhY2YzNWE3NzMwM2YzNWI4YTgwYTQ2ZmRmYjA3MDEyZTI5ZWQ2OWFmZDk5NTM5MjhlODIiLCJpYXQiOjE1Nzc2OTYxNjQsIm5iZiI6MTU3NzY5NjE2NCwiZXhwIjoxNjA5MzE4NTY0LCJzdWIiOiI2Iiwic2NvcGVzIjpbXX0.Kw0LmlCGtjlzKwPV9hWyHr_JSGUbBO7G8yFrn9DwZL9jXnnm3hinwh-tWKj6MFBtI3hGRcbkLhjzL0j-HzW1sCvP0p6uCgH7NDDiMpxHQZz2uYs3Fx7wXh4Ls_RDaeqrKmIQw9MVx8KOBnhzH8HkEmKCfCjAr_RfBjFm80LkIAk2VcRZL1EjfUPZqkHjoDP0CF0Ko3gLYr-YPj0fqxd7VBxuiekN21BvCY5jv5QoyBjvcDqZzoDSVbpMcDRux5cfJASIcXf82BSG-nAlsFbTr43uGCWTaAbN8naBiSbegbQgtMI0sS8RIccUk2wUG1069IVDSMU-FM49ZYBOObzFhlTBULEMUdRoqCdWp_fdwmBJF7F1F9BWjN8kYIA9zvjh2iO19mEB9ABuzs0qxqsL0TE1lEk8NvB73Epc3bv1qfMpm3V5hlViLDf0UzeSX2l_PeAq7zVbrcgyjJGQgWe2gB9Zu537xphDKh44Sy_5gc_uL8eIonoN1w68xauLk_UUNmhcA6u9Y92h_cJ6S6VhkEf07QmPNKYifhf_aJoAXR4fSlvsQGlFNDeSqS_sc5br3llhdGvTMYqV6p15db9EMnpughGwmT2v9Gdn-Gl6XNvICtdr-WilNBMlL1SfHpT9NgUvbF66FMgCKqXvyB-RAJoM_vNNnpc0sfAZtLffbyM"}
{"id":7,"token":"eyJ0eXAiOiJKV1QiLCJhbGciOiJSUzI1NiJ9.eyJhdWQiOiIxIiwianRpIjoiMWZjM2UwZWZiYjJlZTc3YjIyMTRmMjhhNWMzZGY2NjQ3ZjI5MDEwOGY2NDI4MjBhYzgxYmRlMGU1YjVlNmEyZDhhNzA3MzdmMWI2YmEwODkiLCJpYXQiOjE1Nzc2OTYyNDUsIm5iZiI6MTU3NzY5NjI0NSwiZXhwIjoxNjA5MzE4NjQ1LCJzdWIiOiI3Iiwic2NvcGVzIjpbXX0.kx8Pp19mvbY9lzzUlb1tatdp15g2jvB7Z3mwu8MvcSD20qKPpebK9i5-btd4Fpufi6KAO8v0iu81IEJRoCC38_l0ji56UVPVB5dpe6Dit2dciTV14pm2FHFAQJmEuy7kCTja4STvf6Lf0XRshqILOHYHpOTI0pdrtRnRMkY4-2c22IUYLWokN9FDqUm1MPKY2xTOk07VwVP1npcf7EAV4BXtW16VLkEZFvg2R64Mf9c-8gi8MvTpjI2AdPUNaC6o29GBhaLCMxNafabWh88VmI-VMMMMV3AD5-id1t3rXi1j4F5kAZcuba5NtD-YUV3-Sh5znoY7r0HKGSYW2x98Y4h9Cd6VUVXn2UqdqMhS2crV_Qb2PycfZMpV_AETwhWPQNFtzIciPNtUHnym2xblH7qQveM05MF5ZHdvuzi28w1_7ZmNfjacvLn9l54rt_dyh2X20ZPiLeYJ12AOFka2WBxm6IbYIZhWfNCLXW8fq8ScN-KMe3SMt_3nLuYa-brrqUIe4pAkFOy9lVTIeePXPua_s9gmB-s2UxVX4yFPAm85TsOMWr4MStdKgxbBnhKkjb8brdY9H8DEmX1iossoTiReV9BS5I7QGXKjEl9SAm2ZuRpzdOCe31vWKFmIj1nkH9WkZJtryNEqChXtSogcTBFnilZQriTXzG_ZyxiGryA"}
{"id":8,"token":"eyJ0eXAiOiJKV1QiLCJhbGciOiJSUzI1NiJ9.eyJhdWQiOiIxIiwianRpIjoiNGY0MjhmMTU5ZjlmZTgyOGYyZDQ1ZjEwYzg2ZjAyYzcyNDJmNGQ2NGE0OGYzMmQ2ZjdlMjQ1YzQ3YmQ4OGUzZjE3M2ZmN2FmMDA5MTk3YjYiLCJpYXQiOjE1Nzc2OTYyOTMsIm5iZiI6MTU3NzY5NjI5MywiZXhwIjoxNjA5MzE4NjkzLCJzdWIiOiI4Iiwic2NvcGVzIjpbXX0.ms7RFcVmwPk-9wJNq2ky2ulLXc_dyUt7qdAOZvBkmXgxTADlM1bY2JmMrVfv5FdXC3B6AIeqZSsT6J2ILl_PNUajTcGErKr3kSsoqJNeRRy0ZfWY0RY9qDzYXgQxFhva2jgGYap37gQtp-rBeUeZn_JyrFtnalo4rSt7Lioe55dbQZ5z3A6YOudCNb8nZv6E824Ji8vJhU5bPsZxriC7F3muE06cA622TKGQfFluaeR2hkP8LmnXoapqX2XKG8f0HU5NW3S4k3QVJTDuxzgt2dLF4omHFKvE6PToFWbpNhTBSZ77SrfoZeiIsYN43Akk_-9SCjZB-kgjCcK3LydddzsBxvAGJN9K19F4nxM3sJCpqG8ep_HIzmHwHwkb2owXAcLKuWFmb0s9JSIwJ9lbUW1x-odqhcIxYFdC__tM6pZKuYaIFGSCf9nYrljXvEscRkOynvDJuGqToMIJWI_Pw5ZV8TVb3UAI1RUIRNj0WTE6dTc2T2IldoRtXzePAosmGyswl0t9PbJrmLDZcpi_wVMXxIVEDhATbwmz_YcpvI_PlIJWlr1CurIjjvzo5p_tig0snHGpENRpVT5Zt880HcyOFUXGAiiVYR5MVRLSZbZlhIYp0XfT2JSQy17KpkktsZ73rVwhoDPfdiV9F6vzhjbR7x_Xs1jnIYnuSUsggiU"}
{"id":9,"token":"eyJ0eXAiOiJKV1QiLCJhbGciOiJSUzI1NiJ9.eyJhdWQiOiIxIiwianRpIjoiNTA1MmM5OWQzNDM3OTdjY2E5OTg5ZDJlYTIzNTEzYWQ2Y2FjN2I4MDJlNzRiOWI1ODBiMWFmZjcwYjg0NjJlNWNmNTBjMzJjMDQ4ODE5NzAiLCJpYXQiOjE1Nzc2OTYzNzgsIm5iZiI6MTU3NzY5NjM3OCwiZXhwIjoxNjA5MzE4Nzc4LCJzdWIiOiI5Iiwic2NvcGVzIjpbXX0.d9OeZhzEz4Nt15GiImV3BbmmmzhFV7gJ8Fk6Tw6NZi4tVxgbdrBq4GEUL9xqgebPWvmR1H255veZyIQglaBdOx3izGladGOnCF6QJTi8aCPS-EXz9ptc2-8qW9kml4Jabicls5_mQlYWy_zQMo1xBtR7FTBBjVZ_lNUwnDYDwILtfKHcvs_ua5bSYOx8rCX22Qp2ZKYx5ILqFZthibKYA0ayUna1uz5Xwl_AW46bm67Mg88EnPuyBLMV8Uu9_R_p5ts1ssoKbN_di84iJUSS6mc9cT8UaaAuwb3G-3uICGijOUiHJUAqwadSxVRsZQKyg7emQO0skLZ8SnlKkDNlLrq1BHGo3NlPWoynVXANPfl38E2rJA1fbgtITIm6hm367-RQHxe91Z-yI1ZKcMSh19GxiIom8OfLrjTRCyTLbDecbn-OUNNtJtuwJnuPvUlHp6YzI1M_IttLCoxCwJlDveUs5cqKgDsPkkcO1MDPSfYcj8QxfkpwuwrFgh0ZJMLROaLmAD33Ciccm74myRlq9lQv4ajk5rxELThoqQNpikeg2lFa2VwhKjhPl-8wsgH7t1CnCiU38zl_YVvMI1MSxs_hhnTp4lUfxQ3MZQ2vd2K_RHxojZC6tee2Rcqtg4WwvVIPPcNU8Yin3QXWkqAfLhudhJG4T00qsyr3GGLWOyM"}
{"id":10,"token":"eyJ0eXAiOiJKV1QiLCJhbGciOiJSUzI1NiJ9.eyJhdWQiOiIxIiwianRpIjoiN2I0ZDEyYmUxNzUwODFlMjE2NmE3N2U0ZWNkNTI2MjNjMGEwZDUyNTE4NGYzNTIzOWNiOTQ5OWVlNDczZDdiZGE2ODlhMTZiNTljM2NkOTciLCJpYXQiOjE1Nzc2OTY0ODMsIm5iZiI6MTU3NzY5NjQ4MywiZXhwIjoxNjA5MzE4ODgzLCJzdWIiOiIxMCIsInNjb3BlcyI6W119.g7hAZmXF7gpBdayvMqCPa-WaV7nklZfX6l-TDSwzD1BxpibdX83_DENSgK-1kGldsvm5xP7f9_yXG8vt_xXv-HTw90mapVySnvufaQ3omNj5zFGSsMormBW046HKDEc_qlz1Z2sqdEfXSFULI_hvhgYt9FffIFbH8H4ONyqZ6fHKCjsccxbKCjut2PhTe_e4xj4ZEUTxnHIEKtDD--o_W_8nqGUcVaMAJlJnk4ELp3iyid_QoevJoXAY2lngWatqBjOHo2nQc5iD9bGz-acJB3IM1wIfLgaJ5gun0tnvCF7Uhtfc_cS_W4OVN12g_luIgaAfGXlW1cVwh8zzgRYtJAv-_Ko_deya4UUJSNJfiiXFWC8GSCIaO5ke645DL2Ec0Z_XZi7NMp27NPpUE9NidPphDfX2uM46bDmuxdm3HIsfWkHhAvsXn5oNt8dNbGrtg0sRSJUr2P61nwAoBmg9YtHIDWB6zd7Nt65ugJ33EBg8Buy_wQbyIvXUNccaN_ZT9jEx0QDQ6BVm-7oxVk1k7Wsgd7XHfrWuAoZGPTjvhRQjIcAGoixS5Q-yk4EGOFXn6h0aMdpPgomeATMzvveXkF9nk8p7I33LOaCWju-cQEFrGvBgIAAd_PvkcMzlwbuDsfmQifmwXrf5NdYsjy5mebvIM3ngI_G4PAudvOhU19s"}
{"id":11,"token":"eyJ0eXAiOiJKV1QiLCJhbGciOiJSUzI1NiJ9.eyJhdWQiOiIxIiwianRpIjoiNDYxMDkyODZhYTc5Mjg3M2FmYjBjNDUyODI0NWNmODE0NDFmNTYwYWRhNjExNTIzMjk2YjMxZjRhZGVhYTQ1NjE2NmZlMjI3NTU1ODBlZjUiLCJpYXQiOjE1Nzc2OTY1MzQsIm5iZiI6MTU3NzY5NjUzNCwiZXhwIjoxNjA5MzE4OTM0LCJzdWIiOiIxMSIsInNjb3BlcyI6W119.EyWKUx9gOXcYPFMCjAuKSxC654Hy4c4iwAPFcJx4N1cP0GOGOyIRXu1newBEC5CS4Hs36Gl1dCnRN_EJiIMc_OMamMS74MEmLwCLzcz2rulyTBYBbnj8m-fu4fHMmaoIJY-V56CHBN0bVTFkcfEoy4epwmNSZRC-aygU2WAGQZl49S6hSaE4iASpf-bLVLR4ConwSuKOYr02aWYptgAsgtSoqhyyABTrriNXcnh0S_uyRKRDaJzFbkXLmuPQr0_yybQEYjmT1WNgKWnmA6pz1YgmzVZFZrurcp9LfDity8lI4RpiaUFQUj7M3jWf-MkOVN_mvdKH4eifWCTHZXA7ZTn8Ek6WMAZ8U2P-p87bARBzV7jDUnGjuhO-Te93y46zJb3ruwY0iGHFBPCOs2655QtCQ5Ua_AGOO8_8oxtN8ZBlffq9i2bZhv8hXgTTCFo7ykMjtwNRJ3gsD3xEsl0jVKVN--ehtQUml6HSu-aXYZ92obwhWDKm7Cx1fL-S1d6dpHbcnBaans6vZ7dB-aiQh9FzWZ1HQI3CoRiuWO0QK4ycPFIRcF87JIGhZXYC7fbfK6STN8sCwFPSGngba_BPShnJge3UWDoYBW1jfnityeHmYM99KIqREfay1C1DCuZsXdSj1zYWL86Z3OwirU9GvsVqEEGdXoY5EsWTgGwhMgk"}
{"id":12,"token":"eyJ0eXAiOiJKV1QiLCJhbGciOiJSUzI1NiJ9.eyJhdWQiOiIxIiwianRpIjoiNWYwOTZhZjcyYzM3M2U3NGVjMWZkOGI4MWJiMDUxY2I4ZmJkZTBlODE1MGEwY2JlMmMzMDc3MThjMGI2NmE0NzFjMTM0OTMzMzM3YTkxMjYiLCJpYXQiOjE1Nzc2OTY2NzYsIm5iZiI6MTU3NzY5NjY3NiwiZXhwIjoxNjA5MzE5MDc2LCJzdWIiOiIxMiIsInNjb3BlcyI6W119.kT07is1PHySF1s6WHfMH5WzoPxppVvZjJZySrnmqaXAC4h65XKud-lh7hfNw-O5wxkJkH9qe9jPBmd6vOa-OSLIeBNQgQzRXfhsJh4VvxmGMKR5N9b26INxh21GViAiFbT57Qnz2qGLmppuzEhEMXSsfWsIIMlLmMUU-d2y3aZtoJJ8X6mcnhcpmKRbRJHhqd5FrMh88yk-wLzeOQKXJ515ReKzoS-Vo_wDGxYfrrPRTOFTpWqSo9nGDxPH5OcZfUUfgqUI85i8T2IRopLF5oHV2xdvFJYu1f5GZVx9DTisojaWZDT6HDM0RbkTXJLRMVD54wRnbhtoP283YQFjbCQ1tIsvvbRkHrpBntQepnWd5bdUA6LAU-Sfrw9UgIOn9pHl0I8V0HteZzhECIyCrAOrdug8AzRGDQ4XHv4iJWi8H9myJlB_93fK_z44oZGZP9_ROxrXEONotXLpmvVDruL-YRptUHIkLo85EDnCQ2WnImGA_TOPFxqkjBknTWLzcmUR3ESfF_bUgZsJZOfulkv92X0pscJpNT43unFUyZ4RucidR95ayk15GGg3cZC0xd1ZVIR2_cYVIdSrwtTnEuJM56Lg1P4lH3Z4_xARZApLYz3-HNvuAnCkKPQf_QCHFDgv_ovOvDma9h9aE92nZ7P5o1A5jKxpocoCqHrLihyo"}
{"id":13,"token":"eyJ0eXAiOiJKV1QiLCJhbGciOiJSUzI1NiJ9.eyJhdWQiOiIxIiwianRpIjoiNzE5ZDJkNzhiOTU5ZDdmYjRiYWU4NTFiNmI3ZWZiODcwMGI2ZDFiN2E0YTE4NzJiNmY3YjE3NDVjYjAyYzg5YjRkYTBiZmI5YThmYjEyYWMiLCJpYXQiOjE1Nzc2OTgxNjMsIm5iZiI6MTU3NzY5ODE2MywiZXhwIjoxNjA5MzIwNTYzLCJzdWIiOiIxMyIsInNjb3BlcyI6W119.krBfJJf3mcsfSJfLn97Z9B0wkN3Ob2PJyzX9UbrRifBTB_ShEpltcximhXRBKG0oMAxCO566Td0xGCoxN-E8S3CBp8RsUt4NLld-iX0xUV76hdBReA7_qgFa88OOHT3pBW-ReRTUTsicMKzxKnUYOct1Of0-3uoIyg813ywdxjMhNh-m9a9vRLHN7KXkUUme4Ud6Ou4joznpws7TfG7Td5HBjbG7zi24CnJmBOHuynbIh_orms775Jd5OdxvLUfMUOhaFT7xmDnHMiAVj7Jf-ZWvEEx2D1w5YR_d5hIsIBhx-79IbHw3QNZTBv-CVIu7KjI7QAB5vvnqEOaRQDSI9pLenRZW-YJmjqEkeZCvbNyYCd4uZzcb7fO279l1wZRqcokLUtzed5m3p-V7qBywKHHpsch3FD8vBM6DyI1ddVjz3ZAgxrOl_IcHU_rFsJD8Xx9WJ71XGn8WVB22N95gdNKKC6UXXPZHuiJ4eW-0obhXwjNGxdfZWHGi5mIv1t39POLwbDGPAZd8_SQfFVWaiiSw5_tKgGteAX_lXVz3DYtsD5qLLr0PsmaN0hw5lxiRWAOXhXAXNa5fykPTlStA5zLbDHmbsPBLq22Zll_BCBXQRcr4MJE1WTeoosmk4FAn7_59Pg1E3SjPvk8SVk64JHd18dHkl5M508Tjkch4hqc"}
{"id":14,"token":"eyJ0eXAiOiJKV1QiLCJhbGciOiJSUzI1NiJ9.eyJhdWQiOiIxIiwianRpIjoiM2U4ZDQ4ZjFmNDQ1YzM5YTNjMTRiMmJlOGQ2MWEzMTNkYWY1NmQwNTJjMGM1MThjYzkzYTZkMzAxY2E4MWZmZmQzMDE0MjY3NWVjNTdiZDUiLCJpYXQiOjE1Nzc2OTgzNDIsIm5iZiI6MTU3NzY5ODM0MiwiZXhwIjoxNjA5MzIwNzQyLCJzdWIiOiIxNCIsInNjb3BlcyI6W119.kwBsEOsrAP7p1yFHuOzLsORFdy_WI391W9YI0IOheTDfJ5-cT3pmxJzd-_6-8uO2e6ipM7n5GuR41wC92K3N_xYWK1OPVmMV1jOulodpt0U-BaxjUdnnau4Q5Fp7QBQDbJkVLUItA3mF5wU43O0BKZwgTOZtqgyGK4HHVCSRfzOiOvo4_Zza7Lg1Pbm9O2QOLJk7AUDc7rLLVsB8cKQ_TC99Dffntrng82R14sCWyZ9T1E9wEYNG5wKVvjyAZ2w49lnBy0qJsafxP_Aaf3FjzyLOlXUjPeY1Q9eOmajfVfJWFHRM1I9RL-WpL44bTkujdML1gOH2DGrXdQiK4ooNgYTw2ZHTvqqI8-gkGjnudqwSChToV-AaRAW9XeWZdIjAH1DLh1PDFPiJMbC4M75v3QhKngKmaAwkv6P3RRgvQhMd5lPKyoiQPl2svTZf6BQFDATmX31gpNgdhObv8DTBjykqmws_MwA9AdzoB1OZtASX41Gt1sVTPlaJ_pRD2PQAugfuI2ZzwQBtlVsnw2FZTRbfQnPmt-JtIVIhFXbps6BVB93F2jvGh-oAocB684i6SO-0y1F6FfxSsqBWrzZmFKJTvoQe0htRBOhlytGRFfy05hq7TA5as9aUfq4Rwu8wFQp_Y3dKa0pVTQZbqBbMu0eM55DGP_SIi1Yc-XWRnJk"}
{"id":15,"token":"eyJ0eXAiOiJKV1QiLCJhbGciOiJSUzI1NiJ9.eyJhdWQiOiIxIiwianRpIjoiZjNkNTY1NjdhYTdmNDY1NTk2ZmRlZDQwZmUxY2FmOGQ3YzA3ODJjZGU1MTkyNDMwMTMzYzc3Y2FjNzM1NmIwN2JjM2JjODIxNWIxYmQzOTciLCJpYXQiOjE1Nzc2OTgzOTYsIm5iZiI6MTU3NzY5ODM5NiwiZXhwIjoxNjA5MzIwNzk2LCJzdWIiOiIxNSIsInNjb3BlcyI6W119.M7IWllfWnvXzWG_lHnKh4IS4SAAjtuxJ4bXjx4S3nbECnFBUpuyIqS6U2Ffeps4ISrhNbxbpzUCE-vf9sqPeZ9SEaGaKuUcXxgUF7Orz8xlPr_j0mfBMYtsjkqajWF3unIOwoglGAYWxQYHpl0KsTiU0dM7QZwpqGxF5Kw3Zj5ofshn_V1_E5Kcva6tHfFXkTNXD-mD5ukhxbXd-Cqk7voK7WAx1W4mrs9P94K2Or8zg0ewLinZjIDft-QuEKrVw_HtNTKWd-eaX8ZuvPmvlJk18SeviFHhhqr_XDpIoQZPdALl86LYxvXSryGoieaplJLIWnzsILCA6sdGbliLWYMfPE4G3ur3Cd70w0kO9Bh4MyQCiGhk4Vr2GpiRUXoaMyeKf1vBA0--jhqcOr3OrksKwZpcOqhxFNmofxJMGzWGAPV6EtkTOJ78GV7_tVmu5aD37u-cOg01Am3En63ZlZ9WKPmub9CUWiu26L9Nc2sJpAFrx8srmbJXuWii9RmBrCZORsJJ0B5540w0tT3cQjvWc635EqzMJr7fJ3oDtKFQnd4FuUQ8Eya-UJcTsgiF-sEszejXM8YMX6kqXj3miEWFwOF1Jv4V4RZYZ-SjxTI9sTivUatHpId4D7j-UT0yvwywT62zf6gHwE8NlKUOfxVz-TZtiP71A0tPnHGyUAek"}
{"id":16,"token":"eyJ0eXAiOiJKV1QiLCJhbGciOiJSUzI1NiJ9.eyJhdWQiOiIxIiwianRpIjoiNDg2NmEzZDc1ZjVlYWQ2NTE5Y2U3MDllNGY5MGQ3NDFkOWMyZjJkZmFhM2VlZDZmOWJkZDcwMmUwYmRhNzgxOGM5NmVjY2VjZjZmNzRmMDciLCJpYXQiOjE1Nzc2OTg0ODgsIm5iZiI6MTU3NzY5ODQ4OCwiZXhwIjoxNjA5MzIwODg4LCJzdWIiOiIxNiIsInNjb3BlcyI6W119.nHFF2d-lsaPIV7GmTo83vGOklILBlMiYXvaF4YjmZ13jqv5o3nOQE_GLdduBQX6gDCQVp8TdUK6gwnrRUgHFXGYx1MD1HPjJwpBpa3ob4REJ3Zu5U_SkipNQuwKV_M2kIsQk-n8IC4TIuOaljfQe4DMmBL7wcZbXhS1RhfpnWA3me9ruDQEMhRWZeB70f_Gp1bM4pgzVf2s1a1z_3QXdsSPK-RAZ1zjiLRRYI3xpwOUKRfRhQ1RY2siCy0P5Ku0ingEdqmXNZLBNfi_OTojeQtBE4UCQZsv2xv3atVHBwBvqt21IzMrmQDidahfCTCjacRRAMRW1G-wwoekedYrWiGyAd8J30-GVmeVeTtTbdXKhTBc-8PQaA5s0nxZd8liGshUEls_V-Lrof66OQh5v1Q0M8AVZPyR-beWvVlM1NokUQMKm1FvaXQKZGv01i_qUbtI3HkBtYnjBLhsjEpVL66Wo4d8dRWvji7zby-QKarj4fPbhuDVUz-t-Ht7H3cadjb7rXdtHoMAwS_Q461qNlh3ovTZm1BSyBsFvSU7us867LEc7GXILFrRRuJPhYLwSf9cdMFXHmd4vishiQSCqRpxAqJ-9fNPXIgfb_5jnxAuuZifO6ctMKgJjS_MvDCzUPpXqh38wOsh6VdV7F_mtJYVe0YzZooTMHn4csRtl4zk"}
{"id":17,"token":"eyJ0eXAiOiJKV1QiLCJhbGciOiJSUzI1NiJ9.eyJhdWQiOiIxIiwianRpIjoiZWZhOGI4M2NlODU3YmMxMDM5MTRkZTgxOTEzNjkzY2Q4OWExNzlhZGY0OTVhYzVhOTRkYzMxNTA1MTRiMjY0MDJlZTVmMWY4ZDAxNjNhOGUiLCJpYXQiOjE1Nzc2OTg2MjMsIm5iZiI6MTU3NzY5ODYyMywiZXhwIjoxNjA5MzIxMDIzLCJzdWIiOiIxNyIsInNjb3BlcyI6W119.SRurHl5uHDYbvIAB8uuFDaY6GdBLrGf_9MyQ-_2DS1b39ZZDUcWwUWdL_jK3SD_DO3Avl1-zB7-AbjbZxHEwQkLBQwE9D3eJ_8dBR2llKForL_8lzH7t1aYNzDE7HSRA6p658adg7VvaN0-cJiSB8Y2ogJbXoTCiigEpySzkRk0j429mudMrtRzP-4jO5kr1Ez-h523YGyO5FKmS6uYepXlCcn6e2v10nfsuSHDkP2-WLalmds1L__gzstOcfykmK9vZCR1MyeoNXHUg67MUJujJKE1GCQe78YwFWmI0fvKpmegEulGsCkXCfAXNIXuzuPms-kWBjiYdOMUKwXatBV8c_FyPcYw1APlZcsj5b7J1DoxNqgtBoRQ058LQNgfS2hcNmlRBsEW4p8ES-s_w4WB8Kw-OOTet_hCkvOkfZo0PVpAWx56VjTLsn8nuD0DOtxFD0fkyuwR1asGDkaaVje6qz9iCr6wC7X7qMGYwJkhq-ZgLJV02wm9sDD-RdI5Qge8hgAKULX4a5JRnkg02barLDPsPi3zJA-Zr_B65IW7X7jk_usxdKSascG1BNRX3cb1qW78FM6GDBxxQ6hziw1iUZDMOEZK9sjUGKzCpRZ8MKth368OhxVuU295pWWL-ydt82bOV0PQedmp2T30E0fyU2kIrrJ0acKuBqlPNCHM"}
{"id":18,"token":"eyJ0eXAiOiJKV1QiLCJhbGciOiJSUzI1NiJ9.eyJhdWQiOiIxIiwianRpIjoiZmE3NzYzMzFiYjg0Y2IxZDQ4MjRjZTZlNTZkYWFkMWU4MDIyODc5OWEwNGJkNzAyMzM2OTQ3NDBjOWQ2ZjVlYWFiMGJmYjBlNGE3ZjAxNmIiLCJpYXQiOjE1Nzc2OTg3OTQsIm5iZiI6MTU3NzY5ODc5NCwiZXhwIjoxNjA5MzIxMTk0LCJzdWIiOiIxOCIsInNjb3BlcyI6W119.eemE_EADakqarxJFOpuimdPnb-jK0KFMabenfrvqLRcmPsv6GSJHJWaV7K17PebDYewqufJW7lJxX2M5KcbETp4u_jxtXvzHCgQzxhnNxdzeQ7M8cc0UsmiSXE7K2yg5H78dbVDQURat3g1UWND9CIQrycJ_RFospRXzroUB3Y76x_6JAQCy0vK4nnOyfVhTxrM7CBZP0uO-9aOVsXitr5RKIbCSqY9UeGGtOeTrww6kwTZ01I7Sna-dhZNleALM2Z8PPZh6TGtLY6MG5EzkLIbxcEehKUB0TZ6YThRtUcecgBt79yRRcy9uZEpcFpFA1H5f-TrVu9Gw1mSVhK8DrcW9VMYCF6MgqQ_5TI0D0xYcTPn7wkZ0LShXd5unCkKMSr6aJv4KOGQt-wN9eVmjGuB_CfAwggHCLW37dwJm6euBqsQ9S2it-1Qf0ZkKfBstKbJIKFS-qm1ScDuazQ5-9ZY8pvs_cStL-WAmSFHp6qM4ol2Z4pgdT2vN_pzF3Ix3dyINYDbh2II-mYQTToiGwcHCxTXJE5pRIkzLypEZn0XaJG9iQ3YLK7GexyVo9fMqt5PPLXEwbAaeWbKDFFuIjIe-uVaeLP1NbU0SHfdU27NeR7Zr0d3NtXIYxeAiluBhrzpSCllPg611NoDdvjSPHOg5ZCDk1ktxBk7uAmua86M"}
{"id":19,"token":"eyJ0eXAiOiJKV1QiLCJhbGciOiJSUzI1NiJ9.eyJhdWQiOiIxIiwianRpIjoiZTU4MzJhMTBkM2FkNDAyODQxODYyZjRhZTQzMmFjMDAxZjk3ZjJjZDM3YWUxNzVjOTk4NTE1ZGJhZTBkNDhmYjliZGQ3ZjQzMGUyYzA4MzEiLCJpYXQiOjE1Nzc2OTg5NDYsIm5iZiI6MTU3NzY5ODk0NiwiZXhwIjoxNjA5MzIxMzQ2LCJzdWIiOiIxOSIsInNjb3BlcyI6W119.S5CzEc2FdvLOE6gpMDThVLdZWj7zc_FEgWv55KIewtTH8et4MxKAV1RqV-n7VGRITosoW7tkkMAruSLqKjPKWWZclPxEV9A_fP_-b2lRu_qFvX7occfHqEEXZ4Nsj7RPcSw9uTaujp3z2lzQyk8tbioaUUKhxko3yhGAZ56wp3pXTpxmXy0QxpTDJSNwL_RqZQdkvBD7SYxH8zvKMXuusFfcauqLf7zZUdcuKKAfwpPNfc-Y_G1ssifgDL3JzsDp125Ti_pgtv8OcUtprcAc8esSyG8MygLfaup_DrMluVCt0szO-ugABbOAvh7RCtaGZ3FdOk5OsZyvpVTpQtN6laNpSX2JHbEKWE9lFgzOzIg4XTp25QewSJ9N28ZekYo8B-3r0VqWgeUev3X4dPAD_zKEv7exsEFH3q17A8B1elS4lhg0zSRlcDxlctR5YisiFr-8-xrTaXvuxQ224Va_pvNO-VrtGouIIiL26BWZiH_6Q2Q5hS8zwxxvc0LoJv6DTd4RqTRGulWLbp07quTPoUVVOlHKnPO-rColZ0IA-B35vKNHjrm3J8O8mRth4YdpaPPftCjvspdzawJabBsKyyaqlo2TvtUAnmTf5me-SfrIyJF9puPmpk0n53UEidgUMK_Gd69R1037nJOwNqLKdDndiLf4krBeB2WMAZTEJ08"}
{"id":20,"token":"eyJ0eXAiOiJKV1QiLCJhbGciOiJSUzI1NiJ9.eyJhdWQiOiIxIiwianRpIjoiM2Y3ZTc4NDY4N2Y5YmFkMWExMGE2NmZiZjBlNGQ5NTZlNGViNGRkOTcxMDM4YTNmNzI2ZjU2ZGFkYTQ4MGY1Y2EzZjhjMjg1ZjU5Nzk2MGIiLCJpYXQiOjE1Nzc2OTkwMjksIm5iZiI6MTU3NzY5OTAyOSwiZXhwIjoxNjA5MzIxNDI5LCJzdWIiOiIyMCIsInNjb3BlcyI6W119.O_g3ohGofNhvFlChSr8DfVo_OjriBswUvhgAV6bWCNZHpaRSYXOfvO2v068v4Lw6yYVFT8vidu_VPWoxwvdPf2tNm_YhbKCFtyMdSDIPkOurE5WTG4jP23jpnlWT9Tgxa_XmG7czqTYeM-kQHOg2sXzIC6N08CLYWjLVjn6EqPjiW1mEKONrtQaAv_Avdyxe2Ejt1MMnX820a-RzPOEmr17WzwsUc7xMc3T3wxhaZ1JQU49BdAmdna0EUL0z7Psu49G_b_mPZafQPbzZCPCITYz2g4wDSeKHJ1AF01aIdzCwWKTOOMtmhARYmx49kVZhybS0QsrFKyQgMHGftOYm0seelOw7bEy8k92W08PrS3_VIF3kGafPMQgpH9xKOb2NsHesDPpNd3oBYebavR-TSKK1iagrbWnF-u7byRmHkTml4G4warOxJElGKeaJomXd4Ukgz52wbbXws392AToYrkp2JNrgPO7_p6vsntbxDuJ5fqyGsaxJ-8XEOXBx3d4uhDLjwbBxAA39Lt2b4cGPZS_6PAI87SvRIL1au5TRqBGyOBSLOzt_NuHFQYF1whqC6J87FaXMYzefhln8cem2ffi127Lza_cowGj5cDjOB62wysn9g1-1k212buzRiFxM4lqJ6vsxoreogztnRzkcaoeHE5u0XfZKhE5ddyNy010"}
{"id":21,"token":"eyJ0eXAiOiJKV1QiLCJhbGciOiJSUzI1NiJ9.eyJhdWQiOiIxIiwianRpIjoiYzIzM2FmNTNiZjI2ZWQ3YTM0ZmY0MTA0ZWZlODIyNjgzY2IyOWIzZDA5YjFkNzRhOGZkMjU0YTM3Y2EwZjNjZThlODYzYzNkODUxM2I1ZjUiLCJpYXQiOjE1Nzc2OTkwNTIsIm5iZiI6MTU3NzY5OTA1MiwiZXhwIjoxNjA5MzIxNDUyLCJzdWIiOiIyMSIsInNjb3BlcyI6W119.RcEDT4Li49Ms7nG2lZaDzdj7Fu5EwG54LrRMCOsaokkQry0dKr8eLhjhrQ0DSx24kD-ZWZLhlMaJKm0lddBar7_Be2M2TZpsXaCgfocISvUJuygJoW7LQvRU-MsbIBnT7eQ4pr1XlDjWzafMcKz4nfYHuzRSg8FTV63XO-5nib5MjkzLwP1F5RVvotQS343yA4HwCJDklpVve3GTlk5vTwhbDL-nPhpjZEbi1Aify_nRYAXpT-rCGCa_JRuvXxziW-MqlpRXLtq7tmutorZOAV8DDu4FXMMSq4edHXf0z_OIOXG2kyP3I-HO0B0YzcczyDGzOEaqzqA7sHPX4aqs0mpHlPGd_IZIlf8hGD_GmH-bvm_3cqeZDpQPVYjHw53xp0oIdqTmKIWjxvk4zXuXFfMegNhfvaktqds20eD1Rco-OAW-GFyC46VyvsX4Di0bl55jtE4kJlMephB50OYuFzjkoopdmG0kDWUAaigOKAHrzf8K09ytj_0A39wG_S4pAFYK5K312qkyZIgDEaQXIQqSZp__rBqAOdqR97cULC3ktpwmiio5MRbNLS1gW5SVzjquurromsr7rgdncH1SgtQ-PEE867X5OtvpEqfG_Jo_skXyb-pIEDqh8TSmID2Us_MaRsetiF8OjyYfDFpCxmGiN7BkB_47myJcUMk021w"}
{"id":22,"token":"eyJ0eXAiOiJKV1QiLCJhbGciOiJSUzI1NiJ9.eyJhdWQiOiIxIiwianRpIjoiYjBiM2I2NmM0MjQ5MzY0YTUwNGVlZDIxZDQ3OGFlODNlNTBmM2VlMWE5YTdkMGMyZDlmY2VkMDBhNjNkMjgwZTRhODRkOWMzMjBmZjUzNmMiLCJpYXQiOjE1Nzc2OTkyODIsIm5iZiI6MTU3NzY5OTI4MiwiZXhwIjoxNjA5MzIxNjgyLCJzdWIiOiIyMiIsInNjb3BlcyI6W119.CLQjuNKZvT04BNHKkk6rsWYe3-jm5lseSPHyNR3whXtv_yjXUMKJZu-W5-gfx46LOmKhZUBXmqTlHvPxynlBzF2ZVvvh8CpwWWCbsOg2zkL6ggT6gd9wfPseKLJqWkhaDBHhBjJcEA3LIw3TM8cBEk18N1kVzsTMmeZ9OkGHC1WaUGD83vG6_OLrSnjKeuz9ooYb36WftBkdMzNmUIs6vEVxzWSf6bh387kvkW_00x5OPcTChMYnLqT10ATo6p8FTBNCgoK2FGvsZsBCRiUoIJHgxEU9TEPxqRnNPg5X2NMeoxt-q-rOLuyIpy005PO-UwlsSGgUwrufeer1rIT3214OwTD8W550NMYduPJFT-QDdFe78iIxlS9JeGxrhwa_ycw9d_zzRGKOAaS1s8tlDJwTTXqFfA7hsnmWGdVgxB2EwbINQwqXDfUFdvp3ntx0WlRjpz5ydrMyAOCCOvyKXSFoGoQR3v4j-MdEvxHdEp0VqmE-dSFv8jhj-9TjlCtCF-KH7it-ZZ80kY4hqI5pPwZn52r3fBBy8ip4WToJl_PaQasmm2cePgAZ-NpykZ_1kPPVNWa6z7XBRQVzyEp7h-s1O831yPtMvfo7hzbDRaKHbf9oZAmRWmylkAdjTVTS3kqbTC_8R5cE_hpfbENI6h9FUUtm8i9jEo5p5nCstIA"}
{"id":23,"token":"eyJ0eXAiOiJKV1QiLCJhbGciOiJSUzI1NiJ9.eyJhdWQiOiIxIiwianRpIjoiNTcxYzE2ZTI2MmVjZmQ3Y2NiNTEyMTRhZTc2YTNmOTUxMzc5NmZmNDgxNTBjOTZjNjVlNmY5NjdlMDMwYWRjNjAxZmVlYmY0NWMwM2E4NDAiLCJpYXQiOjE1Nzc3MDEzMzIsIm5iZiI6MTU3NzcwMTMzMiwiZXhwIjoxNjA5MzIzNzMyLCJzdWIiOiIyMyIsInNjb3BlcyI6W119.F2A_g4a0sxdsBwp7opty7ZRhydNj6-JE1pI9R-BE_qpCCPv2uKmI7iuTTFPT6pjUZSt_NB3ldcgpgJ3Q7iqRFXivmDgZfuJUecFZnFlk8FkN04y73or4Owvxv_54-jSK0qbjNDPORQP9RrLE7xgdu5PnzXfKOQkfZy4muUnqBr-M4Am-eIG9cpewMybR74trOksgwl8HkRdRzlW2whrj229Gan4c96m8wum5m0BwXHrf3463pbp8HWRaGWirJDAZkxX_YzrUaFn89iVB0bPYQIUx8xBfZkA42gcAU24RiR9uJitc6kw39M72Up0RsZHRJcDwDbq_bqIp5QUE_c_XPwQ1-vTpaSpsfmPdrUbdzYoBIlYZsvN4bkRdC8QMEMi1YT6MK4B1rjkB0KZC4ttwVgjXpPfZbeCdKqPOx11qS0NUOooZhxnOTFKLkB7la7VptVktVQlfLetEurKFboSbKhkv97qWto08BNn7MIzSBIoLIMfqqilkmGvdu50pIbmJP759YTUnWIg7vJbjUyIjwybLHgY4ImJhJMW5jx3toR9CvYZEhgK_vs_IZQGaNMDcbfod8l83vBRp7jJyixs6vbu0fOXndw4T4AzlKB1UFPm2d2DqAwZvJVLGS2UrGMSLnAPWnczQY9qseC4i_su8yV7IKJhEdcjIWOFmwMEuKqA"}
{"id":27,"token":"eyJ0eXAiOiJKV1QiLCJhbGciOiJSUzI1NiJ9.eyJhdWQiOiI1IiwianRpIjoiNDUwOTcyYzkwYzEwZjcxYmM4MjgxOWI5NzVhZWJhZGIzMGY5OGRjZmFjYTcwNzhiYzg4YWY0ZTEyYTc5MDE3OGUwMGQxNjFkMDYxZGJhYTEiLCJpYXQiOjE1Nzc3MTQ4MDUsIm5iZiI6MTU3NzcxNDgwNSwiZXhwIjoxNjA5MzM3MjA1LCJzdWIiOiIyNyIsInNjb3BlcyI6W119.coH1lN60U3bRKHgFQGaxWorFsz-YevlyRY_kyULAxxgjGhzp8FzZAPzx-HrDqWktrVUVpohUIWMu_bfrQOuwDiORINCqW0XRrRL4G24u2Vsn92eNy-RUAQZ2UuHBjDjUFlpAfVd0cERDgLW59bToAiW-X1cr54DgOKe-JGbLia6Hxc0xpVuxxtEJhPmHBDuDCvzTm-59hyf9rwv9nmbEzbKk4Gc6qKMy0copx28LX4xzyUQTcNCkSQUmbBdzMeVwDTN1M-lLOj_pVPQ9LIKi-pohFBSedL1ZQejrs_JMotC9nUCg8_xeAu0HSUrFa0jP9pjLhIv22Srm7-mKIk-p1l106awuvAersAmR_PN7Ce7GFNmtGqbdAy77EPuviFQJ00Cjol5smxqkHmC4LpSh2V8FSzV48j96SaNphwJweQxDHwKefm1v9R7NkQ-mLgOSsXqngzUgmdfvONE7-pAWybB-023eF9thrcfv5ewn7E6HRc-1Spps0NknzAnSw_0104VJRjBB_moO-pac_w-yMMej7-o-iwVTBzyXFniV9W6GdM0EqTrrnvPS93tquvGuvYvkZ38qwMALBV9TQF5KHYzGwrmK04YdR6WybBZM9Fvm8Upa2VEqVi6MXt0iG8d4Ic8QzhsG4unVfFZm3dZmjvXZ3NGf-t6oXifrOQ6YbAQ"}
