UPDATE viajes SET vi_st = -12, vi_obs = 'Sin origen en Geoc 334 - PTO ANGAMOS', vi_regi_id_ori = 605587107, vi_regi_id_dest = 606502125 WHERE vi_id = 28094
UPDATE viajes SET vi_st = -12, vi_obs = 'Sin origen en Geoc 237 - MEJILLONES', vi_regi_id_ori = 605434312, vi_regi_id_dest = 606514036 WHERE vi_id = 27982
UPDATE viajes SET vi_st = -12, vi_obs = 'Sin origen en Geoc 245 - DSAL', vi_regi_id_ori = 605515701, vi_regi_id_dest = 606514209 WHERE vi_id = 28034
UPDATE viajes SET vi_st = -12, vi_obs = 'Sin origen en Geoc 245 - DSAL', vi_regi_id_ori = 605306325, vi_regi_id_dest = 605870490 WHERE vi_id = 28065
