C:\Users\formation\Desktop\Workspace\PremierJPA\src\main\java\fr\afcepf\ai107\jpa\program\TestCRUD.java
C:\Users\formation\Desktop\Workspace\PremierJPA\src\main\java\fr\afcepf\ai107\jpa\program\TestRequete.java
C:\Users\formation\Desktop\Workspace\PremierJPA\src\main\java\fr\afcepf\ai107\jpa\entity\Toy.java
C:\Users\formation\Desktop\Workspace\PremierJPA\src\main\java\fr\afcepf\ai107\jpa\program\TestFetch.java
C:\Users\formation\Desktop\Workspace\PremierJPA\src\main\java\fr\afcepf\ai107\jpa\entity\Cat.java
C:\Users\formation\Desktop\Workspace\PremierJPA\src\main\java\fr\afcepf\ai107\jpa\program\TestToy.java
C:\Users\formation\Desktop\Workspace\PremierJPA\src\main\java\fr\afcepf\ai107\jpa\program\TestCascade.java
C:\Users\formation\Desktop\Workspace\PremierJPA\src\main\java\fr\afcepf\ai107\jpa\entity\User.java
