<svg width="33" height="29" viewBox="0 0 33 29" fill="none" xmlns="http://www.w3.org/2000/svg">
<path d="M0 0.356201H32V18.2088C32 20.4412 30.1903 22.2509 27.9579 22.2509H0.336842V3.05094" stroke="#171321" stroke-width="0.673684" stroke-miterlimit="10"/>
<path d="M12.126 22.251V27.9773" stroke="#171321" stroke-width="0.673684" stroke-miterlimit="10"/>
<path d="M20.2109 22.251V27.9773" stroke="#171321" stroke-width="0.673684" stroke-miterlimit="10"/>
<path d="M8.4209 27.9773H23.9156" stroke="#171321" stroke-width="0.673684" stroke-miterlimit="10"/>
<path d="M21.8951 5.74573H10.7793V16.8615H21.8951V5.74573Z" stroke="#171321" stroke-width="0.673684" stroke-miterlimit="10"/>
<path d="M12.8535 11.6471L14.8173 13.6109L19.6139 8.81091" stroke="#171321" stroke-width="0.673684" stroke-miterlimit="10"/>
</svg>
