<svg width="24" height="25" viewBox="0 0 24 25" fill="none" xmlns="http://www.w3.org/2000/svg">
<g clip-path="url(#clip0_442_1193)">
<path d="M6.25242 9.02148L15.7524 18.5215L0.794922 24.479L0.294922 23.979L5.64742 10.5365" stroke="#171321" stroke-width="0.5" stroke-miterlimit="10"/>
<path d="M11.7524 9.77148C11.7524 9.77148 15.9024 5.75648 11.0024 1.02148" stroke="#171321" stroke-width="0.5" stroke-miterlimit="10"/>
<path d="M15.7524 14.5214C15.7524 14.5214 19.1724 11.0864 22.7524 14.7714" stroke="#171321" stroke-width="0.5" stroke-miterlimit="10"/>
<path d="M7.75244 3.64648V5.89648" stroke="#171321" stroke-width="0.5" stroke-miterlimit="10"/>
<path d="M8.87744 4.77148H6.62744" stroke="#171321" stroke-width="0.5" stroke-miterlimit="10"/>
<path d="M20.5024 16.5215V18.5215" stroke="#171321" stroke-width="0.5" stroke-miterlimit="10"/>
<path d="M21.5024 17.5215H19.5024" stroke="#171321" stroke-width="0.5" stroke-miterlimit="10"/>
<path d="M19.5024 0.773926V3.77393" stroke="#171321" stroke-width="0.5" stroke-miterlimit="10"/>
<path d="M21.0024 2.27393H18.0024" stroke="#171321" stroke-width="0.5" stroke-miterlimit="10"/>
<path d="M16.7524 9.02148L17.4149 8.35898C18.2724 7.50148 19.4324 7.02148 20.6424 7.02148H21.4999" stroke="#171321" stroke-width="0.5" stroke-miterlimit="10"/>
<path d="M3.25244 16.3613L4.75244 22.7713" stroke="#171321" stroke-width="0.5" stroke-miterlimit="10"/>
<path d="M8.05469 10.7715L9.87219 19.5665" stroke="#171321" stroke-width="0.5" stroke-miterlimit="10"/>
</g>
<defs>
<clipPath id="clip0_442_1193">
<rect width="24" height="24" fill="white" transform="translate(0 0.773926)"/>
</clipPath>
</defs>
</svg>
