\relax 
\@writefile{lof}{\contentsline {figure}{\numberline {1}{\ignorespaces Given input image\relax }}{2}\protected@file@percent }
\providecommand*\caption@xref[2]{\@setref\relax\@undefined{#1}}
\newlabel{fig:input}{{1}{2}}
\@writefile{lof}{\contentsline {figure}{\numberline {2}{\ignorespaces Output for the following parameters:  $\sigma _1 = 0.7$, $\sigma _2=1.5$, $\alpha =0.0005$, $\gamma =0.0001$, $\tau =5$, end time = 100\relax }}{2}\protected@file@percent }
\newlabel{fig:output}{{2}{2}}
\@writefile{lof}{\contentsline {figure}{\numberline {3}{\ignorespaces Used input image for parameter tests\relax }}{3}\protected@file@percent }
\newlabel{fig:input_handy}{{3}{3}}
\newlabel{fig:output_gamma_0.0001}{{4a}{4}}
\newlabel{sub@fig:output_gamma_0.0001}{{a}{4}}
\newlabel{fig:output_gamma_0.001}{{4b}{4}}
\newlabel{sub@fig:output_gamma_0.001}{{b}{4}}
\newlabel{fig:output_gamma_0.01}{{4c}{4}}
\newlabel{sub@fig:output_gamma_0.01}{{c}{4}}
\newlabel{fig:output_gamma_0.1}{{4d}{4}}
\newlabel{sub@fig:output_gamma_0.1}{{d}{4}}
\@writefile{lof}{\contentsline {figure}{\numberline {4}{\ignorespaces Output for varying $\gamma $ with $\alpha =0.0005$\relax }}{4}\protected@file@percent }
\newlabel{fig:output_varying_gamma}{{4}{4}}
\newlabel{fig:output_alpha_0.0005}{{5a}{5}}
\newlabel{sub@fig:output_alpha_0.0005}{{a}{5}}
\newlabel{fig:output_alpha_0.005}{{5b}{5}}
\newlabel{sub@fig:output_alpha_0.005}{{b}{5}}
\newlabel{fig:output_alpha_0.05}{{5c}{5}}
\newlabel{sub@fig:output_alpha_0.05}{{c}{5}}
\newlabel{fig:output_alpha_0.5}{{5d}{5}}
\newlabel{sub@fig:output_alpha_0.5}{{d}{5}}
\@writefile{lof}{\contentsline {figure}{\numberline {5}{\ignorespaces Output for varying $\alpha $ with $\gamma =0.0001$\relax }}{5}\protected@file@percent }
\newlabel{fig:output_varying_alpha}{{5}{5}}
