\relax 
\@writefile{lof}{\contentsline {figure}{\numberline {1}{\ignorespaces Comparison of true KDE and K-Means approximation with marginalized first dimension for different bandwidths\relax }}{4}\protected@file@percent }
\providecommand*\caption@xref[2]{\@setref\relax\@undefined{#1}}
\newlabel{fig:6.3.1:1}{{1}{4}}
\@writefile{lof}{\contentsline {figure}{\numberline {2}{\ignorespaces Comparison of true KDE and K-Means approximation for each marginalized dimension\relax }}{5}\protected@file@percent }
\newlabel{fig:6.3.1:2}{{2}{5}}
\@writefile{lof}{\contentsline {figure}{\numberline {3}{\ignorespaces Approximation, Reference and Noisy Image at different iterations\relax }}{6}\protected@file@percent }
\newlabel{fig:6.3.2:1}{{3}{6}}
\@writefile{lof}{\contentsline {figure}{\numberline {4}{\ignorespaces PSNR over iterations\relax }}{7}\protected@file@percent }
\newlabel{fig:6.3.2:2}{{4}{7}}
\@writefile{lof}{\contentsline {figure}{\numberline {5}{\ignorespaces Trajectories of patches in DCT space before/after averaging over iterations\relax }}{8}\protected@file@percent }
\newlabel{fig:6.3.2:3}{{5}{8}}
