\relax 
\@writefile{lof}{\contentsline {figure}{\numberline {1}{\ignorespaces Input, reference, and resulting images for Task 3.1\relax }}{1}}
\providecommand*\caption@xref[2]{\@setref\relax\@undefined{#1}}
\newlabel{fig:3.1}{{1}{1}}
\@writefile{lof}{\contentsline {figure}{\numberline {2}{\ignorespaces Resulting output of the dehazing algorithm from task 3.2\relax }}{3}}
\newlabel{fig:3.2}{{2}{3}}
\@writefile{lof}{\contentsline {figure}{\numberline {3}{\ignorespaces Estimated (a) and refined (b) transmission map for task 3.2\relax }}{4}}
\newlabel{fig:3.2.1}{{3}{4}}
\@writefile{lof}{\contentsline {figure}{\numberline {4}{\ignorespaces Result of the dehazing without refining of the transmission map, Task 3.2\relax }}{5}}
\newlabel{fig:3.2.2}{{4}{5}}
\@writefile{lof}{\contentsline {figure}{\numberline {5}{\ignorespaces Input images for Task 3.3\relax }}{6}}
\newlabel{fig:3.3}{{5}{6}}
\@writefile{lof}{\contentsline {figure}{\numberline {6}{\ignorespaces Resulting images with their respective parameters for Task 3.3\relax }}{7}}
\newlabel{fig:3.3.1}{{6}{7}}
\newlabel{eqn:detail}{{1}{8}}
\@writefile{lof}{\contentsline {figure}{\numberline {7}{\ignorespaces Input and resulting images with $r = 4$ and $\epsilon = 0.04$\relax }}{9}}
\newlabel{fig:3.4}{{7}{9}}
\@writefile{lof}{\contentsline {figure}{\numberline {8}{\ignorespaces Input and resulting images with $r = 8$ and $\epsilon = 0.01$\relax }}{10}}
\newlabel{fig:3.5}{{8}{10}}
\@writefile{lof}{\contentsline {figure}{\numberline {9}{\ignorespaces Results of the detail enhancement on a smartphone image\relax }}{11}}
\newlabel{fig:3.6}{{9}{11}}
