=====
#To get the current configuration
git config --list
=====
#Ssh key and then add this get to your git-lab profile
ssh-keygen
.ssh key
C:\Users\Abdullah\.ssh

=====
#If not initialized
git init 
git add -u :/
git commit -m "your commit message"
git push -u origin master

=====
#In case pushing a clone to ur repo, you need to make sure that the folder .git is not present in that repo - remove it
=====
git clone <URL>
=====
git status
git add . #Whole directory
git add <Folder name>
git commit -a
=====
