M48
; DRILL file {KiCad 8.0.7} date 2024-12-20T16:02:51+1300
; FORMAT={-:-/ absolute / metric / decimal}
; #@! TF.CreationDate,2024-12-20T16:02:51+13:00
; #@! TF.GenerationSoftware,Kicad,Pcbnew,8.0.7
; #@! TF.FileFunction,Plated,1,4,PTH
FMAT,2
METRIC
; #@! TA.AperFunction,Plated,PTH,ViaDrill
T1C0.400
; #@! TA.AperFunction,Plated,PTH,ComponentDrill
T2C1.000
; #@! TA.AperFunction,Plated,PTH,ComponentDrill
T3C3.500
%
G90
G05
T1
X90.0Y-70.5
X90.5Y-74.0
X90.5Y-75.0
X90.5Y-76.0
X90.5Y-80.0
X90.5Y-81.0
X90.5Y-82.0
X90.5Y-83.0
X90.5Y-84.0
X90.5Y-85.0
X90.5Y-86.0
X90.5Y-87.0
X91.0Y-70.5
X92.0Y-70.5
X92.0Y-96.5
X93.0Y-70.5
X93.0Y-74.0
X93.0Y-96.5
X94.0Y-70.5
X94.0Y-96.5
X95.0Y-96.5
X96.0Y-96.5
X96.15Y-94.5
X96.5Y-75.0
X96.5Y-76.0
X97.0Y-96.5
X98.0Y-96.5
X98.798Y-85.368
X99.0Y-96.5
X99.54Y-86.11
X100.0Y-96.5
X101.0Y-96.5
X103.6Y-93.5
X104.0Y-96.5
X104.19Y-71.419
X105.0Y-96.5
X107.0Y-70.5
X107.258Y-92.742
X108.0Y-70.5
X108.0Y-92.0
X109.0Y-70.5
X110.0Y-70.5
X110.0Y-74.0
T2
X109.7Y-76.0
X109.7Y-78.54
X109.7Y-81.08
X109.7Y-83.62
X109.7Y-86.16
T3
X100.0Y-70.0
M30
