G04 #@! TF.GenerationSoftware,KiCad,Pcbnew,8.0.7*
G04 #@! TF.CreationDate,2024-12-20T16:02:40+13:00*
G04 #@! TF.ProjectId,M2_NEO-\u002A,4d325f4e-454f-42d2-9a2e-6b696361645f,rev?*
G04 #@! TF.SameCoordinates,Original*
G04 #@! TF.FileFunction,Copper,L1,Top*
G04 #@! TF.FilePolarity,Positive*
%FSLAX46Y46*%
G04 Gerber Fmt 4.6, Leading zero omitted, Abs format (unit mm)*
G04 Created by KiCad (PCBNEW 8.0.7) date 2024-12-20 16:02:40*
%MOMM*%
%LPD*%
G01*
G04 APERTURE LIST*
G04 Aperture macros list*
%AMRoundRect*
0 Rectangle with rounded corners*
0 $1 Rounding radius*
0 $2 $3 $4 $5 $6 $7 $8 $9 X,Y pos of 4 corners*
0 Add a 4 corners polygon primitive as box body*
4,1,4,$2,$3,$4,$5,$6,$7,$8,$9,$2,$3,0*
0 Add four circle primitives for the rounded corners*
1,1,$1+$1,$2,$3*
1,1,$1+$1,$4,$5*
1,1,$1+$1,$6,$7*
1,1,$1+$1,$8,$9*
0 Add four rect primitives between the rounded corners*
20,1,$1+$1,$2,$3,$4,$5,0*
20,1,$1+$1,$4,$5,$6,$7,0*
20,1,$1+$1,$6,$7,$8,$9,0*
20,1,$1+$1,$8,$9,$2,$3,0*%
G04 Aperture macros list end*
G04 #@! TA.AperFunction,SMDPad,CuDef*
%ADD10RoundRect,0.312500X0.312500X-0.312500X0.312500X0.312500X-0.312500X0.312500X-0.312500X-0.312500X0*%
G04 #@! TD*
G04 #@! TA.AperFunction,SMDPad,CuDef*
%ADD11RoundRect,0.250000X1.500000X-0.250000X1.500000X0.250000X-1.500000X0.250000X-1.500000X-0.250000X0*%
G04 #@! TD*
G04 #@! TA.AperFunction,SMDPad,CuDef*
%ADD12RoundRect,0.147500X-0.172500X0.147500X-0.172500X-0.147500X0.172500X-0.147500X0.172500X0.147500X0*%
G04 #@! TD*
G04 #@! TA.AperFunction,SMDPad,CuDef*
%ADD13RoundRect,0.140000X-0.170000X0.140000X-0.170000X-0.140000X0.170000X-0.140000X0.170000X0.140000X0*%
G04 #@! TD*
G04 #@! TA.AperFunction,SMDPad,CuDef*
%ADD14RoundRect,0.135000X-0.185000X0.135000X-0.185000X-0.135000X0.185000X-0.135000X0.185000X0.135000X0*%
G04 #@! TD*
G04 #@! TA.AperFunction,ComponentPad*
%ADD15R,1.700000X1.700000*%
G04 #@! TD*
G04 #@! TA.AperFunction,ComponentPad*
%ADD16O,1.700000X1.700000*%
G04 #@! TD*
G04 #@! TA.AperFunction,SMDPad,CuDef*
%ADD17RoundRect,0.135000X0.185000X-0.135000X0.185000X0.135000X-0.185000X0.135000X-0.185000X-0.135000X0*%
G04 #@! TD*
G04 #@! TA.AperFunction,SMDPad,CuDef*
%ADD18RoundRect,0.200000X-0.200000X0.700000X-0.200000X-0.700000X0.200000X-0.700000X0.200000X0.700000X0*%
G04 #@! TD*
G04 #@! TA.AperFunction,SMDPad,CuDef*
%ADD19RoundRect,0.140000X0.140000X0.170000X-0.140000X0.170000X-0.140000X-0.170000X0.140000X-0.170000X0*%
G04 #@! TD*
G04 #@! TA.AperFunction,ConnectorPad*
%ADD20R,0.350000X2.500000*%
G04 #@! TD*
G04 #@! TA.AperFunction,ComponentPad*
%ADD21C,5.500000*%
G04 #@! TD*
G04 #@! TA.AperFunction,SMDPad,CuDef*
%ADD22RoundRect,0.135000X-0.135000X-0.185000X0.135000X-0.185000X0.135000X0.185000X-0.135000X0.185000X0*%
G04 #@! TD*
G04 #@! TA.AperFunction,SMDPad,CuDef*
%ADD23RoundRect,0.147500X-0.147500X-0.172500X0.147500X-0.172500X0.147500X0.172500X-0.147500X0.172500X0*%
G04 #@! TD*
G04 #@! TA.AperFunction,SMDPad,CuDef*
%ADD24RoundRect,0.140000X0.170000X-0.140000X0.170000X0.140000X-0.170000X0.140000X-0.170000X-0.140000X0*%
G04 #@! TD*
G04 #@! TA.AperFunction,SMDPad,CuDef*
%ADD25R,1.000000X1.050000*%
G04 #@! TD*
G04 #@! TA.AperFunction,SMDPad,CuDef*
%ADD26R,1.050000X2.200000*%
G04 #@! TD*
G04 #@! TA.AperFunction,ViaPad*
%ADD27C,0.700000*%
G04 #@! TD*
G04 #@! TA.AperFunction,ViaPad*
%ADD28C,0.800000*%
G04 #@! TD*
G04 #@! TA.AperFunction,ViaPad*
%ADD29C,0.600000*%
G04 #@! TD*
G04 #@! TA.AperFunction,Conductor*
%ADD30C,0.250000*%
G04 #@! TD*
G04 #@! TA.AperFunction,Conductor*
%ADD31C,0.200000*%
G04 #@! TD*
G04 #@! TA.AperFunction,Conductor*
%ADD32C,0.360000*%
G04 #@! TD*
G04 #@! TA.AperFunction,Conductor*
%ADD33C,0.500000*%
G04 #@! TD*
G04 APERTURE END LIST*
D10*
X93800000Y-91550000D03*
D11*
X92650000Y-95250000D03*
D12*
X95300000Y-93532500D03*
X95300000Y-94502500D03*
D13*
X95130000Y-74800000D03*
X95130000Y-75760000D03*
D14*
X108030000Y-94560000D03*
X108030000Y-95580000D03*
D15*
X109700000Y-86160000D03*
D16*
X109700000Y-83620000D03*
X109700000Y-81080000D03*
X109700000Y-78540000D03*
X109700000Y-76000000D03*
D17*
X95300000Y-92290000D03*
X95300000Y-91270000D03*
D14*
X94000000Y-74800000D03*
X94000000Y-75820000D03*
D18*
X104700000Y-77470000D03*
X103600000Y-77470000D03*
X102500000Y-77470000D03*
X101400000Y-77470000D03*
X100300000Y-77470000D03*
X99200000Y-77470000D03*
X98100000Y-77470000D03*
X95100000Y-77470000D03*
X94000000Y-77470000D03*
X92900000Y-77470000D03*
X91800000Y-77470000D03*
X90700000Y-77470000D03*
X90700000Y-89470000D03*
X91800000Y-89470000D03*
X92900000Y-89470000D03*
X94000000Y-89470000D03*
X95100000Y-89470000D03*
X98100000Y-89470000D03*
X99200000Y-89470000D03*
X100300000Y-89470000D03*
X101400000Y-89470000D03*
X102500000Y-89470000D03*
X103600000Y-89470000D03*
X104700000Y-89470000D03*
D19*
X104560000Y-91300000D03*
X103600000Y-91300000D03*
D20*
X109250000Y-98750000D03*
X108750000Y-98750000D03*
X108250000Y-98750000D03*
X107750000Y-98750000D03*
X105250000Y-98750000D03*
X104750000Y-98750000D03*
X104250000Y-98750000D03*
X103750000Y-98750000D03*
X101250000Y-98750000D03*
X100750000Y-98750000D03*
X100250000Y-98750000D03*
X99750000Y-98750000D03*
X99250000Y-98750000D03*
X98750000Y-98750000D03*
X98250000Y-98750000D03*
X97750000Y-98750000D03*
X97250000Y-98750000D03*
X96750000Y-98750000D03*
X96250000Y-98750000D03*
X95750000Y-98750000D03*
X95250000Y-98750000D03*
X94750000Y-98750000D03*
X94250000Y-98750000D03*
X93750000Y-98750000D03*
X93250000Y-98750000D03*
X92750000Y-98750000D03*
X92250000Y-98750000D03*
X91750000Y-98750000D03*
X91250000Y-98750000D03*
X90750000Y-98750000D03*
D21*
X100000000Y-70000000D03*
D14*
X108970000Y-94560000D03*
X108970000Y-95580000D03*
D22*
X105090000Y-74800000D03*
X106110000Y-74800000D03*
D23*
X91805000Y-75070000D03*
X92775000Y-75070000D03*
D24*
X102500000Y-92230000D03*
X102500000Y-91270000D03*
D19*
X104560000Y-92420000D03*
X103600000Y-92420000D03*
D23*
X104115000Y-70500000D03*
X105085000Y-70500000D03*
D25*
X108200000Y-73630000D03*
D26*
X106725000Y-72105000D03*
X109675000Y-72105000D03*
D25*
X91800000Y-73630000D03*
D26*
X90325000Y-72105000D03*
X93275000Y-72105000D03*
D27*
X96150000Y-94500000D03*
D28*
X103600000Y-93500000D03*
D29*
X100000000Y-96500000D03*
X90500000Y-81000000D03*
X90500000Y-85000000D03*
X92000000Y-70500000D03*
X90500000Y-83000000D03*
X93000000Y-70500000D03*
X101000000Y-96500000D03*
X110000000Y-70500000D03*
X95000000Y-96500000D03*
X96500000Y-75000000D03*
X97000000Y-96500000D03*
X109000000Y-70500000D03*
X90500000Y-76000000D03*
X90500000Y-84000000D03*
X91000000Y-70500000D03*
X94000000Y-96500000D03*
X96000000Y-96500000D03*
X90500000Y-86000000D03*
X92000000Y-96500000D03*
X99000000Y-96500000D03*
X108000000Y-70500000D03*
X105000000Y-96500000D03*
X96500000Y-76000000D03*
X94000000Y-70500000D03*
X107000000Y-70500000D03*
X90500000Y-74000000D03*
X90500000Y-82000000D03*
X110000000Y-74000000D03*
X93000000Y-96500000D03*
X98000000Y-96500000D03*
X90500000Y-75000000D03*
X93000000Y-74000000D03*
X90500000Y-87000000D03*
X90500000Y-80000000D03*
X90000000Y-70500000D03*
X104000000Y-96500000D03*
D28*
X107257536Y-92742464D03*
X99540000Y-86110000D03*
X108000000Y-92000000D03*
X98797536Y-85367536D03*
D27*
X104190031Y-71419102D03*
D30*
X108590000Y-76000000D02*
X108200000Y-75610000D01*
X106110000Y-75610000D02*
X103010000Y-75610000D01*
X109700000Y-76000000D02*
X108590000Y-76000000D01*
X103010000Y-75610000D02*
X102500000Y-76120000D01*
X102500000Y-76120000D02*
X102500000Y-77470000D01*
X108200000Y-73630000D02*
X108200000Y-75610000D01*
X108200000Y-75610000D02*
X106110000Y-75610000D01*
X106110000Y-74800000D02*
X106110000Y-75610000D01*
X95300000Y-92290000D02*
X95300000Y-93532500D01*
D31*
X108274999Y-95824999D02*
X108030000Y-95580000D01*
X108250000Y-96874999D02*
X108275000Y-96849999D01*
X108275000Y-96849999D02*
X108274999Y-95824999D01*
X108250000Y-98750000D02*
X108250000Y-96874999D01*
X108725001Y-95824999D02*
X108970000Y-95580000D01*
X108725000Y-96849999D02*
X108725001Y-95824999D01*
X108750000Y-96874999D02*
X108725000Y-96849999D01*
X108750000Y-98750000D02*
X108750000Y-96874999D01*
D32*
X94000000Y-75820000D02*
X94000000Y-77470000D01*
X91800000Y-73630000D02*
X91800000Y-77670000D01*
D30*
X94080000Y-91270000D02*
X93800000Y-91550000D01*
X102500000Y-91270000D02*
X95300000Y-91270000D01*
X102500000Y-89470000D02*
X102500000Y-91270000D01*
X95300000Y-91270000D02*
X94080000Y-91270000D01*
D33*
X107080000Y-83620000D02*
X109700000Y-83620000D01*
X103600000Y-89470000D02*
X103600000Y-92420000D01*
X103600000Y-89470000D02*
X103600000Y-87100000D01*
D30*
X96150000Y-94500000D02*
X95302500Y-94500000D01*
D33*
X103600000Y-87100000D02*
X107080000Y-83620000D01*
D30*
X95302500Y-94500000D02*
X95300000Y-94502500D01*
D33*
X103600000Y-92420000D02*
X103600000Y-93500000D01*
D31*
X99540000Y-85685735D02*
X99540000Y-86110000D01*
X100275001Y-81815001D02*
X100429583Y-81815001D01*
X100429583Y-82415001D02*
X100275001Y-82415001D01*
X100300000Y-77470000D02*
X99975001Y-77794999D01*
X99975001Y-85250734D02*
X99540000Y-85685735D01*
X108274999Y-94315001D02*
X108274999Y-93335662D01*
X99975001Y-82765001D02*
X99975001Y-85250734D01*
X108274999Y-93335662D02*
X107681801Y-92742464D01*
X107681801Y-92742464D02*
X107257536Y-92742464D01*
X99975001Y-77794999D02*
X99975001Y-81515001D01*
X99975001Y-82715001D02*
X99975001Y-82765001D01*
X108030000Y-94560000D02*
X108274999Y-94315001D01*
X100429583Y-81815001D02*
G75*
G02*
X100729599Y-82115001I17J-299999D01*
G01*
X100275001Y-82415001D02*
G75*
G03*
X99975001Y-82715001I-1J-299999D01*
G01*
X99975001Y-81515001D02*
G75*
G03*
X100275001Y-81814999I299999J1D01*
G01*
X100729583Y-82115001D02*
G75*
G02*
X100429583Y-82414983I-299983J1D01*
G01*
X99200000Y-77470000D02*
X99524999Y-77794999D01*
X108970000Y-94560000D02*
X108725001Y-94315001D01*
X99524999Y-85064338D02*
X99221801Y-85367536D01*
X108725001Y-94315001D02*
X108725001Y-93149266D01*
X99524999Y-77794999D02*
X99524999Y-85064338D01*
X99221801Y-85367536D02*
X98797536Y-85367536D01*
X108000000Y-92424265D02*
X108000000Y-92000000D01*
X108725001Y-93149266D02*
X108000000Y-92424265D01*
D30*
X105085000Y-70500000D02*
X105085000Y-74795000D01*
X105085000Y-74795000D02*
X105090000Y-74800000D01*
X101400000Y-89470000D02*
X101400000Y-87600000D01*
X107920000Y-81080000D02*
X109700000Y-81080000D01*
X101400000Y-87600000D02*
X107920000Y-81080000D01*
X100300000Y-89470000D02*
X100300000Y-87940000D01*
X100300000Y-87940000D02*
X109700000Y-78540000D01*
D32*
X93500000Y-74800000D02*
X95130000Y-74800000D01*
X92775000Y-75070000D02*
X93230000Y-75070000D01*
X93230000Y-75070000D02*
X93500000Y-74800000D01*
D30*
X104190031Y-70575031D02*
X104115000Y-70500000D01*
X104190031Y-71419102D02*
X104190031Y-70575031D01*
G04 #@! TA.AperFunction,Conductor*
G36*
X103719205Y-70014352D02*
G01*
X103733557Y-70049000D01*
X103719205Y-70083648D01*
X103680365Y-70122487D01*
X103680363Y-70122491D01*
X103629356Y-70226826D01*
X103629355Y-70226828D01*
X103619500Y-70294470D01*
X103619500Y-70705529D01*
X103629355Y-70773171D01*
X103629356Y-70773173D01*
X103654859Y-70825340D01*
X103680364Y-70877511D01*
X103762489Y-70959636D01*
X103762492Y-70959637D01*
X103762493Y-70959638D01*
X103771354Y-70963970D01*
X103796179Y-70992080D01*
X103793855Y-71029511D01*
X103788708Y-71037820D01*
X103709170Y-71141476D01*
X103709167Y-71141481D01*
X103653700Y-71275393D01*
X103634781Y-71419102D01*
X103653700Y-71562810D01*
X103709167Y-71696722D01*
X103709170Y-71696727D01*
X103726416Y-71719203D01*
X103797410Y-71811723D01*
X103912406Y-71899963D01*
X103912408Y-71899963D01*
X103912410Y-71899965D01*
X104046322Y-71955432D01*
X104190031Y-71974352D01*
X104333740Y-71955432D01*
X104467656Y-71899963D01*
X104582652Y-71811723D01*
X104670892Y-71696727D01*
X104670892Y-71696726D01*
X104671626Y-71695770D01*
X104704104Y-71677018D01*
X104740329Y-71686725D01*
X104759081Y-71719203D01*
X104759500Y-71725599D01*
X104759500Y-74315734D01*
X104745148Y-74350382D01*
X104675936Y-74419593D01*
X104675935Y-74419595D01*
X104625933Y-74526824D01*
X104625932Y-74526825D01*
X104625932Y-74526827D01*
X104622167Y-74555430D01*
X104619500Y-74575687D01*
X104619500Y-75024312D01*
X104619499Y-75024312D01*
X104625932Y-75073174D01*
X104625933Y-75073175D01*
X104675935Y-75180404D01*
X104675936Y-75180406D01*
X104696382Y-75200852D01*
X104710734Y-75235500D01*
X104696382Y-75270148D01*
X104661734Y-75284500D01*
X102967144Y-75284500D01*
X102884362Y-75306681D01*
X102884359Y-75306682D01*
X102810137Y-75349535D01*
X102810137Y-75349536D01*
X102239536Y-75920137D01*
X102239535Y-75920137D01*
X102196682Y-75994359D01*
X102195013Y-76000591D01*
X102195012Y-76000590D01*
X102195012Y-76000594D01*
X102174500Y-76077144D01*
X102174500Y-76354426D01*
X102160148Y-76389074D01*
X102147746Y-76398085D01*
X102061660Y-76441948D01*
X102061654Y-76441953D01*
X101984648Y-76518960D01*
X101950000Y-76533312D01*
X101915352Y-76518960D01*
X101838342Y-76441950D01*
X101838335Y-76441945D01*
X101725308Y-76384355D01*
X101725305Y-76384354D01*
X101725304Y-76384354D01*
X101631519Y-76369500D01*
X101631517Y-76369500D01*
X101168482Y-76369500D01*
X101074696Y-76384353D01*
X100961664Y-76441945D01*
X100961657Y-76441950D01*
X100884648Y-76518960D01*
X100850000Y-76533312D01*
X100815352Y-76518960D01*
X100738342Y-76441950D01*
X100738335Y-76441945D01*
X100625308Y-76384355D01*
X100625305Y-76384354D01*
X100625304Y-76384354D01*
X100531519Y-76369500D01*
X100531517Y-76369500D01*
X100068482Y-76369500D01*
X99974696Y-76384353D01*
X99861664Y-76441945D01*
X99861657Y-76441950D01*
X99784648Y-76518960D01*
X99750000Y-76533312D01*
X99715352Y-76518960D01*
X99638342Y-76441950D01*
X99638335Y-76441945D01*
X99525308Y-76384355D01*
X99525305Y-76384354D01*
X99525304Y-76384354D01*
X99431519Y-76369500D01*
X99431517Y-76369500D01*
X98968482Y-76369500D01*
X98874696Y-76384353D01*
X98761664Y-76441945D01*
X98761657Y-76441950D01*
X98684648Y-76518960D01*
X98650000Y-76533312D01*
X98615352Y-76518960D01*
X98538342Y-76441950D01*
X98538335Y-76441945D01*
X98425308Y-76384355D01*
X98425305Y-76384354D01*
X98425304Y-76384354D01*
X98331519Y-76369500D01*
X98331517Y-76369500D01*
X97868482Y-76369500D01*
X97774696Y-76384353D01*
X97661664Y-76441945D01*
X97661657Y-76441950D01*
X97571950Y-76531657D01*
X97571945Y-76531664D01*
X97514355Y-76644690D01*
X97514355Y-76644692D01*
X97499500Y-76738482D01*
X97499500Y-78201517D01*
X97514353Y-78295303D01*
X97571945Y-78408335D01*
X97571950Y-78408342D01*
X97661657Y-78498049D01*
X97661664Y-78498054D01*
X97774691Y-78555644D01*
X97774692Y-78555644D01*
X97774696Y-78555646D01*
X97868481Y-78570500D01*
X98331518Y-78570499D01*
X98425304Y-78555646D01*
X98486387Y-78524522D01*
X98538335Y-78498054D01*
X98538337Y-78498052D01*
X98538342Y-78498050D01*
X98615352Y-78421040D01*
X98650000Y-78406688D01*
X98684648Y-78421040D01*
X98761657Y-78498049D01*
X98761664Y-78498054D01*
X98874691Y-78555644D01*
X98874692Y-78555644D01*
X98874696Y-78555646D01*
X98968481Y-78570500D01*
X99175499Y-78570499D01*
X99210147Y-78584851D01*
X99224499Y-78619499D01*
X99224499Y-84838879D01*
X99210147Y-84873527D01*
X99175499Y-84887879D01*
X99145670Y-84877754D01*
X99100376Y-84842999D01*
X99100375Y-84842998D01*
X98954297Y-84782491D01*
X98797536Y-84761854D01*
X98640774Y-84782491D01*
X98494699Y-84842997D01*
X98494694Y-84843000D01*
X98369254Y-84939253D01*
X98369253Y-84939254D01*
X98273000Y-85064694D01*
X98272997Y-85064699D01*
X98212491Y-85210774D01*
X98191854Y-85367536D01*
X98212491Y-85524297D01*
X98272997Y-85670372D01*
X98273000Y-85670377D01*
X98369254Y-85795818D01*
X98494695Y-85892072D01*
X98494697Y-85892072D01*
X98494699Y-85892074D01*
X98639649Y-85952114D01*
X98640774Y-85952580D01*
X98797536Y-85973218D01*
X98891744Y-85960815D01*
X98927968Y-85970522D01*
X98946720Y-86003000D01*
X98946720Y-86015791D01*
X98934318Y-86109999D01*
X98954955Y-86266761D01*
X99015461Y-86412836D01*
X99015464Y-86412841D01*
X99111718Y-86538282D01*
X99237159Y-86634536D01*
X99237161Y-86634536D01*
X99237163Y-86634538D01*
X99383238Y-86695044D01*
X99540000Y-86715682D01*
X99696762Y-86695044D01*
X99842841Y-86634536D01*
X99968282Y-86538282D01*
X100064536Y-86412841D01*
X100125044Y-86266762D01*
X100145682Y-86110000D01*
X100125044Y-85953238D01*
X100064536Y-85807159D01*
X99994747Y-85716208D01*
X99985040Y-85679983D01*
X99998971Y-85651733D01*
X100215461Y-85435245D01*
X100255022Y-85366723D01*
X100275501Y-85290296D01*
X100275501Y-82764501D01*
X100289853Y-82729853D01*
X100324501Y-82715501D01*
X100472334Y-82715501D01*
X100472563Y-82715485D01*
X100497226Y-82715487D01*
X100629156Y-82685382D01*
X100751079Y-82626673D01*
X100856880Y-82542305D01*
X100941254Y-82436509D01*
X100999970Y-82314590D01*
X101030083Y-82182663D01*
X101030083Y-82135314D01*
X101030099Y-82135275D01*
X101030099Y-82047336D01*
X100999987Y-81915411D01*
X100999985Y-81915404D01*
X100941269Y-81793485D01*
X100941268Y-81793483D01*
X100856893Y-81687685D01*
X100751088Y-81603314D01*
X100751082Y-81603311D01*
X100629166Y-81544605D01*
X100629158Y-81544602D01*
X100520115Y-81519719D01*
X100497229Y-81514497D01*
X100497228Y-81514497D01*
X100429566Y-81514501D01*
X100324501Y-81514501D01*
X100289853Y-81500149D01*
X100275501Y-81465501D01*
X100275501Y-78619499D01*
X100289853Y-78584851D01*
X100324501Y-78570499D01*
X100531517Y-78570499D01*
X100531518Y-78570499D01*
X100625304Y-78555646D01*
X100686387Y-78524522D01*
X100738335Y-78498054D01*
X100738337Y-78498052D01*
X100738342Y-78498050D01*
X100815352Y-78421040D01*
X100850000Y-78406688D01*
X100884648Y-78421040D01*
X100961657Y-78498049D01*
X100961664Y-78498054D01*
X101074691Y-78555644D01*
X101074692Y-78555644D01*
X101074696Y-78555646D01*
X101168481Y-78570500D01*
X101631518Y-78570499D01*
X101725304Y-78555646D01*
X101786387Y-78524522D01*
X101838335Y-78498054D01*
X101838337Y-78498052D01*
X101838342Y-78498050D01*
X101915352Y-78421040D01*
X101950000Y-78406688D01*
X101984648Y-78421040D01*
X102061657Y-78498049D01*
X102061664Y-78498054D01*
X102174691Y-78555644D01*
X102174692Y-78555644D01*
X102174696Y-78555646D01*
X102268481Y-78570500D01*
X102731518Y-78570499D01*
X102825304Y-78555646D01*
X102886387Y-78524522D01*
X102938335Y-78498054D01*
X102938337Y-78498052D01*
X102938342Y-78498050D01*
X103015352Y-78421040D01*
X103050000Y-78406688D01*
X103084648Y-78421040D01*
X103161657Y-78498049D01*
X103161664Y-78498054D01*
X103274691Y-78555644D01*
X103274692Y-78555644D01*
X103274696Y-78555646D01*
X103368481Y-78570500D01*
X103831518Y-78570499D01*
X103925304Y-78555646D01*
X103986387Y-78524522D01*
X104038335Y-78498054D01*
X104038337Y-78498052D01*
X104038342Y-78498050D01*
X104115352Y-78421040D01*
X104150000Y-78406688D01*
X104184648Y-78421040D01*
X104261657Y-78498049D01*
X104261664Y-78498054D01*
X104374691Y-78555644D01*
X104374692Y-78555644D01*
X104374696Y-78555646D01*
X104468481Y-78570500D01*
X104931518Y-78570499D01*
X105025304Y-78555646D01*
X105086387Y-78524522D01*
X105138335Y-78498054D01*
X105138337Y-78498052D01*
X105138342Y-78498050D01*
X105228050Y-78408342D01*
X105228893Y-78406688D01*
X105285644Y-78295309D01*
X105285644Y-78295307D01*
X105285646Y-78295304D01*
X105300500Y-78201519D01*
X105300499Y-76738482D01*
X105285646Y-76644696D01*
X105255969Y-76586451D01*
X105228054Y-76531664D01*
X105228049Y-76531657D01*
X105138342Y-76441950D01*
X105138335Y-76441945D01*
X105025308Y-76384355D01*
X105025305Y-76384354D01*
X105025304Y-76384354D01*
X104931519Y-76369500D01*
X104931517Y-76369500D01*
X104468482Y-76369500D01*
X104374696Y-76384353D01*
X104261664Y-76441945D01*
X104261657Y-76441950D01*
X104184648Y-76518960D01*
X104150000Y-76533312D01*
X104115352Y-76518960D01*
X104038342Y-76441950D01*
X104038335Y-76441945D01*
X103925308Y-76384355D01*
X103925305Y-76384354D01*
X103925304Y-76384354D01*
X103831519Y-76369500D01*
X103831517Y-76369500D01*
X103368482Y-76369500D01*
X103274696Y-76384353D01*
X103161664Y-76441945D01*
X103161657Y-76441950D01*
X103084648Y-76518960D01*
X103050000Y-76533312D01*
X103015352Y-76518960D01*
X102938345Y-76441953D01*
X102938342Y-76441950D01*
X102938340Y-76441949D01*
X102938339Y-76441948D01*
X102852254Y-76398085D01*
X102827898Y-76369567D01*
X102825500Y-76354426D01*
X102825500Y-76275123D01*
X102839852Y-76240475D01*
X103130475Y-75949852D01*
X103165123Y-75935500D01*
X106067147Y-75935500D01*
X106152853Y-75935500D01*
X108044877Y-75935500D01*
X108079525Y-75949852D01*
X108329534Y-76199861D01*
X108329535Y-76199862D01*
X108390138Y-76260465D01*
X108415527Y-76275123D01*
X108464359Y-76303317D01*
X108464361Y-76303317D01*
X108464362Y-76303318D01*
X108529651Y-76320812D01*
X108547143Y-76325499D01*
X108547144Y-76325500D01*
X108547147Y-76325500D01*
X108664629Y-76325500D01*
X108699277Y-76339852D01*
X108711518Y-76360275D01*
X108724768Y-76403954D01*
X108822315Y-76586450D01*
X108953590Y-76746410D01*
X109113550Y-76877685D01*
X109296046Y-76975232D01*
X109494066Y-77035300D01*
X109700000Y-77055583D01*
X109905934Y-77035300D01*
X110103954Y-76975232D01*
X110286450Y-76877685D01*
X110446410Y-76746410D01*
X110577685Y-76586450D01*
X110675232Y-76403954D01*
X110735300Y-76205934D01*
X110755583Y-76000000D01*
X110735300Y-75794066D01*
X110675232Y-75596046D01*
X110577685Y-75413550D01*
X110446410Y-75253590D01*
X110286450Y-75122315D01*
X110112786Y-75029489D01*
X110103956Y-75024769D01*
X110103955Y-75024768D01*
X110103954Y-75024768D01*
X109905934Y-74964700D01*
X109700000Y-74944417D01*
X109494065Y-74964700D01*
X109494064Y-74964700D01*
X109321616Y-75017011D01*
X109297550Y-75024312D01*
X109296043Y-75024769D01*
X109113548Y-75122316D01*
X108953590Y-75253590D01*
X108822316Y-75413548D01*
X108728605Y-75588867D01*
X108699615Y-75612658D01*
X108662292Y-75608982D01*
X108650743Y-75600416D01*
X108539852Y-75489525D01*
X108525500Y-75454877D01*
X108525500Y-74404500D01*
X108539852Y-74369852D01*
X108574500Y-74355500D01*
X108719745Y-74355500D01*
X108719748Y-74355500D01*
X108778231Y-74343867D01*
X108844552Y-74299552D01*
X108888867Y-74233231D01*
X108900500Y-74174748D01*
X108900500Y-73085252D01*
X108888867Y-73026769D01*
X108862301Y-72987012D01*
X108844552Y-72960447D01*
X108804795Y-72933882D01*
X108778231Y-72916133D01*
X108719748Y-72904500D01*
X107680252Y-72904500D01*
X107621769Y-72916133D01*
X107555447Y-72960447D01*
X107511133Y-73026769D01*
X107499500Y-73085252D01*
X107499500Y-74174748D01*
X107511133Y-74233231D01*
X107528882Y-74259795D01*
X107555447Y-74299552D01*
X107579666Y-74315734D01*
X107621769Y-74343867D01*
X107680252Y-74355500D01*
X107825500Y-74355500D01*
X107860148Y-74369852D01*
X107874500Y-74404500D01*
X107874500Y-75235500D01*
X107860148Y-75270148D01*
X107825500Y-75284500D01*
X106538266Y-75284500D01*
X106503618Y-75270148D01*
X106489266Y-75235500D01*
X106503618Y-75200852D01*
X106524063Y-75180406D01*
X106524065Y-75180404D01*
X106574068Y-75073173D01*
X106580500Y-75024316D01*
X106580500Y-74575684D01*
X106574068Y-74526827D01*
X106524065Y-74419596D01*
X106524064Y-74419595D01*
X106524063Y-74419593D01*
X106440406Y-74335936D01*
X106440404Y-74335935D01*
X106419161Y-74326029D01*
X106333174Y-74285932D01*
X106323401Y-74284645D01*
X106284316Y-74279500D01*
X105935684Y-74279500D01*
X105903112Y-74283788D01*
X105886825Y-74285932D01*
X105886824Y-74285933D01*
X105779595Y-74335935D01*
X105779593Y-74335936D01*
X105695936Y-74419593D01*
X105695935Y-74419595D01*
X105644409Y-74530093D01*
X105616759Y-74555430D01*
X105579292Y-74553794D01*
X105555591Y-74530093D01*
X105539471Y-74495524D01*
X105504065Y-74419596D01*
X105504064Y-74419595D01*
X105504063Y-74419593D01*
X105424852Y-74340382D01*
X105410500Y-74305734D01*
X105410500Y-71003428D01*
X105424852Y-70968780D01*
X105434255Y-70962066D01*
X105434205Y-70961996D01*
X105437505Y-70959638D01*
X105437511Y-70959636D01*
X105519636Y-70877511D01*
X105570645Y-70773170D01*
X105580500Y-70705528D01*
X105580500Y-70294472D01*
X105570645Y-70226830D01*
X105519636Y-70122489D01*
X105480795Y-70083648D01*
X105466443Y-70049000D01*
X105480795Y-70014352D01*
X105515443Y-70000000D01*
X110498745Y-70000000D01*
X110501249Y-70000064D01*
X110506834Y-70000349D01*
X110571687Y-70003669D01*
X110584709Y-70006131D01*
X110719877Y-70051326D01*
X110733248Y-70058235D01*
X110838912Y-70135464D01*
X110847565Y-70141788D01*
X110858211Y-70152434D01*
X110941763Y-70266749D01*
X110948674Y-70280125D01*
X110993866Y-70415284D01*
X110996331Y-70428317D01*
X110999936Y-70498749D01*
X111000000Y-70501254D01*
X111000000Y-95798801D01*
X110999942Y-95801189D01*
X110998492Y-95830901D01*
X110994820Y-95847264D01*
X110971652Y-95903197D01*
X110961030Y-95919094D01*
X110919094Y-95961030D01*
X110903197Y-95971652D01*
X110847264Y-95994820D01*
X110830902Y-95998492D01*
X110805744Y-95999719D01*
X110801186Y-95999942D01*
X110798802Y-96000000D01*
X110450000Y-96000000D01*
X110384455Y-96002139D01*
X110384447Y-96002140D01*
X110257833Y-96036066D01*
X110257830Y-96036067D01*
X110144305Y-96101612D01*
X110144305Y-96101613D01*
X110051613Y-96194305D01*
X110051612Y-96194305D01*
X109986067Y-96307830D01*
X109986066Y-96307833D01*
X109952140Y-96434447D01*
X109952139Y-96434455D01*
X109950000Y-96500000D01*
X109950000Y-97451000D01*
X109935648Y-97485648D01*
X109901000Y-97500000D01*
X109169641Y-97500000D01*
X109134993Y-97485648D01*
X109121583Y-97460561D01*
X109113867Y-97421769D01*
X109099095Y-97399662D01*
X109069554Y-97355450D01*
X109066142Y-97352039D01*
X109067723Y-97350457D01*
X109051440Y-97326076D01*
X109050500Y-97316527D01*
X109050500Y-96835435D01*
X109030020Y-96759008D01*
X109029230Y-96757100D01*
X109025500Y-96738349D01*
X109025501Y-96099500D01*
X109039853Y-96064852D01*
X109074501Y-96050500D01*
X109194312Y-96050500D01*
X109194316Y-96050500D01*
X109243173Y-96044068D01*
X109350404Y-95994065D01*
X109434065Y-95910404D01*
X109484068Y-95803173D01*
X109490500Y-95754316D01*
X109490500Y-95405684D01*
X109484068Y-95356827D01*
X109434065Y-95249596D01*
X109434064Y-95249595D01*
X109434063Y-95249593D01*
X109350406Y-95165936D01*
X109350404Y-95165935D01*
X109243173Y-95115932D01*
X109243171Y-95115931D01*
X109239906Y-95114409D01*
X109214569Y-95086759D01*
X109216205Y-95049292D01*
X109239906Y-95025591D01*
X109243171Y-95024068D01*
X109243173Y-95024068D01*
X109350404Y-94974065D01*
X109434065Y-94890404D01*
X109484068Y-94783173D01*
X109490500Y-94734316D01*
X109490500Y-94385684D01*
X109484068Y-94336827D01*
X109434065Y-94229596D01*
X109434064Y-94229595D01*
X109434063Y-94229593D01*
X109350406Y-94145936D01*
X109350404Y-94145935D01*
X109243175Y-94095933D01*
X109243174Y-94095932D01*
X109232394Y-94094513D01*
X109194316Y-94089500D01*
X109194312Y-94089500D01*
X109074501Y-94089500D01*
X109039853Y-94075148D01*
X109025501Y-94040500D01*
X109025501Y-93109702D01*
X109015515Y-93072437D01*
X109005022Y-93033277D01*
X109005021Y-93033275D01*
X109005021Y-93033274D01*
X108965460Y-92964754D01*
X108458973Y-92458267D01*
X108444621Y-92423619D01*
X108454745Y-92393792D01*
X108524536Y-92302841D01*
X108585044Y-92156762D01*
X108605682Y-92000000D01*
X108585044Y-91843238D01*
X108575211Y-91819500D01*
X108524538Y-91697163D01*
X108524535Y-91697158D01*
X108521516Y-91693224D01*
X108428282Y-91571718D01*
X108334148Y-91499487D01*
X108302841Y-91475464D01*
X108302836Y-91475461D01*
X108156761Y-91414955D01*
X108000000Y-91394318D01*
X107843238Y-91414955D01*
X107697163Y-91475461D01*
X107697158Y-91475464D01*
X107571718Y-91571717D01*
X107571717Y-91571718D01*
X107475464Y-91697158D01*
X107475461Y-91697163D01*
X107414955Y-91843238D01*
X107394318Y-92000000D01*
X107406720Y-92094208D01*
X107397013Y-92130433D01*
X107364534Y-92149184D01*
X107351744Y-92149184D01*
X107257536Y-92136782D01*
X107100774Y-92157419D01*
X106954699Y-92217925D01*
X106954694Y-92217928D01*
X106829254Y-92314181D01*
X106829253Y-92314182D01*
X106733000Y-92439622D01*
X106732997Y-92439627D01*
X106672491Y-92585702D01*
X106651854Y-92742464D01*
X106672491Y-92899225D01*
X106732997Y-93045300D01*
X106733000Y-93045305D01*
X106773330Y-93097865D01*
X106829254Y-93170746D01*
X106954695Y-93267000D01*
X106954697Y-93267000D01*
X106954699Y-93267002D01*
X106996528Y-93284328D01*
X107100774Y-93327508D01*
X107257536Y-93348146D01*
X107414298Y-93327508D01*
X107560377Y-93267000D01*
X107651328Y-93197210D01*
X107687550Y-93187504D01*
X107715803Y-93201437D01*
X107960147Y-93445781D01*
X107974499Y-93480429D01*
X107974499Y-94040500D01*
X107960147Y-94075148D01*
X107925499Y-94089500D01*
X107805684Y-94089500D01*
X107773112Y-94093788D01*
X107756825Y-94095932D01*
X107756824Y-94095933D01*
X107649595Y-94145935D01*
X107649593Y-94145936D01*
X107565936Y-94229593D01*
X107565935Y-94229595D01*
X107515933Y-94336824D01*
X107515932Y-94336825D01*
X107509500Y-94385687D01*
X107509500Y-94734312D01*
X107509499Y-94734312D01*
X107515932Y-94783174D01*
X107515933Y-94783175D01*
X107565935Y-94890404D01*
X107565936Y-94890406D01*
X107649593Y-94974063D01*
X107649595Y-94974064D01*
X107649596Y-94974065D01*
X107754562Y-95023012D01*
X107760093Y-95025591D01*
X107785430Y-95053241D01*
X107783794Y-95090708D01*
X107760093Y-95114409D01*
X107649595Y-95165935D01*
X107649593Y-95165936D01*
X107565936Y-95249593D01*
X107565935Y-95249595D01*
X107515933Y-95356824D01*
X107515932Y-95356825D01*
X107509500Y-95405687D01*
X107509500Y-95754312D01*
X107509499Y-95754312D01*
X107515932Y-95803174D01*
X107515933Y-95803175D01*
X107565935Y-95910404D01*
X107565936Y-95910406D01*
X107649593Y-95994063D01*
X107649595Y-95994064D01*
X107649596Y-95994065D01*
X107756827Y-96044068D01*
X107805684Y-96050500D01*
X107925499Y-96050500D01*
X107960147Y-96064852D01*
X107974499Y-96099500D01*
X107974499Y-96738350D01*
X107970773Y-96757093D01*
X107969979Y-96759010D01*
X107949500Y-96835435D01*
X107949500Y-97316527D01*
X107935148Y-97351175D01*
X107932769Y-97353127D01*
X107930445Y-97355450D01*
X107886133Y-97421768D01*
X107886133Y-97421769D01*
X107878416Y-97460560D01*
X107857582Y-97491742D01*
X107830359Y-97500000D01*
X107259000Y-97500000D01*
X107224352Y-97485648D01*
X107210000Y-97451000D01*
X107210000Y-97100002D01*
X107210000Y-97100000D01*
X107207433Y-97021346D01*
X107166719Y-96869399D01*
X107166718Y-96869398D01*
X107166718Y-96869396D01*
X107102985Y-96759008D01*
X107088066Y-96733167D01*
X106976833Y-96621934D01*
X106840603Y-96543281D01*
X106840599Y-96543280D01*
X106688661Y-96502568D01*
X106688654Y-96502567D01*
X106610000Y-96500000D01*
X106531346Y-96502567D01*
X106531338Y-96502568D01*
X106379400Y-96543280D01*
X106379396Y-96543281D01*
X106243166Y-96621934D01*
X106243166Y-96621935D01*
X106131935Y-96733166D01*
X106131934Y-96733166D01*
X106053281Y-96869396D01*
X106053280Y-96869400D01*
X106012568Y-97021338D01*
X106012567Y-97021346D01*
X106010000Y-97100002D01*
X106010000Y-97451000D01*
X105995648Y-97485648D01*
X105961000Y-97500000D01*
X105669641Y-97500000D01*
X105634993Y-97485648D01*
X105621583Y-97460561D01*
X105613867Y-97421769D01*
X105599162Y-97399762D01*
X105569552Y-97355447D01*
X105525594Y-97326076D01*
X105503231Y-97311133D01*
X105444748Y-97299500D01*
X105055252Y-97299500D01*
X105040668Y-97302400D01*
X105009558Y-97308588D01*
X104990442Y-97308588D01*
X104959331Y-97302400D01*
X104944748Y-97299500D01*
X104555252Y-97299500D01*
X104540668Y-97302400D01*
X104509558Y-97308588D01*
X104490442Y-97308588D01*
X104459331Y-97302400D01*
X104444748Y-97299500D01*
X104055252Y-97299500D01*
X104009564Y-97308588D01*
X103996769Y-97311133D01*
X103930447Y-97355447D01*
X103886133Y-97421768D01*
X103886133Y-97421769D01*
X103878416Y-97460560D01*
X103857582Y-97491742D01*
X103830359Y-97500000D01*
X103259000Y-97500000D01*
X103224352Y-97485648D01*
X103210000Y-97451000D01*
X103210000Y-97100002D01*
X103210000Y-97100000D01*
X103207433Y-97021346D01*
X103166719Y-96869399D01*
X103166718Y-96869398D01*
X103166718Y-96869396D01*
X103102985Y-96759008D01*
X103088066Y-96733167D01*
X102976833Y-96621934D01*
X102840603Y-96543281D01*
X102840599Y-96543280D01*
X102688661Y-96502568D01*
X102688654Y-96502567D01*
X102610000Y-96500000D01*
X102531346Y-96502567D01*
X102531338Y-96502568D01*
X102379400Y-96543280D01*
X102379396Y-96543281D01*
X102243166Y-96621934D01*
X102243166Y-96621935D01*
X102131935Y-96733166D01*
X102131934Y-96733166D01*
X102053281Y-96869396D01*
X102053280Y-96869400D01*
X102012568Y-97021338D01*
X102012567Y-97021346D01*
X102010000Y-97100002D01*
X102010000Y-97451000D01*
X101995648Y-97485648D01*
X101961000Y-97500000D01*
X101169641Y-97500000D01*
X101134993Y-97485648D01*
X101121583Y-97460561D01*
X101113867Y-97421769D01*
X101099162Y-97399762D01*
X101069552Y-97355447D01*
X101025594Y-97326076D01*
X101003231Y-97311133D01*
X100944748Y-97299500D01*
X100555252Y-97299500D01*
X100540668Y-97302400D01*
X100509558Y-97308588D01*
X100490442Y-97308588D01*
X100459331Y-97302400D01*
X100444748Y-97299500D01*
X100055252Y-97299500D01*
X100009564Y-97308588D01*
X99996769Y-97311133D01*
X99930447Y-97355447D01*
X99886133Y-97421768D01*
X99886133Y-97421769D01*
X99878416Y-97460560D01*
X99857582Y-97491742D01*
X99830359Y-97500000D01*
X99669641Y-97500000D01*
X99634993Y-97485648D01*
X99621583Y-97460561D01*
X99613867Y-97421769D01*
X99599162Y-97399762D01*
X99569552Y-97355447D01*
X99525594Y-97326076D01*
X99503231Y-97311133D01*
X99444748Y-97299500D01*
X99055252Y-97299500D01*
X99040668Y-97302400D01*
X99009558Y-97308588D01*
X98990442Y-97308588D01*
X98959331Y-97302400D01*
X98944748Y-97299500D01*
X98555252Y-97299500D01*
X98509564Y-97308588D01*
X98496769Y-97311133D01*
X98430447Y-97355447D01*
X98386133Y-97421768D01*
X98386133Y-97421769D01*
X98378416Y-97460560D01*
X98357582Y-97491742D01*
X98330359Y-97500000D01*
X98169641Y-97500000D01*
X98134993Y-97485648D01*
X98121583Y-97460561D01*
X98113867Y-97421769D01*
X98099162Y-97399762D01*
X98069552Y-97355447D01*
X98025594Y-97326076D01*
X98003231Y-97311133D01*
X97944748Y-97299500D01*
X97555252Y-97299500D01*
X97540668Y-97302400D01*
X97509558Y-97308588D01*
X97490442Y-97308588D01*
X97459331Y-97302400D01*
X97444748Y-97299500D01*
X97055252Y-97299500D01*
X97009564Y-97308588D01*
X96996769Y-97311133D01*
X96930447Y-97355447D01*
X96886133Y-97421768D01*
X96886133Y-97421769D01*
X96878416Y-97460560D01*
X96857582Y-97491742D01*
X96830359Y-97500000D01*
X96669641Y-97500000D01*
X96634993Y-97485648D01*
X96621583Y-97460561D01*
X96613867Y-97421769D01*
X96599162Y-97399762D01*
X96569552Y-97355447D01*
X96525594Y-97326076D01*
X96503231Y-97311133D01*
X96444748Y-97299500D01*
X96055252Y-97299500D01*
X96040668Y-97302400D01*
X96009558Y-97308588D01*
X95990442Y-97308588D01*
X95959331Y-97302400D01*
X95944748Y-97299500D01*
X95555252Y-97299500D01*
X95509564Y-97308588D01*
X95496769Y-97311133D01*
X95430447Y-97355447D01*
X95386133Y-97421768D01*
X95386133Y-97421769D01*
X95378416Y-97460560D01*
X95357582Y-97491742D01*
X95330359Y-97500000D01*
X95169641Y-97500000D01*
X95134993Y-97485648D01*
X95121583Y-97460561D01*
X95113867Y-97421769D01*
X95099162Y-97399762D01*
X95069552Y-97355447D01*
X95025594Y-97326076D01*
X95003231Y-97311133D01*
X94944748Y-97299500D01*
X94555252Y-97299500D01*
X94540668Y-97302400D01*
X94509558Y-97308588D01*
X94490442Y-97308588D01*
X94459331Y-97302400D01*
X94444748Y-97299500D01*
X94055252Y-97299500D01*
X94009564Y-97308588D01*
X93996769Y-97311133D01*
X93930447Y-97355447D01*
X93886133Y-97421768D01*
X93886133Y-97421769D01*
X93878416Y-97460560D01*
X93857582Y-97491742D01*
X93830359Y-97500000D01*
X93669641Y-97500000D01*
X93634993Y-97485648D01*
X93621583Y-97460561D01*
X93613867Y-97421769D01*
X93599162Y-97399762D01*
X93569552Y-97355447D01*
X93525594Y-97326076D01*
X93503231Y-97311133D01*
X93444748Y-97299500D01*
X93055252Y-97299500D01*
X93040668Y-97302400D01*
X93009558Y-97308588D01*
X92990442Y-97308588D01*
X92959331Y-97302400D01*
X92944748Y-97299500D01*
X92555252Y-97299500D01*
X92509564Y-97308588D01*
X92496769Y-97311133D01*
X92430447Y-97355447D01*
X92386133Y-97421768D01*
X92386133Y-97421769D01*
X92378416Y-97460560D01*
X92357582Y-97491742D01*
X92330359Y-97500000D01*
X92169641Y-97500000D01*
X92134993Y-97485648D01*
X92121583Y-97460561D01*
X92113867Y-97421769D01*
X92099162Y-97399762D01*
X92069552Y-97355447D01*
X92025594Y-97326076D01*
X92003231Y-97311133D01*
X91944748Y-97299500D01*
X91555252Y-97299500D01*
X91540668Y-97302400D01*
X91509558Y-97308588D01*
X91490442Y-97308588D01*
X91459331Y-97302400D01*
X91444748Y-97299500D01*
X91055252Y-97299500D01*
X91009564Y-97308588D01*
X90996769Y-97311133D01*
X90930447Y-97355447D01*
X90886133Y-97421768D01*
X90886133Y-97421769D01*
X90878416Y-97460560D01*
X90857582Y-97491742D01*
X90830359Y-97500000D01*
X90099000Y-97500000D01*
X90064352Y-97485648D01*
X90050000Y-97451000D01*
X90050000Y-96500000D01*
X90047861Y-96434455D01*
X90013933Y-96307833D01*
X90013932Y-96307830D01*
X89948387Y-96194305D01*
X89855694Y-96101612D01*
X89742169Y-96036067D01*
X89742166Y-96036066D01*
X89615552Y-96002140D01*
X89615545Y-96002139D01*
X89550000Y-96000000D01*
X89549998Y-96000000D01*
X89201198Y-96000000D01*
X89198812Y-95999942D01*
X89196310Y-95999820D01*
X89169098Y-95998492D01*
X89152735Y-95994820D01*
X89096802Y-95971652D01*
X89080905Y-95961030D01*
X89038969Y-95919094D01*
X89028347Y-95903197D01*
X89005179Y-95847264D01*
X89001507Y-95830900D01*
X89000058Y-95801188D01*
X89000000Y-95798801D01*
X89000000Y-91188428D01*
X92974500Y-91188428D01*
X92974500Y-91911570D01*
X92981067Y-91972662D01*
X92981070Y-91972671D01*
X93032619Y-92110879D01*
X93032620Y-92110881D01*
X93032621Y-92110883D01*
X93121024Y-92228976D01*
X93239117Y-92317379D01*
X93239118Y-92317379D01*
X93239119Y-92317380D01*
X93329346Y-92351032D01*
X93377333Y-92368931D01*
X93438435Y-92375500D01*
X94161564Y-92375499D01*
X94161570Y-92375499D01*
X94222662Y-92368932D01*
X94222664Y-92368931D01*
X94222667Y-92368931D01*
X94360883Y-92317379D01*
X94478976Y-92228976D01*
X94567379Y-92110883D01*
X94567380Y-92110880D01*
X94567381Y-92110879D01*
X94608736Y-92000000D01*
X94618931Y-91972667D01*
X94621558Y-91948226D01*
X94625500Y-91911571D01*
X94625500Y-91644500D01*
X94639852Y-91609852D01*
X94674500Y-91595500D01*
X94810735Y-91595500D01*
X94845383Y-91609852D01*
X94919593Y-91684063D01*
X94919595Y-91684064D01*
X94919596Y-91684065D01*
X94947685Y-91697163D01*
X95030093Y-91735591D01*
X95055430Y-91763241D01*
X95053794Y-91800708D01*
X95030093Y-91824409D01*
X94919595Y-91875935D01*
X94919593Y-91875936D01*
X94835936Y-91959593D01*
X94835935Y-91959595D01*
X94785933Y-92066824D01*
X94785932Y-92066825D01*
X94779500Y-92115687D01*
X94779500Y-92464312D01*
X94779499Y-92464312D01*
X94785932Y-92513174D01*
X94785933Y-92513175D01*
X94835935Y-92620404D01*
X94835936Y-92620406D01*
X94919594Y-92704064D01*
X94919595Y-92704064D01*
X94919596Y-92704065D01*
X94946208Y-92716474D01*
X94971545Y-92744123D01*
X94974500Y-92760883D01*
X94974500Y-93041849D01*
X94960148Y-93076497D01*
X94947021Y-93085870D01*
X94922492Y-93097861D01*
X94922487Y-93097865D01*
X94840365Y-93179987D01*
X94840363Y-93179991D01*
X94789356Y-93284326D01*
X94789355Y-93284328D01*
X94779500Y-93351970D01*
X94779500Y-93713029D01*
X94789355Y-93780671D01*
X94789356Y-93780673D01*
X94814859Y-93832840D01*
X94840364Y-93885011D01*
X94922489Y-93967136D01*
X94935462Y-93973478D01*
X94935464Y-93973479D01*
X94960287Y-94001591D01*
X94957963Y-94039022D01*
X94935464Y-94061521D01*
X94922489Y-94067864D01*
X94922487Y-94067865D01*
X94840365Y-94149987D01*
X94840363Y-94149991D01*
X94789356Y-94254326D01*
X94789355Y-94254328D01*
X94779500Y-94321970D01*
X94779500Y-94683029D01*
X94789355Y-94750671D01*
X94789356Y-94750673D01*
X94814859Y-94802840D01*
X94840364Y-94855011D01*
X94922489Y-94937136D01*
X95026830Y-94988145D01*
X95074760Y-94995128D01*
X95094470Y-94998000D01*
X95094472Y-94998000D01*
X95505530Y-94998000D01*
X95522733Y-94995493D01*
X95573170Y-94988145D01*
X95677511Y-94937136D01*
X95706990Y-94907655D01*
X95741636Y-94893305D01*
X95771466Y-94903431D01*
X95844435Y-94959421D01*
X95872375Y-94980861D01*
X95872377Y-94980861D01*
X95872379Y-94980863D01*
X95976687Y-95024068D01*
X96006291Y-95036330D01*
X96150000Y-95055250D01*
X96293709Y-95036330D01*
X96427625Y-94980861D01*
X96542621Y-94892621D01*
X96630861Y-94777625D01*
X96686330Y-94643709D01*
X96705250Y-94500000D01*
X96686330Y-94356291D01*
X96644096Y-94254328D01*
X96630863Y-94222379D01*
X96630860Y-94222374D01*
X96575318Y-94149991D01*
X96542621Y-94107379D01*
X96540409Y-94105682D01*
X96427625Y-94019139D01*
X96427620Y-94019136D01*
X96293708Y-93963669D01*
X96150000Y-93944750D01*
X96006291Y-93963669D01*
X95872379Y-94019136D01*
X95768637Y-94098740D01*
X95732412Y-94108446D01*
X95704160Y-94094513D01*
X95677512Y-94067865D01*
X95677511Y-94067864D01*
X95664534Y-94061520D01*
X95639711Y-94033411D01*
X95642034Y-93995980D01*
X95664533Y-93973480D01*
X95677511Y-93967136D01*
X95759636Y-93885011D01*
X95810645Y-93780670D01*
X95820500Y-93713028D01*
X95820500Y-93351972D01*
X95819942Y-93348145D01*
X95816936Y-93327508D01*
X95810645Y-93284330D01*
X95759636Y-93179989D01*
X95677511Y-93097864D01*
X95677510Y-93097863D01*
X95677507Y-93097861D01*
X95652979Y-93085870D01*
X95628155Y-93057758D01*
X95625500Y-93041849D01*
X95625500Y-92760883D01*
X95639852Y-92726235D01*
X95653790Y-92716474D01*
X95680404Y-92704065D01*
X95764065Y-92620404D01*
X95814068Y-92513173D01*
X95820500Y-92464316D01*
X95820500Y-92115684D01*
X95814068Y-92066827D01*
X95764065Y-91959596D01*
X95764064Y-91959595D01*
X95764063Y-91959593D01*
X95680406Y-91875936D01*
X95680404Y-91875935D01*
X95573173Y-91825932D01*
X95573171Y-91825931D01*
X95569906Y-91824409D01*
X95544569Y-91796759D01*
X95546205Y-91759292D01*
X95569906Y-91735591D01*
X95573171Y-91734068D01*
X95573173Y-91734068D01*
X95680404Y-91684065D01*
X95754617Y-91609852D01*
X95789265Y-91595500D01*
X102013663Y-91595500D01*
X102048311Y-91609852D01*
X102131681Y-91693222D01*
X102131683Y-91693223D01*
X102131684Y-91693224D01*
X102240513Y-91743972D01*
X102290099Y-91750500D01*
X102709900Y-91750499D01*
X102759487Y-91743972D01*
X102868316Y-91693224D01*
X102953224Y-91608316D01*
X103003972Y-91499487D01*
X103010500Y-91449901D01*
X103010499Y-91090100D01*
X103003972Y-91040513D01*
X103003971Y-91040511D01*
X102956913Y-90939596D01*
X102953224Y-90931684D01*
X102953223Y-90931683D01*
X102953222Y-90931681D01*
X102868316Y-90846776D01*
X102853789Y-90840001D01*
X102828454Y-90812349D01*
X102825500Y-90795593D01*
X102825500Y-90585573D01*
X102839852Y-90550925D01*
X102852255Y-90541914D01*
X102938335Y-90498054D01*
X102938337Y-90498052D01*
X102938342Y-90498050D01*
X103015352Y-90421040D01*
X103050000Y-90406688D01*
X103084648Y-90421040D01*
X103135148Y-90471540D01*
X103149500Y-90506188D01*
X103149500Y-90979314D01*
X103144909Y-91000022D01*
X103126029Y-91040509D01*
X103126028Y-91040511D01*
X103126028Y-91040512D01*
X103126028Y-91040513D01*
X103119501Y-91090098D01*
X103119500Y-91090102D01*
X103119500Y-91509896D01*
X103119501Y-91509901D01*
X103126027Y-91559485D01*
X103144909Y-91599977D01*
X103149500Y-91620685D01*
X103149500Y-92099314D01*
X103144909Y-92120022D01*
X103126029Y-92160509D01*
X103126028Y-92160511D01*
X103126028Y-92160512D01*
X103126028Y-92160513D01*
X103119501Y-92210098D01*
X103119500Y-92210102D01*
X103119500Y-92629896D01*
X103119501Y-92629901D01*
X103126027Y-92679485D01*
X103144909Y-92719977D01*
X103149500Y-92740685D01*
X103149500Y-93084040D01*
X103139374Y-93113869D01*
X103075464Y-93197158D01*
X103075461Y-93197163D01*
X103014955Y-93343238D01*
X102994318Y-93500000D01*
X103014955Y-93656761D01*
X103075461Y-93802836D01*
X103075464Y-93802841D01*
X103171718Y-93928282D01*
X103297159Y-94024536D01*
X103297161Y-94024536D01*
X103297163Y-94024538D01*
X103386451Y-94061522D01*
X103443238Y-94085044D01*
X103600000Y-94105682D01*
X103756762Y-94085044D01*
X103902841Y-94024536D01*
X104028282Y-93928282D01*
X104124536Y-93802841D01*
X104185044Y-93656762D01*
X104205682Y-93500000D01*
X104185044Y-93343238D01*
X104178528Y-93327508D01*
X104124538Y-93197163D01*
X104124535Y-93197158D01*
X104111362Y-93179991D01*
X104060626Y-93113869D01*
X104050500Y-93084040D01*
X104050500Y-92740685D01*
X104055091Y-92719977D01*
X104062511Y-92704064D01*
X104073972Y-92679487D01*
X104080500Y-92629901D01*
X104080499Y-92210100D01*
X104073972Y-92160513D01*
X104073971Y-92160511D01*
X104055091Y-92120022D01*
X104050500Y-92099314D01*
X104050500Y-91620685D01*
X104055091Y-91599977D01*
X104068269Y-91571717D01*
X104073972Y-91559487D01*
X104080500Y-91509901D01*
X104080499Y-91090100D01*
X104073972Y-91040513D01*
X104073971Y-91040511D01*
X104055091Y-91000022D01*
X104050500Y-90979314D01*
X104050500Y-90506188D01*
X104064852Y-90471540D01*
X104128050Y-90408342D01*
X104128893Y-90406688D01*
X104185644Y-90295309D01*
X104185644Y-90295307D01*
X104185646Y-90295304D01*
X104200500Y-90201519D01*
X104200499Y-88738482D01*
X104185646Y-88644696D01*
X104185643Y-88644690D01*
X104128054Y-88531664D01*
X104128049Y-88531657D01*
X104064852Y-88468460D01*
X104050500Y-88433812D01*
X104050500Y-87306899D01*
X104064852Y-87272251D01*
X107252251Y-84084852D01*
X107286899Y-84070500D01*
X108720279Y-84070500D01*
X108754927Y-84084852D01*
X108763490Y-84096398D01*
X108822315Y-84206450D01*
X108953590Y-84366410D01*
X109113550Y-84497685D01*
X109296046Y-84595232D01*
X109494066Y-84655300D01*
X109700000Y-84675583D01*
X109905934Y-84655300D01*
X110103954Y-84595232D01*
X110286450Y-84497685D01*
X110446410Y-84366410D01*
X110577685Y-84206450D01*
X110675232Y-84023954D01*
X110735300Y-83825934D01*
X110755583Y-83620000D01*
X110735300Y-83414066D01*
X110675232Y-83216046D01*
X110577685Y-83033550D01*
X110446410Y-82873590D01*
X110286450Y-82742315D01*
X110103954Y-82644768D01*
X109905934Y-82584700D01*
X109700000Y-82564417D01*
X109494065Y-82584700D01*
X109494064Y-82584700D01*
X109296043Y-82644769D01*
X109113548Y-82742316D01*
X108953590Y-82873590D01*
X108822316Y-83033548D01*
X108822315Y-83033550D01*
X108763491Y-83143599D01*
X108734503Y-83167390D01*
X108720279Y-83169500D01*
X107020688Y-83169500D01*
X106930326Y-83193713D01*
X106906115Y-83200199D01*
X106906110Y-83200201D01*
X106803385Y-83259511D01*
X106803385Y-83259512D01*
X103239512Y-86823385D01*
X103239511Y-86823385D01*
X103180201Y-86926111D01*
X103178532Y-86932343D01*
X103178531Y-86932342D01*
X103178531Y-86932346D01*
X103149500Y-87040688D01*
X103149500Y-88433812D01*
X103135148Y-88468460D01*
X103084648Y-88518960D01*
X103050000Y-88533312D01*
X103015352Y-88518960D01*
X102938342Y-88441950D01*
X102938335Y-88441945D01*
X102825308Y-88384355D01*
X102825305Y-88384354D01*
X102825304Y-88384354D01*
X102731519Y-88369500D01*
X102731517Y-88369500D01*
X102268482Y-88369500D01*
X102174696Y-88384353D01*
X102061664Y-88441945D01*
X102061657Y-88441950D01*
X101984648Y-88518960D01*
X101950000Y-88533312D01*
X101915352Y-88518960D01*
X101838345Y-88441953D01*
X101838342Y-88441950D01*
X101838340Y-88441949D01*
X101838339Y-88441948D01*
X101752254Y-88398085D01*
X101727898Y-88369567D01*
X101725500Y-88354426D01*
X101725500Y-87755123D01*
X101739852Y-87720475D01*
X108040475Y-81419852D01*
X108075123Y-81405500D01*
X108664629Y-81405500D01*
X108699277Y-81419852D01*
X108711518Y-81440275D01*
X108724768Y-81483954D01*
X108822315Y-81666450D01*
X108953590Y-81826410D01*
X109113550Y-81957685D01*
X109296046Y-82055232D01*
X109494066Y-82115300D01*
X109700000Y-82135583D01*
X109905934Y-82115300D01*
X110103954Y-82055232D01*
X110286450Y-81957685D01*
X110446410Y-81826410D01*
X110577685Y-81666450D01*
X110675232Y-81483954D01*
X110735300Y-81285934D01*
X110755583Y-81080000D01*
X110735300Y-80874066D01*
X110675232Y-80676046D01*
X110577685Y-80493550D01*
X110446410Y-80333590D01*
X110286450Y-80202315D01*
X110103954Y-80104768D01*
X109905934Y-80044700D01*
X109700000Y-80024417D01*
X109494065Y-80044700D01*
X109494064Y-80044700D01*
X109296043Y-80104769D01*
X109113548Y-80202316D01*
X108953590Y-80333590D01*
X108822316Y-80493548D01*
X108724770Y-80676042D01*
X108724767Y-80676049D01*
X108711519Y-80719724D01*
X108687728Y-80748714D01*
X108664629Y-80754500D01*
X108064123Y-80754500D01*
X108029475Y-80740148D01*
X108015123Y-80705500D01*
X108029475Y-80670852D01*
X108206779Y-80493548D01*
X109198045Y-79502280D01*
X109232692Y-79487929D01*
X109255791Y-79493715D01*
X109296046Y-79515232D01*
X109494066Y-79575300D01*
X109700000Y-79595583D01*
X109905934Y-79575300D01*
X110103954Y-79515232D01*
X110286450Y-79417685D01*
X110446410Y-79286410D01*
X110577685Y-79126450D01*
X110675232Y-78943954D01*
X110735300Y-78745934D01*
X110755583Y-78540000D01*
X110735300Y-78334066D01*
X110675232Y-78136046D01*
X110577685Y-77953550D01*
X110446410Y-77793590D01*
X110286450Y-77662315D01*
X110103954Y-77564768D01*
X109905934Y-77504700D01*
X109700000Y-77484417D01*
X109494065Y-77504700D01*
X109494064Y-77504700D01*
X109296043Y-77564769D01*
X109113548Y-77662316D01*
X108953590Y-77793590D01*
X108822316Y-77953548D01*
X108724769Y-78136043D01*
X108664700Y-78334064D01*
X108664700Y-78334065D01*
X108644417Y-78539999D01*
X108644417Y-78540000D01*
X108664700Y-78745934D01*
X108664700Y-78745935D01*
X108724769Y-78943958D01*
X108724770Y-78943959D01*
X108746283Y-78984208D01*
X108749959Y-79021530D01*
X108737717Y-79041954D01*
X100039536Y-87740136D01*
X100039535Y-87740137D01*
X99996682Y-87814359D01*
X99995013Y-87820591D01*
X99995012Y-87820590D01*
X99995012Y-87820594D01*
X99974500Y-87897144D01*
X99974500Y-88354426D01*
X99960148Y-88389074D01*
X99947746Y-88398085D01*
X99861660Y-88441948D01*
X99861654Y-88441953D01*
X99784648Y-88518960D01*
X99750000Y-88533312D01*
X99715352Y-88518960D01*
X99638342Y-88441950D01*
X99638335Y-88441945D01*
X99525308Y-88384355D01*
X99525305Y-88384354D01*
X99525304Y-88384354D01*
X99431519Y-88369500D01*
X99431517Y-88369500D01*
X98968482Y-88369500D01*
X98874696Y-88384353D01*
X98761664Y-88441945D01*
X98761657Y-88441950D01*
X98684648Y-88518960D01*
X98650000Y-88533312D01*
X98615352Y-88518960D01*
X98538342Y-88441950D01*
X98538335Y-88441945D01*
X98425308Y-88384355D01*
X98425305Y-88384354D01*
X98425304Y-88384354D01*
X98331519Y-88369500D01*
X98331517Y-88369500D01*
X97868482Y-88369500D01*
X97774696Y-88384353D01*
X97661664Y-88441945D01*
X97661657Y-88441950D01*
X97571950Y-88531657D01*
X97571945Y-88531664D01*
X97514355Y-88644690D01*
X97514355Y-88644692D01*
X97499500Y-88738482D01*
X97499500Y-90201517D01*
X97514353Y-90295303D01*
X97571945Y-90408335D01*
X97571950Y-90408342D01*
X97661657Y-90498049D01*
X97661664Y-90498054D01*
X97774691Y-90555644D01*
X97774692Y-90555644D01*
X97774696Y-90555646D01*
X97868481Y-90570500D01*
X98331518Y-90570499D01*
X98425304Y-90555646D01*
X98486387Y-90524522D01*
X98538335Y-90498054D01*
X98538337Y-90498052D01*
X98538342Y-90498050D01*
X98615352Y-90421040D01*
X98650000Y-90406688D01*
X98684648Y-90421040D01*
X98761657Y-90498049D01*
X98761664Y-90498054D01*
X98874691Y-90555644D01*
X98874692Y-90555644D01*
X98874696Y-90555646D01*
X98968481Y-90570500D01*
X99431518Y-90570499D01*
X99525304Y-90555646D01*
X99586387Y-90524522D01*
X99638335Y-90498054D01*
X99638337Y-90498052D01*
X99638342Y-90498050D01*
X99715352Y-90421040D01*
X99750000Y-90406688D01*
X99784648Y-90421040D01*
X99861657Y-90498049D01*
X99861664Y-90498054D01*
X99974691Y-90555644D01*
X99974692Y-90555644D01*
X99974696Y-90555646D01*
X100068481Y-90570500D01*
X100531518Y-90570499D01*
X100625304Y-90555646D01*
X100686387Y-90524522D01*
X100738335Y-90498054D01*
X100738337Y-90498052D01*
X100738342Y-90498050D01*
X100815352Y-90421040D01*
X100850000Y-90406688D01*
X100884648Y-90421040D01*
X100961657Y-90498049D01*
X100961664Y-90498054D01*
X101074691Y-90555644D01*
X101074692Y-90555644D01*
X101074696Y-90555646D01*
X101168481Y-90570500D01*
X101631518Y-90570499D01*
X101725304Y-90555646D01*
X101786387Y-90524522D01*
X101838335Y-90498054D01*
X101838337Y-90498052D01*
X101838342Y-90498050D01*
X101915352Y-90421040D01*
X101950000Y-90406688D01*
X101984648Y-90421040D01*
X102061657Y-90498049D01*
X102061664Y-90498054D01*
X102147745Y-90541914D01*
X102172102Y-90570431D01*
X102174500Y-90585573D01*
X102174500Y-90795593D01*
X102160148Y-90830241D01*
X102146211Y-90840001D01*
X102131683Y-90846776D01*
X102048311Y-90930148D01*
X102013663Y-90944500D01*
X95789265Y-90944500D01*
X95754617Y-90930148D01*
X95680406Y-90855936D01*
X95680404Y-90855935D01*
X95573175Y-90805933D01*
X95573174Y-90805932D01*
X95563401Y-90804645D01*
X95524316Y-90799500D01*
X95075684Y-90799500D01*
X95043112Y-90803788D01*
X95026825Y-90805932D01*
X95026824Y-90805933D01*
X94919595Y-90855935D01*
X94919593Y-90855936D01*
X94845383Y-90930148D01*
X94810735Y-90944500D01*
X94558507Y-90944500D01*
X94523859Y-90930148D01*
X94519281Y-90924865D01*
X94506618Y-90907950D01*
X94478976Y-90871024D01*
X94360883Y-90782621D01*
X94360882Y-90782620D01*
X94360880Y-90782619D01*
X94222671Y-90731070D01*
X94222663Y-90731068D01*
X94161571Y-90724500D01*
X93438429Y-90724500D01*
X93377337Y-90731067D01*
X93377328Y-90731070D01*
X93239119Y-90782619D01*
X93239115Y-90782622D01*
X93121024Y-90871024D01*
X93032622Y-90989115D01*
X93032619Y-90989119D01*
X92981070Y-91127328D01*
X92981068Y-91127336D01*
X92974500Y-91188428D01*
X89000000Y-91188428D01*
X89000000Y-88738482D01*
X91199500Y-88738482D01*
X91199500Y-90201517D01*
X91214353Y-90295303D01*
X91271945Y-90408335D01*
X91271950Y-90408342D01*
X91361657Y-90498049D01*
X91361664Y-90498054D01*
X91474691Y-90555644D01*
X91474692Y-90555644D01*
X91474696Y-90555646D01*
X91568481Y-90570500D01*
X92031518Y-90570499D01*
X92125304Y-90555646D01*
X92186387Y-90524522D01*
X92238335Y-90498054D01*
X92238337Y-90498052D01*
X92238342Y-90498050D01*
X92315352Y-90421040D01*
X92350000Y-90406688D01*
X92384648Y-90421040D01*
X92461657Y-90498049D01*
X92461664Y-90498054D01*
X92574691Y-90555644D01*
X92574692Y-90555644D01*
X92574696Y-90555646D01*
X92668481Y-90570500D01*
X93131518Y-90570499D01*
X93225304Y-90555646D01*
X93286387Y-90524522D01*
X93338335Y-90498054D01*
X93338337Y-90498052D01*
X93338342Y-90498050D01*
X93415352Y-90421040D01*
X93450000Y-90406688D01*
X93484648Y-90421040D01*
X93561657Y-90498049D01*
X93561664Y-90498054D01*
X93674691Y-90555644D01*
X93674692Y-90555644D01*
X93674696Y-90555646D01*
X93768481Y-90570500D01*
X94231518Y-90570499D01*
X94325304Y-90555646D01*
X94386387Y-90524522D01*
X94438335Y-90498054D01*
X94438337Y-90498052D01*
X94438342Y-90498050D01*
X94515352Y-90421040D01*
X94550000Y-90406688D01*
X94584648Y-90421040D01*
X94661657Y-90498049D01*
X94661664Y-90498054D01*
X94774691Y-90555644D01*
X94774692Y-90555644D01*
X94774696Y-90555646D01*
X94868481Y-90570500D01*
X95331518Y-90570499D01*
X95425304Y-90555646D01*
X95486387Y-90524522D01*
X95538335Y-90498054D01*
X95538337Y-90498052D01*
X95538342Y-90498050D01*
X95628050Y-90408342D01*
X95628893Y-90406688D01*
X95685644Y-90295309D01*
X95685644Y-90295307D01*
X95685646Y-90295304D01*
X95700500Y-90201519D01*
X95700499Y-88738482D01*
X95685646Y-88644696D01*
X95685643Y-88644690D01*
X95628054Y-88531664D01*
X95628049Y-88531657D01*
X95538342Y-88441950D01*
X95538335Y-88441945D01*
X95425308Y-88384355D01*
X95425305Y-88384354D01*
X95425304Y-88384354D01*
X95331519Y-88369500D01*
X95331517Y-88369500D01*
X94868482Y-88369500D01*
X94774696Y-88384353D01*
X94661664Y-88441945D01*
X94661657Y-88441950D01*
X94584648Y-88518960D01*
X94550000Y-88533312D01*
X94515352Y-88518960D01*
X94438342Y-88441950D01*
X94438335Y-88441945D01*
X94325308Y-88384355D01*
X94325305Y-88384354D01*
X94325304Y-88384354D01*
X94231519Y-88369500D01*
X94231517Y-88369500D01*
X93768482Y-88369500D01*
X93674696Y-88384353D01*
X93561664Y-88441945D01*
X93561657Y-88441950D01*
X93484648Y-88518960D01*
X93450000Y-88533312D01*
X93415352Y-88518960D01*
X93338342Y-88441950D01*
X93338335Y-88441945D01*
X93225308Y-88384355D01*
X93225305Y-88384354D01*
X93225304Y-88384354D01*
X93131519Y-88369500D01*
X93131517Y-88369500D01*
X92668482Y-88369500D01*
X92574696Y-88384353D01*
X92461664Y-88441945D01*
X92461657Y-88441950D01*
X92384648Y-88518960D01*
X92350000Y-88533312D01*
X92315352Y-88518960D01*
X92238342Y-88441950D01*
X92238335Y-88441945D01*
X92125308Y-88384355D01*
X92125305Y-88384354D01*
X92125304Y-88384354D01*
X92031519Y-88369500D01*
X92031517Y-88369500D01*
X91568482Y-88369500D01*
X91474696Y-88384353D01*
X91361664Y-88441945D01*
X91361657Y-88441950D01*
X91271950Y-88531657D01*
X91271945Y-88531664D01*
X91214355Y-88644690D01*
X91214355Y-88644692D01*
X91199500Y-88738482D01*
X89000000Y-88738482D01*
X89000000Y-73085252D01*
X91099500Y-73085252D01*
X91099500Y-74174748D01*
X91111133Y-74233231D01*
X91128882Y-74259795D01*
X91155447Y-74299552D01*
X91179666Y-74315734D01*
X91221769Y-74343867D01*
X91280252Y-74355500D01*
X91370500Y-74355500D01*
X91405148Y-74369852D01*
X91419500Y-74404500D01*
X91419500Y-74623057D01*
X91405148Y-74657705D01*
X91370365Y-74692487D01*
X91370363Y-74692491D01*
X91319356Y-74796826D01*
X91319355Y-74796828D01*
X91309500Y-74864470D01*
X91309500Y-75275529D01*
X91319355Y-75343171D01*
X91319356Y-75343173D01*
X91334660Y-75374478D01*
X91370364Y-75447511D01*
X91370365Y-75447512D01*
X91405148Y-75482295D01*
X91419500Y-75516943D01*
X91419500Y-76382450D01*
X91405148Y-76417098D01*
X91392747Y-76426109D01*
X91361658Y-76441950D01*
X91361654Y-76441953D01*
X91271950Y-76531657D01*
X91271945Y-76531664D01*
X91214355Y-76644690D01*
X91214355Y-76644692D01*
X91199500Y-76738482D01*
X91199500Y-78201517D01*
X91214353Y-78295303D01*
X91271945Y-78408335D01*
X91271950Y-78408342D01*
X91361657Y-78498049D01*
X91361664Y-78498054D01*
X91474691Y-78555644D01*
X91474692Y-78555644D01*
X91474696Y-78555646D01*
X91568481Y-78570500D01*
X92031518Y-78570499D01*
X92125304Y-78555646D01*
X92186387Y-78524522D01*
X92238335Y-78498054D01*
X92238337Y-78498052D01*
X92238342Y-78498050D01*
X92328050Y-78408342D01*
X92328893Y-78406688D01*
X92385644Y-78295309D01*
X92385644Y-78295307D01*
X92385646Y-78295304D01*
X92400500Y-78201519D01*
X92400499Y-76738482D01*
X92385646Y-76644696D01*
X92355969Y-76586451D01*
X92328054Y-76531664D01*
X92328049Y-76531657D01*
X92238345Y-76441953D01*
X92238342Y-76441950D01*
X92207252Y-76426108D01*
X92182898Y-76397591D01*
X92180500Y-76382450D01*
X92180500Y-75526943D01*
X92194852Y-75492295D01*
X92211974Y-75475173D01*
X92239636Y-75447511D01*
X92245979Y-75434534D01*
X92274089Y-75409711D01*
X92311520Y-75412034D01*
X92334019Y-75434533D01*
X92340364Y-75447511D01*
X92422489Y-75529636D01*
X92526830Y-75580645D01*
X92574760Y-75587628D01*
X92594470Y-75590500D01*
X92594472Y-75590500D01*
X92955530Y-75590500D01*
X92972733Y-75587993D01*
X93023170Y-75580645D01*
X93127511Y-75529636D01*
X93192295Y-75464852D01*
X93226943Y-75450500D01*
X93280096Y-75450500D01*
X93318803Y-75440127D01*
X93376867Y-75424569D01*
X93463632Y-75374476D01*
X93598368Y-75239738D01*
X93633015Y-75225387D01*
X93653718Y-75229976D01*
X93726827Y-75264068D01*
X93726828Y-75264068D01*
X93730094Y-75265591D01*
X93755430Y-75293242D01*
X93753794Y-75330709D01*
X93730093Y-75354409D01*
X93619595Y-75405935D01*
X93619593Y-75405936D01*
X93535936Y-75489593D01*
X93535935Y-75489595D01*
X93485933Y-75596824D01*
X93485932Y-75596825D01*
X93479500Y-75645687D01*
X93479500Y-75994312D01*
X93479499Y-75994312D01*
X93485932Y-76043174D01*
X93485933Y-76043175D01*
X93535935Y-76150404D01*
X93535936Y-76150406D01*
X93605148Y-76219617D01*
X93619500Y-76254265D01*
X93619500Y-76382450D01*
X93605148Y-76417098D01*
X93592747Y-76426109D01*
X93561658Y-76441950D01*
X93561654Y-76441953D01*
X93471950Y-76531657D01*
X93471945Y-76531664D01*
X93414355Y-76644690D01*
X93414355Y-76644692D01*
X93399500Y-76738482D01*
X93399500Y-78201517D01*
X93414353Y-78295303D01*
X93471945Y-78408335D01*
X93471950Y-78408342D01*
X93561657Y-78498049D01*
X93561664Y-78498054D01*
X93674691Y-78555644D01*
X93674692Y-78555644D01*
X93674696Y-78555646D01*
X93768481Y-78570500D01*
X94231518Y-78570499D01*
X94325304Y-78555646D01*
X94386387Y-78524522D01*
X94438335Y-78498054D01*
X94438337Y-78498052D01*
X94438342Y-78498050D01*
X94515352Y-78421040D01*
X94550000Y-78406688D01*
X94584648Y-78421040D01*
X94661657Y-78498049D01*
X94661664Y-78498054D01*
X94774691Y-78555644D01*
X94774692Y-78555644D01*
X94774696Y-78555646D01*
X94868481Y-78570500D01*
X95331518Y-78570499D01*
X95425304Y-78555646D01*
X95486387Y-78524522D01*
X95538335Y-78498054D01*
X95538337Y-78498052D01*
X95538342Y-78498050D01*
X95628050Y-78408342D01*
X95628893Y-78406688D01*
X95685644Y-78295309D01*
X95685644Y-78295307D01*
X95685646Y-78295304D01*
X95700500Y-78201519D01*
X95700499Y-76738482D01*
X95685646Y-76644696D01*
X95655969Y-76586451D01*
X95628054Y-76531664D01*
X95628049Y-76531657D01*
X95538342Y-76441950D01*
X95538335Y-76441945D01*
X95425308Y-76384355D01*
X95425305Y-76384354D01*
X95425304Y-76384354D01*
X95331519Y-76369500D01*
X95331517Y-76369500D01*
X94868482Y-76369500D01*
X94774696Y-76384353D01*
X94661664Y-76441945D01*
X94661657Y-76441950D01*
X94584648Y-76518960D01*
X94550000Y-76533312D01*
X94515352Y-76518960D01*
X94438345Y-76441953D01*
X94438342Y-76441950D01*
X94407252Y-76426108D01*
X94382898Y-76397591D01*
X94380500Y-76382450D01*
X94380500Y-76254265D01*
X94394852Y-76219617D01*
X94464063Y-76150406D01*
X94464065Y-76150404D01*
X94514068Y-76043173D01*
X94520500Y-75994316D01*
X94520500Y-75645684D01*
X94514068Y-75596827D01*
X94464065Y-75489596D01*
X94464064Y-75489595D01*
X94464063Y-75489593D01*
X94380406Y-75405936D01*
X94380404Y-75405935D01*
X94273173Y-75355932D01*
X94273171Y-75355931D01*
X94269906Y-75354409D01*
X94244569Y-75326759D01*
X94246205Y-75289292D01*
X94269906Y-75265591D01*
X94273171Y-75264068D01*
X94273173Y-75264068D01*
X94380404Y-75214065D01*
X94399616Y-75194853D01*
X94434264Y-75180500D01*
X94698664Y-75180500D01*
X94733312Y-75194852D01*
X94761684Y-75223224D01*
X94870513Y-75273972D01*
X94920099Y-75280500D01*
X95339900Y-75280499D01*
X95389487Y-75273972D01*
X95498316Y-75223224D01*
X95583224Y-75138316D01*
X95633972Y-75029487D01*
X95640500Y-74979901D01*
X95640499Y-74620100D01*
X95633972Y-74570513D01*
X95628769Y-74559356D01*
X95599003Y-74495523D01*
X95583224Y-74461684D01*
X95583223Y-74461683D01*
X95583222Y-74461681D01*
X95498318Y-74376777D01*
X95498316Y-74376776D01*
X95427743Y-74343867D01*
X95389488Y-74326028D01*
X95379569Y-74324722D01*
X95339901Y-74319500D01*
X95339897Y-74319500D01*
X94920103Y-74319500D01*
X94920098Y-74319501D01*
X94870512Y-74326027D01*
X94761684Y-74376775D01*
X94752525Y-74385935D01*
X94733311Y-74405148D01*
X94698665Y-74419500D01*
X94434265Y-74419500D01*
X94399617Y-74405148D01*
X94399616Y-74405147D01*
X94380406Y-74385936D01*
X94380404Y-74385935D01*
X94304161Y-74350382D01*
X94273174Y-74335932D01*
X94263401Y-74334645D01*
X94224316Y-74329500D01*
X93775684Y-74329500D01*
X93743112Y-74333788D01*
X93726825Y-74335932D01*
X93726824Y-74335933D01*
X93619595Y-74385935D01*
X93619593Y-74385936D01*
X93600384Y-74405147D01*
X93565736Y-74419500D01*
X93449904Y-74419500D01*
X93353135Y-74445430D01*
X93353133Y-74445431D01*
X93266371Y-74495521D01*
X93266369Y-74495523D01*
X93168379Y-74593512D01*
X93133731Y-74607863D01*
X93112210Y-74602884D01*
X93093039Y-74593512D01*
X93056572Y-74575684D01*
X93023173Y-74559356D01*
X93023171Y-74559355D01*
X92955530Y-74549500D01*
X92955528Y-74549500D01*
X92594472Y-74549500D01*
X92594470Y-74549500D01*
X92526828Y-74559355D01*
X92526826Y-74559356D01*
X92422491Y-74610363D01*
X92422487Y-74610365D01*
X92340365Y-74692487D01*
X92340364Y-74692489D01*
X92334021Y-74705464D01*
X92305909Y-74730287D01*
X92268478Y-74727963D01*
X92245979Y-74705464D01*
X92239636Y-74692489D01*
X92194852Y-74647705D01*
X92180500Y-74613057D01*
X92180500Y-74404500D01*
X92194852Y-74369852D01*
X92229500Y-74355500D01*
X92319745Y-74355500D01*
X92319748Y-74355500D01*
X92378231Y-74343867D01*
X92444552Y-74299552D01*
X92488867Y-74233231D01*
X92500500Y-74174748D01*
X92500500Y-73085252D01*
X92488867Y-73026769D01*
X92462301Y-72987012D01*
X92444552Y-72960447D01*
X92404795Y-72933882D01*
X92378231Y-72916133D01*
X92319748Y-72904500D01*
X91280252Y-72904500D01*
X91221769Y-72916133D01*
X91155447Y-72960447D01*
X91111133Y-73026769D01*
X91099500Y-73085252D01*
X89000000Y-73085252D01*
X89000000Y-70501254D01*
X89000064Y-70498750D01*
X89000148Y-70497105D01*
X89003669Y-70428311D01*
X89006131Y-70415292D01*
X89051327Y-70280119D01*
X89058233Y-70266753D01*
X89141791Y-70152430D01*
X89152430Y-70141791D01*
X89266753Y-70058233D01*
X89280119Y-70051327D01*
X89415292Y-70006131D01*
X89428311Y-70003669D01*
X89493461Y-70000334D01*
X89498751Y-70000064D01*
X89501255Y-70000000D01*
X103684557Y-70000000D01*
X103719205Y-70014352D01*
G37*
G04 #@! TD.AperFunction*
M02*
