G04 #@! TF.GenerationSoftware,KiCad,Pcbnew,8.0.7*
G04 #@! TF.CreationDate,2024-12-20T16:02:40+13:00*
G04 #@! TF.ProjectId,M2_NEO-\u002A,4d325f4e-454f-42d2-9a2e-6b696361645f,rev?*
G04 #@! TF.SameCoordinates,Original*
G04 #@! TF.FileFunction,Copper,L4,Bot*
G04 #@! TF.FilePolarity,Positive*
%FSLAX46Y46*%
G04 Gerber Fmt 4.6, Leading zero omitted, Abs format (unit mm)*
G04 Created by KiCad (PCBNEW 8.0.7) date 2024-12-20 16:02:40*
%MOMM*%
%LPD*%
G01*
G04 APERTURE LIST*
G04 Aperture macros list*
%AMRoundRect*
0 Rectangle with rounded corners*
0 $1 Rounding radius*
0 $2 $3 $4 $5 $6 $7 $8 $9 X,Y pos of 4 corners*
0 Add a 4 corners polygon primitive as box body*
4,1,4,$2,$3,$4,$5,$6,$7,$8,$9,$2,$3,0*
0 Add four circle primitives for the rounded corners*
1,1,$1+$1,$2,$3*
1,1,$1+$1,$4,$5*
1,1,$1+$1,$6,$7*
1,1,$1+$1,$8,$9*
0 Add four rect primitives between the rounded corners*
20,1,$1+$1,$2,$3,$4,$5,0*
20,1,$1+$1,$4,$5,$6,$7,0*
20,1,$1+$1,$6,$7,$8,$9,0*
20,1,$1+$1,$8,$9,$2,$3,0*%
G04 Aperture macros list end*
%ADD10C,0.100000*%
G04 #@! TA.AperFunction,NonConductor*
%ADD11C,0.100000*%
G04 #@! TD*
G04 #@! TA.AperFunction,ComponentPad*
%ADD12R,1.700000X1.700000*%
G04 #@! TD*
G04 #@! TA.AperFunction,ComponentPad*
%ADD13O,1.700000X1.700000*%
G04 #@! TD*
G04 #@! TA.AperFunction,ConnectorPad*
%ADD14R,0.350000X2.500000*%
G04 #@! TD*
G04 #@! TA.AperFunction,ComponentPad*
%ADD15C,5.500000*%
G04 #@! TD*
G04 #@! TA.AperFunction,ConnectorPad*
%ADD16C,7.250000*%
G04 #@! TD*
G04 #@! TA.AperFunction,SMDPad,CuDef*
%ADD17R,0.296500X0.156000*%
G04 #@! TD*
G04 #@! TA.AperFunction,SMDPad,CuDef*
%ADD18RoundRect,0.040000X-0.360000X0.710000X-0.360000X-0.710000X0.360000X-0.710000X0.360000X0.710000X0*%
G04 #@! TD*
G04 #@! TA.AperFunction,ViaPad*
%ADD19C,0.700000*%
G04 #@! TD*
G04 #@! TA.AperFunction,ViaPad*
%ADD20C,0.800000*%
G04 #@! TD*
G04 #@! TA.AperFunction,ViaPad*
%ADD21C,0.600000*%
G04 #@! TD*
G04 #@! TA.AperFunction,Conductor*
%ADD22C,0.250000*%
G04 #@! TD*
G04 #@! TA.AperFunction,Conductor*
%ADD23C,0.500000*%
G04 #@! TD*
G04 #@! TA.AperFunction,Conductor*
%ADD24C,0.200000*%
G04 #@! TD*
G04 APERTURE END LIST*
G04 #@! TA.AperFunction,Conductor*
G36*
X95800000Y-94230000D02*
G01*
X96500000Y-94230000D01*
X96500000Y-94500000D01*
X95800000Y-94500000D01*
X95800000Y-94230000D01*
G37*
G04 #@! TD.AperFunction*
G04 #@! TA.AperFunction,Conductor*
G36*
X108620000Y-98840000D02*
G01*
X108900000Y-98840000D01*
X108900000Y-99900000D01*
X108620000Y-99900000D01*
X108620000Y-98840000D01*
G37*
G04 #@! TD.AperFunction*
G04 #@! TA.AperFunction,Conductor*
G36*
X91100000Y-98840000D02*
G01*
X91380000Y-98840000D01*
X91380000Y-99900000D01*
X91100000Y-99900000D01*
X91100000Y-98840000D01*
G37*
G04 #@! TD.AperFunction*
G04 #@! TA.AperFunction,Conductor*
G36*
X103200000Y-93490000D02*
G01*
X104000000Y-93490000D01*
X104000000Y-93770000D01*
X103200000Y-93770000D01*
X103200000Y-93490000D01*
G37*
G04 #@! TD.AperFunction*
D10*
D11*
X106856666Y-72558490D02*
X106880475Y-72582300D01*
X106880475Y-72582300D02*
X106951904Y-72606109D01*
X106951904Y-72606109D02*
X106999523Y-72606109D01*
X106999523Y-72606109D02*
X107070951Y-72582300D01*
X107070951Y-72582300D02*
X107118570Y-72534680D01*
X107118570Y-72534680D02*
X107142380Y-72487061D01*
X107142380Y-72487061D02*
X107166189Y-72391823D01*
X107166189Y-72391823D02*
X107166189Y-72320395D01*
X107166189Y-72320395D02*
X107142380Y-72225157D01*
X107142380Y-72225157D02*
X107118570Y-72177538D01*
X107118570Y-72177538D02*
X107070951Y-72129919D01*
X107070951Y-72129919D02*
X106999523Y-72106109D01*
X106999523Y-72106109D02*
X106951904Y-72106109D01*
X106951904Y-72106109D02*
X106880475Y-72129919D01*
X106880475Y-72129919D02*
X106856666Y-72153728D01*
X106404285Y-72606109D02*
X106642380Y-72606109D01*
X106642380Y-72606109D02*
X106642380Y-72106109D01*
X106237618Y-72606109D02*
X106237618Y-72106109D01*
X105951904Y-72606109D02*
X106166189Y-72320395D01*
X105951904Y-72106109D02*
X106237618Y-72391823D01*
X105118571Y-72606109D02*
X105356666Y-72606109D01*
X105356666Y-72606109D02*
X105356666Y-72106109D01*
X104951904Y-72344204D02*
X104785237Y-72344204D01*
X104713809Y-72606109D02*
X104951904Y-72606109D01*
X104951904Y-72606109D02*
X104951904Y-72106109D01*
X104951904Y-72106109D02*
X104713809Y-72106109D01*
X104499523Y-72606109D02*
X104499523Y-72106109D01*
X104499523Y-72106109D02*
X104380475Y-72106109D01*
X104380475Y-72106109D02*
X104309047Y-72129919D01*
X104309047Y-72129919D02*
X104261428Y-72177538D01*
X104261428Y-72177538D02*
X104237618Y-72225157D01*
X104237618Y-72225157D02*
X104213809Y-72320395D01*
X104213809Y-72320395D02*
X104213809Y-72391823D01*
X104213809Y-72391823D02*
X104237618Y-72487061D01*
X104237618Y-72487061D02*
X104261428Y-72534680D01*
X104261428Y-72534680D02*
X104309047Y-72582300D01*
X104309047Y-72582300D02*
X104380475Y-72606109D01*
X104380475Y-72606109D02*
X104499523Y-72606109D01*
D12*
X109700000Y-86160000D03*
D13*
X109700000Y-83620000D03*
X109700000Y-81080000D03*
X109700000Y-78540000D03*
X109700000Y-76000000D03*
D14*
X109000000Y-98750000D03*
X108500000Y-98750000D03*
X108000000Y-98750000D03*
X105500000Y-98750000D03*
X105000000Y-98750000D03*
X104500000Y-98750000D03*
X104000000Y-98750000D03*
X101500000Y-98750000D03*
X101000000Y-98750000D03*
X100500000Y-98750000D03*
X100000000Y-98750000D03*
X99500000Y-98750000D03*
X99000000Y-98750000D03*
X98500000Y-98750000D03*
X98000000Y-98750000D03*
X97500000Y-98750000D03*
X97000000Y-98750000D03*
X96500000Y-98750000D03*
X96000000Y-98750000D03*
X95500000Y-98750000D03*
X95000000Y-98750000D03*
X94500000Y-98750000D03*
X94000000Y-98750000D03*
X93500000Y-98750000D03*
X93000000Y-98750000D03*
X92500000Y-98750000D03*
X92000000Y-98750000D03*
X91500000Y-98750000D03*
X91000000Y-98750000D03*
D15*
X100000000Y-70000000D03*
D16*
X100000000Y-70900000D03*
D17*
X105690000Y-70950000D03*
D18*
X105190000Y-70950000D03*
X106190000Y-70950000D03*
D19*
X96150000Y-94500000D03*
D20*
X103600000Y-93500000D03*
D21*
X100000000Y-96500000D03*
X90500000Y-81000000D03*
X90500000Y-85000000D03*
X92000000Y-70500000D03*
X90500000Y-83000000D03*
X93000000Y-70500000D03*
X101000000Y-96500000D03*
X110000000Y-70500000D03*
X95000000Y-96500000D03*
X96500000Y-75000000D03*
X97000000Y-96500000D03*
X109000000Y-70500000D03*
X90500000Y-76000000D03*
X90500000Y-84000000D03*
X91000000Y-70500000D03*
X94000000Y-96500000D03*
X96000000Y-96500000D03*
X90500000Y-86000000D03*
X92000000Y-96500000D03*
X99000000Y-96500000D03*
X108000000Y-70500000D03*
X105000000Y-96500000D03*
X96500000Y-76000000D03*
X94000000Y-70500000D03*
X107000000Y-70500000D03*
X90500000Y-74000000D03*
X90500000Y-82000000D03*
X110000000Y-74000000D03*
X93000000Y-96500000D03*
X98000000Y-96500000D03*
X90500000Y-75000000D03*
X93000000Y-74000000D03*
X90500000Y-87000000D03*
X90500000Y-80000000D03*
X90000000Y-70500000D03*
X104000000Y-96500000D03*
D20*
X107257536Y-92742464D03*
X99540000Y-86110000D03*
X108000000Y-92000000D03*
X98797536Y-85367536D03*
D19*
X104190031Y-71419102D03*
D22*
X91500000Y-98750000D02*
X91250000Y-98750000D01*
D23*
X91250000Y-98750000D02*
X91250000Y-96000000D01*
X96140000Y-94010000D02*
X93240000Y-94010000D01*
D22*
X91250000Y-98750000D02*
X91000000Y-98750000D01*
D23*
X106769954Y-94010000D02*
X103610000Y-94010000D01*
X103610000Y-94010000D02*
X96140000Y-94010000D01*
X108750000Y-95990046D02*
X108750000Y-98750000D01*
X106769954Y-94010000D02*
X108750000Y-95990046D01*
X103600000Y-94000000D02*
X103610000Y-94010000D01*
D22*
X96150000Y-94500000D02*
X96150000Y-94020000D01*
X96150000Y-94020000D02*
X96140000Y-94010000D01*
X108750000Y-98750000D02*
X109000000Y-98750000D01*
X108500000Y-98750000D02*
X108750000Y-98750000D01*
D23*
X103600000Y-93500000D02*
X103600000Y-94000000D01*
X91250000Y-96000000D02*
X93240000Y-94010000D01*
D24*
X100756874Y-85817537D02*
X99832463Y-85817537D01*
X107257536Y-92742464D02*
X107257536Y-92318199D01*
X99832463Y-85817537D02*
X99540000Y-86110000D01*
X107257536Y-92318199D02*
X100756874Y-85817537D01*
X108000000Y-92000000D02*
X107575735Y-92000000D01*
X107575735Y-92000000D02*
X100943271Y-85367536D01*
X100943271Y-85367536D02*
X98797536Y-85367536D01*
D22*
X104659133Y-70950000D02*
X104190031Y-71419102D01*
X105190000Y-70950000D02*
X104659133Y-70950000D01*
G04 #@! TA.AperFunction,Conductor*
G36*
X104644091Y-70014352D02*
G01*
X104658443Y-70049000D01*
X104650185Y-70076223D01*
X104603452Y-70146163D01*
X104589500Y-70216306D01*
X104589500Y-70594076D01*
X104575148Y-70628724D01*
X104553183Y-70641406D01*
X104533496Y-70646681D01*
X104533492Y-70646682D01*
X104490509Y-70671500D01*
X104482699Y-70676008D01*
X104459274Y-70689532D01*
X104459268Y-70689537D01*
X104290997Y-70857808D01*
X104256349Y-70872160D01*
X104249953Y-70871741D01*
X104190031Y-70863852D01*
X104046322Y-70882771D01*
X103912410Y-70938238D01*
X103912405Y-70938241D01*
X103797410Y-71026480D01*
X103797409Y-71026481D01*
X103709170Y-71141476D01*
X103709167Y-71141481D01*
X103653700Y-71275393D01*
X103634781Y-71419102D01*
X103653700Y-71562810D01*
X103709167Y-71696722D01*
X103709170Y-71696727D01*
X103752991Y-71753836D01*
X103797410Y-71811723D01*
X103912406Y-71899963D01*
X103924679Y-71905046D01*
X103951197Y-71931563D01*
X103954928Y-71950316D01*
X103954928Y-72865336D01*
X107425070Y-72865336D01*
X107425070Y-71846882D01*
X105806049Y-71846882D01*
X105771401Y-71832530D01*
X105757049Y-71797882D01*
X105765307Y-71770659D01*
X105765554Y-71770289D01*
X105776546Y-71753839D01*
X105790500Y-71683688D01*
X105790500Y-71277500D01*
X105804852Y-71242852D01*
X105839500Y-71228500D01*
X105857995Y-71228500D01*
X105857998Y-71228500D01*
X105916481Y-71216867D01*
X105982802Y-71172552D01*
X106027117Y-71106231D01*
X106038750Y-71047748D01*
X106038750Y-70852252D01*
X106027117Y-70793769D01*
X106000551Y-70754012D01*
X105982802Y-70727447D01*
X105943045Y-70700882D01*
X105916481Y-70683133D01*
X105857998Y-70671500D01*
X105857995Y-70671500D01*
X105839500Y-70671500D01*
X105804852Y-70657148D01*
X105790500Y-70622500D01*
X105790500Y-70216312D01*
X105790499Y-70216306D01*
X105776547Y-70146163D01*
X105729815Y-70076223D01*
X105722499Y-70039440D01*
X105743334Y-70008258D01*
X105770557Y-70000000D01*
X110498745Y-70000000D01*
X110501249Y-70000064D01*
X110506834Y-70000349D01*
X110571687Y-70003669D01*
X110584709Y-70006131D01*
X110719877Y-70051326D01*
X110733248Y-70058235D01*
X110757859Y-70076223D01*
X110847565Y-70141788D01*
X110858211Y-70152434D01*
X110941763Y-70266749D01*
X110948674Y-70280125D01*
X110993866Y-70415284D01*
X110996331Y-70428317D01*
X110999936Y-70498749D01*
X111000000Y-70501254D01*
X111000000Y-95798801D01*
X110999942Y-95801189D01*
X110998492Y-95830901D01*
X110994820Y-95847264D01*
X110971652Y-95903197D01*
X110961030Y-95919094D01*
X110919094Y-95961030D01*
X110903197Y-95971652D01*
X110847264Y-95994820D01*
X110830902Y-95998492D01*
X110805744Y-95999719D01*
X110801186Y-95999942D01*
X110798802Y-96000000D01*
X110450000Y-96000000D01*
X110384455Y-96002139D01*
X110384447Y-96002140D01*
X110257833Y-96036066D01*
X110257830Y-96036067D01*
X110144305Y-96101612D01*
X110144305Y-96101613D01*
X110051613Y-96194305D01*
X110051612Y-96194305D01*
X109986067Y-96307830D01*
X109986066Y-96307833D01*
X109952140Y-96434447D01*
X109952139Y-96434455D01*
X109950000Y-96500000D01*
X109950000Y-97451000D01*
X109935648Y-97485648D01*
X109901000Y-97500000D01*
X109419641Y-97500000D01*
X109384993Y-97485648D01*
X109371583Y-97460561D01*
X109363867Y-97421769D01*
X109349162Y-97399762D01*
X109319552Y-97355447D01*
X109269923Y-97322286D01*
X109253231Y-97311133D01*
X109253230Y-97311132D01*
X109253229Y-97311132D01*
X109239939Y-97308488D01*
X109208757Y-97287651D01*
X109200500Y-97260430D01*
X109200500Y-95930734D01*
X109171469Y-95822392D01*
X109171468Y-95822388D01*
X109171468Y-95822389D01*
X109169799Y-95816160D01*
X109169799Y-95816159D01*
X109110489Y-95713432D01*
X107046568Y-93649511D01*
X106943842Y-93590201D01*
X106943840Y-93590200D01*
X106919627Y-93583713D01*
X106889505Y-93575642D01*
X106829265Y-93559500D01*
X106829263Y-93559500D01*
X104253723Y-93559500D01*
X104219075Y-93545148D01*
X104204723Y-93510500D01*
X104205142Y-93504107D01*
X104205682Y-93500003D01*
X104205682Y-93500000D01*
X104200919Y-93463819D01*
X104200500Y-93457424D01*
X104200500Y-93450118D01*
X104200052Y-93447868D01*
X104197627Y-93438821D01*
X104185044Y-93343238D01*
X104124536Y-93197159D01*
X104028282Y-93071718D01*
X103993853Y-93045300D01*
X103902841Y-92975464D01*
X103902836Y-92975461D01*
X103756761Y-92914955D01*
X103600000Y-92894318D01*
X103443238Y-92914955D01*
X103297163Y-92975461D01*
X103297158Y-92975464D01*
X103171718Y-93071717D01*
X103171717Y-93071718D01*
X103075464Y-93197158D01*
X103075461Y-93197163D01*
X103014955Y-93343238D01*
X103002371Y-93438821D01*
X102999943Y-93447885D01*
X102999500Y-93450116D01*
X102999500Y-93457424D01*
X102999081Y-93463819D01*
X102994318Y-93500000D01*
X102994318Y-93500003D01*
X102994858Y-93504107D01*
X102985149Y-93540332D01*
X102952670Y-93559081D01*
X102946277Y-93559500D01*
X93180688Y-93559500D01*
X93090326Y-93583713D01*
X93066115Y-93590199D01*
X93066110Y-93590201D01*
X92963385Y-93649511D01*
X92963385Y-93649512D01*
X90889512Y-95723385D01*
X90889511Y-95723385D01*
X90830201Y-95826111D01*
X90828532Y-95832343D01*
X90828531Y-95832342D01*
X90828531Y-95832346D01*
X90799500Y-95940688D01*
X90799500Y-97260430D01*
X90785148Y-97295078D01*
X90760061Y-97308488D01*
X90746770Y-97311132D01*
X90680447Y-97355447D01*
X90636133Y-97421768D01*
X90636133Y-97421769D01*
X90628416Y-97460560D01*
X90607582Y-97491742D01*
X90580359Y-97500000D01*
X90099000Y-97500000D01*
X90064352Y-97485648D01*
X90050000Y-97451000D01*
X90050000Y-96500000D01*
X90047861Y-96434455D01*
X90013933Y-96307833D01*
X90013932Y-96307830D01*
X89972378Y-96235857D01*
X89948388Y-96194306D01*
X89855694Y-96101612D01*
X89742169Y-96036067D01*
X89742166Y-96036066D01*
X89615552Y-96002140D01*
X89615545Y-96002139D01*
X89550000Y-96000000D01*
X89549998Y-96000000D01*
X89201198Y-96000000D01*
X89198812Y-95999942D01*
X89196310Y-95999820D01*
X89169098Y-95998492D01*
X89152735Y-95994820D01*
X89096802Y-95971652D01*
X89080905Y-95961030D01*
X89038969Y-95919094D01*
X89028347Y-95903197D01*
X89005179Y-95847264D01*
X89001507Y-95830900D01*
X89001273Y-95826111D01*
X89000058Y-95801188D01*
X89000000Y-95798801D01*
X89000000Y-85367536D01*
X98191854Y-85367536D01*
X98212491Y-85524297D01*
X98272997Y-85670372D01*
X98273000Y-85670377D01*
X98369254Y-85795818D01*
X98494695Y-85892072D01*
X98494697Y-85892072D01*
X98494699Y-85892074D01*
X98639649Y-85952114D01*
X98640774Y-85952580D01*
X98797536Y-85973218D01*
X98891744Y-85960815D01*
X98927968Y-85970522D01*
X98946720Y-86003000D01*
X98946720Y-86015791D01*
X98934318Y-86109999D01*
X98954955Y-86266761D01*
X99015461Y-86412836D01*
X99015464Y-86412841D01*
X99111718Y-86538282D01*
X99237159Y-86634536D01*
X99237161Y-86634536D01*
X99237163Y-86634538D01*
X99383238Y-86695044D01*
X99540000Y-86715682D01*
X99696762Y-86695044D01*
X99842841Y-86634536D01*
X99968282Y-86538282D01*
X100064536Y-86412841D01*
X100125044Y-86266762D01*
X100139015Y-86160640D01*
X100157767Y-86128163D01*
X100187596Y-86118037D01*
X100612107Y-86118037D01*
X100646755Y-86132389D01*
X106798561Y-92284195D01*
X106812913Y-92318843D01*
X106802788Y-92348672D01*
X106732999Y-92439624D01*
X106732998Y-92439624D01*
X106672491Y-92585702D01*
X106651854Y-92742464D01*
X106672491Y-92899225D01*
X106732997Y-93045300D01*
X106733000Y-93045305D01*
X106829254Y-93170746D01*
X106954695Y-93267000D01*
X106954697Y-93267000D01*
X106954699Y-93267002D01*
X107100774Y-93327508D01*
X107257536Y-93348146D01*
X107414298Y-93327508D01*
X107560377Y-93267000D01*
X107685818Y-93170746D01*
X107782072Y-93045305D01*
X107842580Y-92899226D01*
X107863218Y-92742464D01*
X107850815Y-92648255D01*
X107860522Y-92612031D01*
X107893000Y-92593279D01*
X107905789Y-92593279D01*
X108000000Y-92605682D01*
X108156762Y-92585044D01*
X108302841Y-92524536D01*
X108428282Y-92428282D01*
X108524536Y-92302841D01*
X108585044Y-92156762D01*
X108605682Y-92000000D01*
X108585044Y-91843238D01*
X108524536Y-91697159D01*
X108428282Y-91571718D01*
X108302841Y-91475464D01*
X108302839Y-91475463D01*
X108302836Y-91475461D01*
X108156761Y-91414955D01*
X108000000Y-91394318D01*
X107843238Y-91414955D01*
X107697160Y-91475462D01*
X107697160Y-91475463D01*
X107606208Y-91545252D01*
X107569983Y-91554958D01*
X107541731Y-91541025D01*
X101127784Y-85127078D01*
X101127778Y-85127073D01*
X101118077Y-85121473D01*
X101118077Y-85121472D01*
X101118075Y-85121472D01*
X101059262Y-85087515D01*
X101059258Y-85087514D01*
X100982835Y-85067036D01*
X100982833Y-85067036D01*
X99348032Y-85067036D01*
X99313384Y-85052684D01*
X99309158Y-85047865D01*
X99225818Y-84939254D01*
X99225817Y-84939253D01*
X99100377Y-84843000D01*
X99100372Y-84842997D01*
X98954297Y-84782491D01*
X98797536Y-84761854D01*
X98640774Y-84782491D01*
X98494699Y-84842997D01*
X98494694Y-84843000D01*
X98369254Y-84939253D01*
X98369253Y-84939254D01*
X98273000Y-85064694D01*
X98272997Y-85064699D01*
X98212491Y-85210774D01*
X98191854Y-85367536D01*
X89000000Y-85367536D01*
X89000000Y-83620000D01*
X108644417Y-83620000D01*
X108664700Y-83825934D01*
X108724768Y-84023954D01*
X108822315Y-84206450D01*
X108953590Y-84366410D01*
X109113550Y-84497685D01*
X109296046Y-84595232D01*
X109494066Y-84655300D01*
X109700000Y-84675583D01*
X109905934Y-84655300D01*
X110103954Y-84595232D01*
X110286450Y-84497685D01*
X110446410Y-84366410D01*
X110577685Y-84206450D01*
X110675232Y-84023954D01*
X110735300Y-83825934D01*
X110755583Y-83620000D01*
X110735300Y-83414066D01*
X110675232Y-83216046D01*
X110577685Y-83033550D01*
X110446410Y-82873590D01*
X110286450Y-82742315D01*
X110103954Y-82644768D01*
X109905934Y-82584700D01*
X109700000Y-82564417D01*
X109494065Y-82584700D01*
X109494064Y-82584700D01*
X109296043Y-82644769D01*
X109113548Y-82742316D01*
X108953590Y-82873590D01*
X108822316Y-83033548D01*
X108724769Y-83216043D01*
X108664700Y-83414064D01*
X108664700Y-83414065D01*
X108664700Y-83414066D01*
X108644417Y-83620000D01*
X89000000Y-83620000D01*
X89000000Y-81080000D01*
X108644417Y-81080000D01*
X108664700Y-81285934D01*
X108724768Y-81483954D01*
X108822315Y-81666450D01*
X108953590Y-81826410D01*
X109113550Y-81957685D01*
X109296046Y-82055232D01*
X109494066Y-82115300D01*
X109700000Y-82135583D01*
X109905934Y-82115300D01*
X110103954Y-82055232D01*
X110286450Y-81957685D01*
X110446410Y-81826410D01*
X110577685Y-81666450D01*
X110675232Y-81483954D01*
X110735300Y-81285934D01*
X110755583Y-81080000D01*
X110735300Y-80874066D01*
X110675232Y-80676046D01*
X110577685Y-80493550D01*
X110446410Y-80333590D01*
X110286450Y-80202315D01*
X110103954Y-80104768D01*
X109905934Y-80044700D01*
X109700000Y-80024417D01*
X109494065Y-80044700D01*
X109494064Y-80044700D01*
X109296043Y-80104769D01*
X109113548Y-80202316D01*
X108953590Y-80333590D01*
X108822316Y-80493548D01*
X108724769Y-80676043D01*
X108664700Y-80874064D01*
X108664700Y-80874065D01*
X108664700Y-80874066D01*
X108644417Y-81080000D01*
X89000000Y-81080000D01*
X89000000Y-78540000D01*
X108644417Y-78540000D01*
X108664700Y-78745934D01*
X108724768Y-78943954D01*
X108822315Y-79126450D01*
X108953590Y-79286410D01*
X109113550Y-79417685D01*
X109296046Y-79515232D01*
X109494066Y-79575300D01*
X109700000Y-79595583D01*
X109905934Y-79575300D01*
X110103954Y-79515232D01*
X110286450Y-79417685D01*
X110446410Y-79286410D01*
X110577685Y-79126450D01*
X110675232Y-78943954D01*
X110735300Y-78745934D01*
X110755583Y-78540000D01*
X110735300Y-78334066D01*
X110675232Y-78136046D01*
X110577685Y-77953550D01*
X110446410Y-77793590D01*
X110286450Y-77662315D01*
X110103954Y-77564768D01*
X109905934Y-77504700D01*
X109700000Y-77484417D01*
X109494065Y-77504700D01*
X109494064Y-77504700D01*
X109296043Y-77564769D01*
X109113548Y-77662316D01*
X108953590Y-77793590D01*
X108822316Y-77953548D01*
X108724769Y-78136043D01*
X108664700Y-78334064D01*
X108664700Y-78334065D01*
X108664700Y-78334066D01*
X108644417Y-78540000D01*
X89000000Y-78540000D01*
X89000000Y-76000000D01*
X108644417Y-76000000D01*
X108664700Y-76205934D01*
X108724768Y-76403954D01*
X108822315Y-76586450D01*
X108953590Y-76746410D01*
X109113550Y-76877685D01*
X109296046Y-76975232D01*
X109494066Y-77035300D01*
X109700000Y-77055583D01*
X109905934Y-77035300D01*
X110103954Y-76975232D01*
X110286450Y-76877685D01*
X110446410Y-76746410D01*
X110577685Y-76586450D01*
X110675232Y-76403954D01*
X110735300Y-76205934D01*
X110755583Y-76000000D01*
X110735300Y-75794066D01*
X110675232Y-75596046D01*
X110577685Y-75413550D01*
X110446410Y-75253590D01*
X110286450Y-75122315D01*
X110103954Y-75024768D01*
X109905934Y-74964700D01*
X109700000Y-74944417D01*
X109494065Y-74964700D01*
X109494064Y-74964700D01*
X109296043Y-75024769D01*
X109113548Y-75122316D01*
X108953590Y-75253590D01*
X108822316Y-75413548D01*
X108724769Y-75596043D01*
X108664700Y-75794064D01*
X108664700Y-75794065D01*
X108664700Y-75794066D01*
X108644417Y-76000000D01*
X89000000Y-76000000D01*
X89000000Y-70501254D01*
X89000064Y-70498750D01*
X89000148Y-70497105D01*
X89003669Y-70428311D01*
X89006131Y-70415292D01*
X89051327Y-70280119D01*
X89058233Y-70266753D01*
X89141791Y-70152430D01*
X89152430Y-70141791D01*
X89266753Y-70058233D01*
X89280119Y-70051327D01*
X89415292Y-70006131D01*
X89428311Y-70003669D01*
X89493461Y-70000334D01*
X89498751Y-70000064D01*
X89501255Y-70000000D01*
X104609443Y-70000000D01*
X104644091Y-70014352D01*
G37*
G04 #@! TD.AperFunction*
G04 #@! TA.AperFunction,Conductor*
G36*
X95581226Y-94474852D02*
G01*
X95595159Y-94503105D01*
X95599081Y-94532897D01*
X95599500Y-94539292D01*
X95599500Y-94539884D01*
X95600440Y-94544614D01*
X95600170Y-94544667D01*
X95601074Y-94548042D01*
X95613669Y-94643708D01*
X95669136Y-94777620D01*
X95669139Y-94777625D01*
X95757379Y-94892621D01*
X95872375Y-94980861D01*
X95872377Y-94980861D01*
X95872379Y-94980863D01*
X96006291Y-95036330D01*
X96150000Y-95055250D01*
X96293709Y-95036330D01*
X96427625Y-94980861D01*
X96542621Y-94892621D01*
X96630861Y-94777625D01*
X96686330Y-94643709D01*
X96698923Y-94548049D01*
X96699833Y-94544671D01*
X96699558Y-94544617D01*
X96700500Y-94539884D01*
X96700500Y-94539292D01*
X96700919Y-94532897D01*
X96704841Y-94503105D01*
X96723592Y-94470626D01*
X96753422Y-94460500D01*
X103550691Y-94460500D01*
X106563055Y-94460500D01*
X106597703Y-94474852D01*
X108285148Y-96162297D01*
X108299500Y-96196945D01*
X108299500Y-97260430D01*
X108285148Y-97295078D01*
X108259999Y-97308500D01*
X108259498Y-97308599D01*
X108240441Y-97308588D01*
X108212100Y-97302951D01*
X108194748Y-97299500D01*
X107805252Y-97299500D01*
X107750002Y-97310490D01*
X107746769Y-97311133D01*
X107680447Y-97355447D01*
X107636133Y-97421768D01*
X107636133Y-97421769D01*
X107628416Y-97460560D01*
X107607582Y-97491742D01*
X107580359Y-97500000D01*
X107259000Y-97500000D01*
X107224352Y-97485648D01*
X107210000Y-97451000D01*
X107210000Y-97100002D01*
X107210000Y-97100000D01*
X107207433Y-97021346D01*
X107166719Y-96869399D01*
X107166718Y-96869398D01*
X107166718Y-96869396D01*
X107088065Y-96733166D01*
X106976833Y-96621934D01*
X106840603Y-96543281D01*
X106840599Y-96543280D01*
X106688661Y-96502568D01*
X106688654Y-96502567D01*
X106610000Y-96500000D01*
X106531346Y-96502567D01*
X106531338Y-96502568D01*
X106379400Y-96543280D01*
X106379396Y-96543281D01*
X106243166Y-96621934D01*
X106243166Y-96621935D01*
X106131935Y-96733166D01*
X106131934Y-96733166D01*
X106053281Y-96869396D01*
X106053280Y-96869400D01*
X106012568Y-97021338D01*
X106012567Y-97021346D01*
X106010000Y-97100002D01*
X106010000Y-97451000D01*
X105995648Y-97485648D01*
X105961000Y-97500000D01*
X105919641Y-97500000D01*
X105884993Y-97485648D01*
X105871583Y-97460561D01*
X105863867Y-97421769D01*
X105849162Y-97399762D01*
X105819552Y-97355447D01*
X105779795Y-97328882D01*
X105753231Y-97311133D01*
X105694748Y-97299500D01*
X105305252Y-97299500D01*
X105250002Y-97310490D01*
X105246769Y-97311133D01*
X105180447Y-97355447D01*
X105136133Y-97421768D01*
X105136133Y-97421769D01*
X105128416Y-97460560D01*
X105107582Y-97491742D01*
X105080359Y-97500000D01*
X104919641Y-97500000D01*
X104884993Y-97485648D01*
X104871583Y-97460561D01*
X104863867Y-97421769D01*
X104849162Y-97399762D01*
X104819552Y-97355447D01*
X104779795Y-97328882D01*
X104753231Y-97311133D01*
X104694748Y-97299500D01*
X104305252Y-97299500D01*
X104290668Y-97302400D01*
X104259558Y-97308588D01*
X104240442Y-97308588D01*
X104209331Y-97302400D01*
X104194748Y-97299500D01*
X103805252Y-97299500D01*
X103750002Y-97310490D01*
X103746769Y-97311133D01*
X103680447Y-97355447D01*
X103636133Y-97421768D01*
X103636133Y-97421769D01*
X103628416Y-97460560D01*
X103607582Y-97491742D01*
X103580359Y-97500000D01*
X103259000Y-97500000D01*
X103224352Y-97485648D01*
X103210000Y-97451000D01*
X103210000Y-97100002D01*
X103210000Y-97100000D01*
X103207433Y-97021346D01*
X103166719Y-96869399D01*
X103166718Y-96869398D01*
X103166718Y-96869396D01*
X103088065Y-96733166D01*
X102976833Y-96621934D01*
X102840603Y-96543281D01*
X102840599Y-96543280D01*
X102688661Y-96502568D01*
X102688654Y-96502567D01*
X102610000Y-96500000D01*
X102531346Y-96502567D01*
X102531338Y-96502568D01*
X102379400Y-96543280D01*
X102379396Y-96543281D01*
X102243166Y-96621934D01*
X102243166Y-96621935D01*
X102131935Y-96733166D01*
X102131934Y-96733166D01*
X102053281Y-96869396D01*
X102053280Y-96869400D01*
X102012568Y-97021338D01*
X102012567Y-97021346D01*
X102010000Y-97100002D01*
X102010000Y-97451000D01*
X101995648Y-97485648D01*
X101961000Y-97500000D01*
X101919641Y-97500000D01*
X101884993Y-97485648D01*
X101871583Y-97460561D01*
X101863867Y-97421769D01*
X101849162Y-97399762D01*
X101819552Y-97355447D01*
X101779795Y-97328882D01*
X101753231Y-97311133D01*
X101694748Y-97299500D01*
X101305252Y-97299500D01*
X101290668Y-97302400D01*
X101259558Y-97308588D01*
X101240442Y-97308588D01*
X101209331Y-97302400D01*
X101194748Y-97299500D01*
X100805252Y-97299500D01*
X100750002Y-97310490D01*
X100746769Y-97311133D01*
X100680447Y-97355447D01*
X100636133Y-97421768D01*
X100636133Y-97421769D01*
X100628416Y-97460560D01*
X100607582Y-97491742D01*
X100580359Y-97500000D01*
X100419641Y-97500000D01*
X100384993Y-97485648D01*
X100371583Y-97460561D01*
X100363867Y-97421769D01*
X100349162Y-97399762D01*
X100319552Y-97355447D01*
X100279795Y-97328882D01*
X100253231Y-97311133D01*
X100194748Y-97299500D01*
X99805252Y-97299500D01*
X99790668Y-97302400D01*
X99759558Y-97308588D01*
X99740442Y-97308588D01*
X99709331Y-97302400D01*
X99694748Y-97299500D01*
X99305252Y-97299500D01*
X99290668Y-97302400D01*
X99259558Y-97308588D01*
X99240442Y-97308588D01*
X99209331Y-97302400D01*
X99194748Y-97299500D01*
X98805252Y-97299500D01*
X98790668Y-97302400D01*
X98759558Y-97308588D01*
X98740442Y-97308588D01*
X98709331Y-97302400D01*
X98694748Y-97299500D01*
X98305252Y-97299500D01*
X98290668Y-97302400D01*
X98259558Y-97308588D01*
X98240442Y-97308588D01*
X98209331Y-97302400D01*
X98194748Y-97299500D01*
X97805252Y-97299500D01*
X97790668Y-97302400D01*
X97759558Y-97308588D01*
X97740442Y-97308588D01*
X97709331Y-97302400D01*
X97694748Y-97299500D01*
X97305252Y-97299500D01*
X97290668Y-97302400D01*
X97259558Y-97308588D01*
X97240442Y-97308588D01*
X97209331Y-97302400D01*
X97194748Y-97299500D01*
X96805252Y-97299500D01*
X96790668Y-97302400D01*
X96759558Y-97308588D01*
X96740442Y-97308588D01*
X96709331Y-97302400D01*
X96694748Y-97299500D01*
X96305252Y-97299500D01*
X96290668Y-97302400D01*
X96259558Y-97308588D01*
X96240442Y-97308588D01*
X96209331Y-97302400D01*
X96194748Y-97299500D01*
X95805252Y-97299500D01*
X95790668Y-97302400D01*
X95759558Y-97308588D01*
X95740442Y-97308588D01*
X95709331Y-97302400D01*
X95694748Y-97299500D01*
X95305252Y-97299500D01*
X95290668Y-97302400D01*
X95259558Y-97308588D01*
X95240442Y-97308588D01*
X95209331Y-97302400D01*
X95194748Y-97299500D01*
X94805252Y-97299500D01*
X94790668Y-97302400D01*
X94759558Y-97308588D01*
X94740442Y-97308588D01*
X94709331Y-97302400D01*
X94694748Y-97299500D01*
X94305252Y-97299500D01*
X94290668Y-97302400D01*
X94259558Y-97308588D01*
X94240442Y-97308588D01*
X94209331Y-97302400D01*
X94194748Y-97299500D01*
X93805252Y-97299500D01*
X93790668Y-97302400D01*
X93759558Y-97308588D01*
X93740442Y-97308588D01*
X93709331Y-97302400D01*
X93694748Y-97299500D01*
X93305252Y-97299500D01*
X93290668Y-97302400D01*
X93259558Y-97308588D01*
X93240442Y-97308588D01*
X93209331Y-97302400D01*
X93194748Y-97299500D01*
X92805252Y-97299500D01*
X92790668Y-97302400D01*
X92759558Y-97308588D01*
X92740442Y-97308588D01*
X92709331Y-97302400D01*
X92694748Y-97299500D01*
X92305252Y-97299500D01*
X92290668Y-97302400D01*
X92259558Y-97308588D01*
X92240442Y-97308588D01*
X92209331Y-97302400D01*
X92194748Y-97299500D01*
X91805252Y-97299500D01*
X91790668Y-97302400D01*
X91759558Y-97308588D01*
X91740483Y-97308596D01*
X91739983Y-97308497D01*
X91708782Y-97287689D01*
X91700500Y-97260430D01*
X91700500Y-96206899D01*
X91714852Y-96172251D01*
X93412251Y-94474852D01*
X93446899Y-94460500D01*
X95546578Y-94460500D01*
X95581226Y-94474852D01*
G37*
G04 #@! TD.AperFunction*
M02*
