{
  "log" : {
    "version" : "1.2",
    "pages" : [ ],
    "entries" : [ {
      "startedDateTime" : "2021-12-23T02:16:42.172Z",
      "request" : {
        "method" : "GET",
        "url" : "https://sample-web-service-aut.herokuapp.com/api/users/9",
        "httpVersion" : "",
        "cookies" : [ ],
        "headers" : [ ],
        "queryString" : [ ],
        "headersSize" : 0,
        "bodySize" : 0,
        "comment" : ""
      },
      "response" : {
        "status" : 200,
        "statusText" : "",
        "httpVersion" : "",
        "cookies" : [ ],
        "headers" : [ {
          "name" : "Transfer-Encoding",
          "value" : "chunked"
        }, {
          "name" : "Server",
          "value" : "Cowboy"
        }, {
          "name" : "Connection",
          "value" : "keep-alive"
        }, {
          "name" : "#status#",
          "value" : "HTTP/1.1 200 "
        }, {
          "name" : "X-Application-Context",
          "value" : "application:45575"
        }, {
          "name" : "Date",
          "value" : "Thu, 23 Dec 2021 02:16:43 GMT"
        }, {
          "name" : "Content-Type",
          "value" : "application/json;charset=UTF-8"
        }, {
          "name" : "Via",
          "value" : "1.1 vegur"
        } ],
        "content" : {
          "size" : 88,
          "mimeType" : "application/json;charset=UTF-8",
          "text" : "{\"id\":9,\"username\":\"mimi\",\"password\":\"123456789\",\"gender\":\"MALE\",\"age\":25,\"avatar\":null}",
          "comment" : ""
        },
        "redirectURL" : "",
        "headersSize" : 181,
        "bodySize" : -1,
        "comment" : ""
      },
      "cache" : { },
      "timings" : {
        "comment" : "",
        "connect" : 1021,
        "dns" : -1,
        "blocked" : -1,
        "send" : 0,
        "wait" : 0,
        "receive" : 0,
        "ssl" : -1
      },
      "comment" : "",
      "_katalonRequestInformation" : {
        "name" : "1",
        "testObjectId" : "Object Repository/GET user by id",
        "harId" : "49bfecec-dcc2-42a7-9a4c-ba642b0005e6",
        "reportFolder" : null
      },
      "time" : 1021
    } ],
    "comment" : ""
  }
}