{
  "log" : {
    "version" : "1.2",
    "pages" : [ ],
    "entries" : [ {
      "startedDateTime" : "2021-12-22T10:48:58.600Z",
      "request" : {
        "method" : "GET",
        "url" : "https://sample-web-service-aut.herokuapp.com/api/users/13",
        "httpVersion" : "",
        "cookies" : [ ],
        "headers" : [ ],
        "queryString" : [ ],
        "headersSize" : 0,
        "bodySize" : 0,
        "comment" : ""
      },
      "response" : {
        "status" : 200,
        "statusText" : "",
        "httpVersion" : "",
        "cookies" : [ ],
        "headers" : [ {
          "name" : "Transfer-Encoding",
          "value" : "chunked"
        }, {
          "name" : "Server",
          "value" : "Cowboy"
        }, {
          "name" : "Connection",
          "value" : "keep-alive"
        }, {
          "name" : "#status#",
          "value" : "HTTP/1.1 200 "
        }, {
          "name" : "X-Application-Context",
          "value" : "application:45002"
        }, {
          "name" : "Date",
          "value" : "Wed, 22 Dec 2021 10:48:59 GMT"
        }, {
          "name" : "Content-Type",
          "value" : "application/json;charset=UTF-8"
        }, {
          "name" : "Via",
          "value" : "1.1 vegur"
        } ],
        "content" : {
          "size" : 89,
          "mimeType" : "application/json;charset=UTF-8",
          "text" : "{\"id\":13,\"username\":\"mimi\",\"password\":\"123456789\",\"gender\":\"MALE\",\"age\":25,\"avatar\":null}",
          "comment" : ""
        },
        "redirectURL" : "",
        "headersSize" : 181,
        "bodySize" : -1,
        "comment" : ""
      },
      "cache" : { },
      "timings" : {
        "comment" : "",
        "ssl" : -1,
        "connect" : 1087,
        "send" : 0,
        "dns" : -1,
        "blocked" : -1,
        "wait" : 0,
        "receive" : 0
      },
      "comment" : "",
      "_katalonRequestInformation" : {
        "name" : "3",
        "testObjectId" : "Object Repository/GET user by id",
        "harId" : "68285ea2-f7f4-4597-9698-e68057b3832a",
        "reportFolder" : null
      },
      "time" : 1087
    } ],
    "comment" : ""
  }
}