Division,WeightClassKg,Place,Name,Team,BodyweightKg,Best3SquatKg,Best3BenchKg,Best3DeadliftKg,TotalKg,Equipment,Event,Sex
Boys,51.71,1,Brian Villarreal,Geronimo Navarro,46.27,113.4,68.04,140.61,322.05,Single-ply,SBD,M
Boys,51.71,2,Andre Alli,Cedar Park Vista Ridge,49.8,70.31,45.36,86.18,201.85,Single-ply,SBD,M
Boys,51.71,DQ,Ty Henderson,Lockhart,50.17,99.79,58.97,,,Single-ply,SBD,M
Boys,51.71,NS,Louise Sanchez,Austin Lake Travis,,,,,,Single-ply,SBD,M
Boys,55.79,1,Cullen Gonzales,Marion,54.98,81.65,70.31,90.72,242.67,Single-ply,SBD,M
Boys,55.79,DQ,Shawn Pittman,Thrall,53.98,120.2,,,,Single-ply,SBD,M
Boys,55.79,DQ,Alberto Huezo,Austin Bowie,54.16,,,,,Single-ply,SBD,M
Boys,55.79,DQ,Jonathan Flores,Lampasas,53.52,127.01,,,,Single-ply,SBD,M
Boys,55.79,NS,Espinoza Anthony,Georgetown East View,,,,,,Single-ply,SBD,M
Boys,67.13,1,Sam Muniz,San Marcos,60.06,124.74,79.38,174.63,378.75,Single-ply,SBD,M
Boys,59.87,2,Leo Calderon,San Marcos,58.24,136.08,88.45,142.88,367.41,Single-ply,SBD,M
Boys,59.87,3,Luke Argo,Lampasas,59.33,147.42,79.38,136.08,362.87,Single-ply,SBD,M
Boys,59.87,4,Alex Mata,Lockhart,56.79,127.01,63.5,151.95,342.46,Single-ply,SBD,M
Boys,59.87,NS,Dillon White,Lampasas,,,,,,Single-ply,SBD,M
Boys,59.87,NS,Colin Tierney,Austin Lake Travis,,,,,,Single-ply,SBD,M
Boys,59.87,NS,Sam Waldum,Cedar Park Vista Ridge,,,,,,Single-ply,SBD,M
Boys,67.13,DQ,Justin Lara,Buda Hays,60.06,149.69,,,,Single-ply,SBD,M
Boys,67.13,1,Brian Lopez,Geronimo Navarro,65.59,181.44,115.67,206.38,503.49,Single-ply,SBD,M
Boys,67.13,2,Miguel Valdez,Georgetown East View,60.6,163.29,92.99,185.97,442.25,Single-ply,SBD,M
Boys,67.13,3,Anthony Ortegon,Georgetown East View,66.04,156.49,95.25,188.24,439.98,Single-ply,SBD,M
Boys,67.13,4,Eduardo Lizardo,Del Valle,61.87,142.88,106.59,170.1,419.57,Single-ply,SBD,M
Boys,67.13,5,Luis Mena,Del Valle,61.14,145.15,92.99,149.69,387.82,Single-ply,SBD,M
Boys,67.13,6,Trey Elkins,Austin Lake Travis,63.59,142.88,74.84,138.35,356.07,Single-ply,SBD,M
Boys,67.13,7,Erich Streuling,Austin Lake Travis,62.96,138.35,65.77,138.35,342.46,Single-ply,SBD,M
Boys,67.13,8,Dustin May,Georgetown East View,62.32,115.67,61.23,136.08,312.98,Single-ply,SBD,M
Boys,67.13,9,Eric Grasso,Georgetown,66.86,102.06,61.23,140.61,303.91,Single-ply,SBD,M
Boys,67.13,10,James Price,Del Valle,66.5,117.93,61.23,102.06,281.23,Single-ply,SBD,M
Boys,67.13,11,Colton Harris,Georgetown East View,60.6,97.52,61.23,108.86,267.62,Single-ply,SBD,M
Boys,67.13,DQ,Hugo Perez,Lockhart,66.32,147.42,81.65,,,Single-ply,SBD,M
Boys,67.13,DQ,Nolan Escover,Georgetown,61.78,,,,,Single-ply,SBD,M
Boys,67.13,DQ,Kyler Spriggs,Marion,64.95,,,,,Single-ply,SBD,M
Boys,67.13,DQ,Jon Chelf,Marion,60.42,83.91,,,,Single-ply,SBD,M
Boys,67.13,DQ,Knijan Bell-Williams,Lampasas,64.41,,,,,Single-ply,SBD,M
Boys,67.13,DQ,Austin Rodriguez,Buda Hays,65.14,122.47,,,,Single-ply,SBD,M
Boys,67.13,DQ,Jayce Williams,Buda Hays,64.77,117.93,,,,Single-ply,SBD,M
Boys,67.13,NS,Jon David Mendoza,Rockdale,,,,,,Single-ply,SBD,M
Boys,67.13,NS,Thomas Burns,Lampasas,,,,,,Single-ply,SBD,M
Boys,74.84,1,Logan Hager,Georgetown,70.76,181.44,111.13,192.78,485.34,Single-ply,SBD,M
Boys,74.84,2,Nathan Pintor,Georgetown East View,72.94,172.37,113.4,174.63,460.4,Single-ply,SBD,M
Boys,74.84,3,Ever Calderon,Buda Hays,71.4,172.37,102.06,183.7,458.13,Single-ply,SBD,M
Boys,74.84,4,Cody Patterson,Bastrop Cedar Creek,74.21,163.29,102.06,181.44,446.79,Single-ply,SBD,M
Boys,74.84,5,Daniel Simpson,Austin Lake Travis,71.12,147.42,95.25,185.97,428.64,Single-ply,SBD,M
Boys,74.84,6,Cole Patterson,Cedar Park Vista Ridge,72.94,154.22,102.06,172.37,428.64,Single-ply,SBD,M
Boys,74.84,7,Luke Laney,Austin Lake Travis,73.12,151.95,97.52,161.03,410.5,Single-ply,SBD,M
Boys,74.84,DQ,Zach Velasquez,Austin Bowie,73.21,149.69,111.13,,,Single-ply,SBD,M
Boys,82.1,DQ,Miguel Mondragon,Buda Hays,75.02,145.15,,,,Single-ply,SBD,M
Boys,74.84,DQ,Angel Santana,Buda Hays,74.03,127.01,,,,Single-ply,SBD,M
Boys,74.84,DQ,Kenton Spriggs,Marion,72.94,,,,,Single-ply,SBD,M
Boys,74.84,DQ,Jon Daigle,Marion,69.4,,,,,Single-ply,SBD,M
Boys,74.84,DQ,Alec Behrendt,Thrall,73.75,,,,,Single-ply,SBD,M
Boys,74.84,NS,Manny Salazar,San Marcos,,,,,,Single-ply,SBD,M
Boys,74.84,DQ,Avery Gary,Lampasas,72.03,170.1,133.81,,,Single-ply,SBD,M
Boys,89.81,1,Jacob Palmares,Buda Hays,82.19,226.8,120.2,254.01,601.01,Single-ply,SBD,M
Boys,82.1,2,Jay Leal,Geronimo Navarro,79.47,204.12,113.4,231.33,548.85,Single-ply,SBD,M
Boys,82.1,3,Blake Lisby,Austin Lake Travis,80.74,204.12,115.67,215.46,535.24,Single-ply,SBD,M
Boys,82.1,4,David Beltran,Georgetown East View,81.47,185.97,120.2,185.97,492.15,Single-ply,SBD,M
Boys,82.1,5,Joel Juarez,Lockhart,81.28,174.63,111.13,204.12,489.88,Single-ply,SBD,M
Boys,82.1,6,James Cauley,Austin Lake Travis,77.75,170.1,102.06,201.85,474,Single-ply,SBD,M
Boys,82.1,7,Scott Thompson,Georgetown East View,76.84,174.63,102.06,188.24,464.93,Single-ply,SBD,M
Boys,82.1,8,Tye Hill,Georgetown,78.83,167.83,104.33,172.37,444.52,Single-ply,SBD,M
Boys,89.81,9,William Wallace,Austin Bowie,82.28,163.29,106.59,165.56,435.45,Single-ply,SBD,M
Boys,82.1,10,Joseph Terry,San Marcos,81.74,142.88,97.52,179.17,419.57,Single-ply,SBD,M
Boys,82.1,11,Daniel Rangel,Del Valle,81.74,147.42,90.72,170.1,408.23,Single-ply,SBD,M
Boys,82.1,12,Victor Martinez,San Marcos,79.47,136.08,79.38,161.03,376.48,Single-ply,SBD,M
Boys,82.1,DQ,Chase Heffernan,Georgetown,80.83,,,,,Single-ply,SBD,M
Boys,82.1,DQ,Hunter Wilkinson,Lampasas,77.66,,,,,Single-ply,SBD,M
Boys,82.1,DQ,Dylan Dulkoski,Lampasas,81.74,,,,,Single-ply,SBD,M
Boys,82.1,NS,Ethan Blakenship,Georgetown,,,,,,Single-ply,SBD,M
Boys,82.1,NS,Nick Corona,Georgetown,,,,,,Single-ply,SBD,M
Boys,82.1,NS,Adrian Jimenez,Georgetown East View,,,,,,Single-ply,SBD,M
Boys,89.81,1,Josh Mercado,San Marcos,89.45,231.33,154.22,260.82,646.37,Single-ply,SBD,M
Boys,89.81,2,Joseph Rodriguez #5,Bastrop Cedar Creek,88,217.72,127.01,226.8,571.53,Single-ply,SBD,M
Boys,99.79,3,Justin Hatfield,Geronimo Navarro,89.99,199.58,127.01,217.72,544.31,Single-ply,SBD,M
Boys,89.81,4,Joseph Frengel,Austin Lake Travis,87.09,199.58,133.81,208.65,542.04,Single-ply,SBD,M
Boys,89.81,5,Gorgonio De Los Reyes,Georgetown East View,88,183.7,111.13,183.7,478.54,Single-ply,SBD,M
Boys,89.81,6,Jonathan Willet,Georgetown East View,88.63,174.63,106.59,176.9,458.13,Single-ply,SBD,M
Boys,89.81,7,Ben Purcell,Georgetown,89.54,170.1,95.25,183.7,449.06,Single-ply,SBD,M
Boys,89.81,8,Daryl Ontiveros,San Marcos,85.46,156.49,104.33,181.44,442.25,Single-ply,SBD,M
Boys,89.81,9,Camden Thompson,Marion,84.19,142.88,127.01,142.88,412.77,Single-ply,SBD,M
Boys,89.81,10,Jonis Nava,San Marcos,87.63,149.69,74.84,181.44,405.97,Single-ply,SBD,M
Boys,89.81,11,Rafael Tovar,Lampasas,86,120.2,70.31,170.1,360.61,Single-ply,SBD,M
Boys,89.81,DQ,David Torres #5,Austin Bowie,86.09,,,,,Single-ply,SBD,M
Boys,89.81,DQ,Ryan Bechtel,Marion,89.45,,,,,Single-ply,SBD,M
Boys,99.79,1,Daniel Minor,Buda Hays,96.89,244.94,142.88,254.01,641.83,Single-ply,SBD,M
Boys,99.79,2,Elias Villalobos,San Marcos,96.98,226.8,136.08,260.82,623.69,Single-ply,SBD,M
Boys,99.79,3,Keland Moore,Georgetown,98.34,222.26,127.01,167.83,517.1,Single-ply,SBD,M
Boys,99.79,4,Colby Ardrey,Buda Hays,94.62,188.24,136.08,188.24,512.56,Single-ply,SBD,M
Boys,99.79,5,Seth Vera,Austin Bowie,91.08,183.7,113.4,188.24,485.34,Single-ply,SBD,M
Boys,99.79,6,Tyler Garza,Austin Bowie,94.44,179.17,108.86,195.04,483.08,Single-ply,SBD,M
Boys,99.79,7,Adam Prado,Lampasas,99.06,208.65,124.74,149.69,483.08,Single-ply,SBD,M
Boys,99.79,8,Topher McGehee,Lampasas,95.8,176.9,108.86,185.97,471.74,Single-ply,SBD,M
Boys,99.79,9,Josh Duran,Marion,99.06,183.7,102.06,181.44,467.2,Single-ply,SBD,M
Boys,99.79,10,Jaremy Market,Georgetown,93.71,174.63,113.4,176.9,464.93,Single-ply,SBD,M
Boys,99.79,11,Dameion Cavazos,Georgetown,97.07,165.56,104.33,138.35,408.23,Single-ply,SBD,M
Boys,99.79,DQ,Connor Roe,Geronimo Navarro,98.07,,,,,Single-ply,SBD,M
Boys,99.79,DQ,DaQuan Patton,Cedar Park Vista Ridge,94.35,,,,,Single-ply,SBD,M
Boys,99.79,DQ,Curtis Hawkins,Lockhart,99.16,238.14,,,,Single-ply,SBD,M
Boys,109.77,DQ,Lane Spring,Geronimo Navarro,99.97,,,,,Single-ply,SBD,M
Boys,99.79,DQ,Levi Reeves,Georgetown East View,98.34,,,,,Single-ply,SBD,M
Boys,109.77,1,Arnold Moreno,Georgetown East View,102.87,231.33,120.2,231.33,582.87,Single-ply,SBD,M
Boys,109.77,2,Christian Coranado,Austin Bowie,108.95,215.46,165.56,181.44,562.45,Single-ply,SBD,M
Boys,109.77,3,Jacob Aguirre,Rockdale,106.96,201.85,111.13,204.12,517.1,Single-ply,SBD,M
Boys,109.77,4,Cole Richey,Comfort,102.24,204.12,117.93,181.44,503.49,Single-ply,SBD,M
Boys,109.77,5,Chase Travis,Georgetown,104.24,147.42,86.18,127.01,360.61,Single-ply,SBD,M
Boys,109.77,DQ,Jeremy Rodriguez #2,Geronimo Navarro,108.77,258.55,,,,Single-ply,SBD,M
Boys,109.77,DQ,Zavon Gipson,Rockdale,105.32,188.24,,,,Single-ply,SBD,M
Boys,109.77,DQ,Antonio Tovar,Georgetown East View,103.78,,,,,Single-ply,SBD,M
Boys,124.74,DQ,Michael Chairez,Georgetown East View,109.86,195.04,,,,Single-ply,SBD,M
Boys,109.77,NS,Harrison Schuler,Georgetown,,,,,,Single-ply,SBD,M
Boys,109.77,NS,Carlos Ralda,Cedar Park Vista Ridge,,,,,,Single-ply,SBD,M
Boys,109.77,NS,Tyler Hjort,Cedar Park Vista Ridge,,,,,,Single-ply,SBD,M
Boys,124.74,1,Brennan Eggers,Cedar Park Vista Ridge,113.94,247.21,142.88,217.72,607.81,Single-ply,SBD,M
Boys,124.74,2,Izzy Robeson,Comfort,124.74,213.19,165.56,213.19,591.94,Single-ply,SBD,M
Boys,124.74,3,Paul Crawford,Georgetown East View,110.68,231.33,149.69,181.44,562.45,Single-ply,SBD,M
Boys,124.74,4,Aaron Johnson #15,Georgetown,114.58,226.8,127.01,192.78,546.58,Single-ply,SBD,M
Boys,124.74,5,Michael White,Austin Bowie,119.84,174.63,142.88,206.38,523.9,Single-ply,SBD,M
Boys,124.74,6,Josh Urrutia,San Marcos,121.56,183.7,117.93,192.78,494.42,Single-ply,SBD,M
Boys,124.74,7,Caleb Madole,Georgetown East View,119.48,183.7,117.93,190.51,492.15,Single-ply,SBD,M
Boys,124.74,8,Seth Seale,Buda Hays,114.76,181.44,138.35,165.56,485.34,Single-ply,SBD,M
Boys,124.74,9,Dedrick Page,Rockdale,115.3,188.24,120.2,154.22,462.66,Single-ply,SBD,M
Boys,124.74,10,Cesar Salazar,Marion,117.93,158.76,117.93,172.37,449.06,Single-ply,SBD,M
Boys,124.74,11,Byron King,Georgetown East View,112.49,163.29,113.4,167.83,444.52,Single-ply,SBD,M
Boys,124.74,NS,Martin Ruiz,Del Valle,,,,,,Single-ply,SBD,M
Boys,124.74,DQ,Enrique Guerrola,Buda Hays,115.48,185.97,124.74,,,Single-ply,SBD,M
Boys,124.74+,1,Dominic Brown,Georgetown East View,127.19,267.62,149.69,215.46,632.76,Single-ply,SBD,M
Boys,124.74+,2,Anthony Herrera,Del Valle,143.52,206.38,120.2,183.7,510.29,Single-ply,SBD,M
Boys,124.74+,3,Kade Clapper,Georgetown,129.27,188.24,120.2,170.1,478.54,Single-ply,SBD,M
Boys,124.74+,DQ,Chris Nix,Lampasas,129.27,183.7,113.4,,,Single-ply,SBD,M
Boys,124.74+,DQ,Caleb Teague,Austin Bowie,125.19,263.08,,,,Single-ply,SBD,M
Boys,124.74+,DQ,Kyle Mealey,Austin Bowie,138.89,,,,,Single-ply,SBD,M
Boys,124.74+,DQ,Jeremy Rodriguez #1,Bastrop Cedar Creek,125.1,,,,,Single-ply,SBD,M
Boys,124.74+,NS,Noah Ramirez,Comfort,,,,,,Single-ply,SBD,M
Boys,124.74+,NS,Tyler Preston,Georgetown,,,,,,Single-ply,SBD,M
