Place,Name,Division,Country,BodyweightKg,Squat1Kg,Squat2Kg,Squat3Kg,Best3SquatKg,Squat4Kg,Bench1Kg,Bench2Kg,Bench3Kg,Best3BenchKg,Bench4Kg,Deadlift1Kg,Deadlift2Kg,Deadlift3Kg,Best3DeadliftKg,Deadlift4Kg,TotalKg,WeightClassKg,Sex,CyrillicName,BirthYear,Equipment,Event
DQ,Aaron Keriguy,M_JR_WPC,France,78.4,,,,,,-142.5,-142.5,-142.5,,,,,,,,,82.5,M,,1991,Raw,B
1,Adam Guman,M_TR_3_WPC,Slovakia,87.6,170,-180,180,180,,95,-105,-105,95,,200,220,-232.5,220,,495,90,M,,1994,Raw,SBD
5,Adam Lemesányi,M_JR_WPC,Slovakia,96.2,190,200,210,210,,115,125,-135,125,,205,215,-220,215,,550,100,M,,1992,Raw,SBD
2,Adam Phelan,M_TR_3_WPC,Ireland,88.6,140,-150,-160,140,,87.5,92.5,97.5,97.5,,-185,-195,195,195,,432.5,90,M,,1995,Raw,SBD
2,Adam Švehla,M_OR_WPC,Czechia,134.3,,,,,,220,-225,-225,220,,,,,,,220,140,M,,1981,Raw,B
1,Aigars Skrebeļs,M_MR_1_WPC,Latvia,74.4,,,,,,135,145,,145,,,,,,,145,75,M,,1971,Raw,B
3,Ákos Oláh,M_OR_WPC,Hungary,101.2,,,,,,225,232.5,-237.5,232.5,,,,,,,232.5,110,M,,1989,Raw,B
DQ,Alain-Francis Matteï,M_MEM_4_WPC,France,84.8,,,,,,-170,-175,-180,,,,,,,,,90,M,,1955,Multi-ply,B
3,Alastair MacNicol,M_OR_WPC,Canada,100,-245,245,260,260,,155,165,172.5,172.5,,275,300,312.5,312.5,,745,100,M,,1987,Raw,SBD
2,Alejandro Ortiy,M_MEM_1_WPC,USA,90.4,,,,,,,,,,,227.5,250,-272.5,250,,250,100,M,,1969,Multi-ply,D
1,Aleksandr Erozidi,M_MEM_2_WPC,Russia,134.9,,,,,,260,275,285,285,290,,,,,,285,140,M,Александр Ерозиди,1965,Multi-ply,B
11,Aleksandr Fedorov,M_OR_WPC,Russia,89.8,,,,,,175,-185,-185,175,,,,,,,175,90,M,Александр Федоров,1968,Raw,B
1,Aleksandr Fedorov,M_MR_2_WPC,Russia,89.8,,,,,,175,-185,-185,175,,,,,,,175,90,M,Александр Федоров,1968,Raw,B
2,Aleksandr Kadzaev,M_JR_WPC,Russia,107.3,240,-255,-255,240,,160,170,-175,170,,290,-310,310,310,,720,110,M,Александр Кадзаев,1990,Raw,SBD
8,Aleksandr Mantserov,M_OR_WPC,Russia,109.5,,,,,,210,-220,-220,210,,,,,,,210,110,M,Александр Манцеров,1983,Raw,B
3,Aleksandr Rabinovich,M_OR_WPC,Israel,73.3,,,,,,155,162.5,-170,162.5,,,,,,,162.5,75,M,,1967,Raw,B
1,Aleksandr Rabinovich,M_MR_2_WPC,Israel,73.3,,,,,,155,162.5,-170,162.5,,,,,,,162.5,75,M,,1967,Raw,B
1,Aleksandr Romanichev,M_MR_3_WPC,Israel,55.2,112.5,120,130,130,,100,105,110,110,,155,170,180,180,190,420,56,M,,1963,Raw,SBD
1,Aleksandr Romanichev,M_MR_3_WPC,Israel,55.7,,,,,,100,105,107.5,107.5,,,,,,,107.5,56,M,,1963,Raw,B
2,Aleksandr Terentyev,M_MEM_1_WPC,Russia,99.6,,,,,,-230,-230,232.5,232.5,,,,,,,232.5,100,M,Александр Терентьев,1969,Multi-ply,B
4,Aleksandr Teterin,M_OR_WPC,Russia,107.3,,,,,,,,,,,250,260,-265,260,,260,110,M,Александр Тетерин,1974,Raw,D
3,Aleksandr Tkachuk,M_MR_7_WPC,Russia,79.8,,,,,,-100,-100,100,100,,,,,,,100,82.5,M,Александр Ткачук,1940,Raw,B
2,Aleksandr Tsvetkov,M_MR_4_WPC,Russia,89.5,202.5,215,220,220,,100,110,115,115,,220,235,-247.5,235,,570,90,M,Александр Цветков,1957,Raw,SBD
1,Aleksandr Tsvetkov,M_MR_4_WPC,Russia,89.5,,,,,,,,,,,220,237.5,247.5,247.5,,247.5,90,M,Александр Цветков,1957,Raw,D
1,Aleksey Kozlov #1,M_OEM_WPC,Russia,99.8,330,360,,360,,210,220,230,230,,280,300,320,320,,910,100,M,Алексей Козлов,1970,Multi-ply,SBD
1,Aleksey Kozlov #1,M_MEM_1_WPC,Russia,99.8,330,360,,360,,210,220,230,230,,280,300,320,320,,910,100,M,Алексей Козлов,1970,Multi-ply,SBD
DQ,Aleksey Kuchma,M_OEM_WPC,Russia,113.5,-350,-350,-350,,,,,,,,,,,,,,125,M,Алексей Кучма,1979,Multi-ply,SBD
2,Aleksey Kuchma,M_OEM_WPC,Russia,113.5,,,,,,,,,,,290,310,-325,310,,310,125,M,Алексей Кучма,1979,Multi-ply,D
1,Aleksey Nikulin #1,M_OR_WPC,Russia,80.6,275,-290,-290,275,,170,-177.5,-177.5,170,,305,-315,-315,305,,750,82.5,M,Алексей Никулин,1982,Raw,SBD
2,Aleš Lukeš,M_TEM_3_WPC,Czechia,89.6,225,240,250,250,,140,150,155,155,,220,235,-240,235,,640,90,M,,1994,Multi-ply,SBD
DQ,Alex Ortiz #1,M_MEM_1_WPC,USA,89.4,-320,-320,-320,,,,,,,,,,,,,,90,M,,1969,Multi-ply,SBD
1,Alexander Burlakov,M_MR_3_WPC,Russia,132.4,210,225,-236,225,,175,190,-205,190,,230,-250,,230,,645,140,M,Александр Бурлаков,1959,Raw,SBD
1,Alexander Kovalevsky,M_MR_3_WPC,Russia,140.8,,,,,,200,210,-220,210,,,,,,,210,140+,M,Александр Ковалевский,1963,Raw,B
1,Alexander Krovikov,M_MEM_3_WPC,Russia,97.9,220,-230,-230,220,,150,170,175,175,,230,260,-280,260,,655,100,M,Александр Кровиков,1961,Multi-ply,SBD
1,Alexander Petrov,M_MR_3_WPC,Russia,89.4,,,,,,185,200,205,205,,,,,,,205,90,M,Александр Петров,1960,Raw,B
1,Alexander Petrov,M_OEM_WPC,Russia,89.6,,,,,,245,260,-265,260,,,,,,,260,90,M,Александр Петров,1960,Multi-ply,B
1,Alexander Petrov,M_MEM_3_WPC,Russia,89.6,,,,,,245,260,-265,260,,,,,,,260,90,M,Александр Петров,1960,Multi-ply,B
1,Aleksandr Ponedelin,M_MEM_5_WPC,Russia,72.3,215,230,,230,,80,90,100,100,,215,227.5,-235,227.5,,557.5,75,M,Александр Понеделин,1950,Multi-ply,SBD
1,Aleksandr Ponedelin,M_MEM_5_WPC,Russia,73.5,,,,,,,,,,,215,230,-237.5,230,,230,75,M,Александр Понеделин,1950,Multi-ply,D
4,Alexander Smirnov,M_JR_WPC,Kazakhstan,95.6,-190,190,212.5,212.5,,150,160,170,170,,-260,260,-270,260,,642.5,100,M,,1992,Raw,SBD
2,Alexander Smirnov,M_JR_WPC,Russia,93.9,,,,,,,,,,,200,240,,240,,240,100,M,,1992,Raw,D
3,Alexey Brazhkin,M_MR_1_WPC,Russia,131,,,,,,165,180,-190,180,,,,,,,180,140,M,Алексей Бражкин,1971,Raw,B
2,Alexey Brazhkin,M_MEM_1_WPC,Russia,132.5,,,,,,230,252.5,260,260,,,,,,,260,140,M,Алексей Бражкин,1971,Multi-ply,B
2,Alexey Neklyudov,M_MEM_2_WPC,Russia,115.1,,,,,,290,-310,-310,290,,,,,,,290,125,M,Алексей Неклюдов,1964,Multi-ply,B
DQ,Alina Arakelova,F_OR_WPC,Russia,58.7,,,,,,-40,-40,-40,,,,,,,,,60,F,Алина Аракелова,1981,Raw,B
DQ,Alina Arakelova,F_OR_WPC,Russia,58.6,,,,,,,,,,,-60,-65,-70,,,,60,F,Алина Аракелова,1981,Raw,D
2,Allan Valdemar Jokinen,M_OR_WPC,Finland,89.9,,,,,,-210,212.5,-215,212.5,,,,,,,212.5,90,M,,1981,Raw,B
1,Amelia Lily Kingshott,F_TR_2_WPC,UK,64.8,75,80,-85,80,,40,-45,-45,40,,115,125,130,130,,250,67.5,F,,1997,Raw,SBD
1,Amir Tavakoli,M_OR_WPC,Iran,151.6,-300,300,-330,300,,200,210,,210,,300,320,340,340,,850,140+,M,,1983,Raw,SBD
1,Amir Tavakoli,M_OEM_WPC,Iran,150.4,-430,430,450,450,,260,-275,-275,260,,320,-340,340,340,,1050,140+,M,,1983,Multi-ply,SBD
1,Monique Amy Newton,F_OR_WPC,UK,55.4,,,,,,,,,,,125,135,-142.5,135,,135,56,F,,1992,Raw,D
1,Anatoli Shnaider,M_MR_4_WPC,Israel,73.3,152.5,160,162.5,162.5,,107.5,-115,115,115,,185,-200,,185,,462.5,75,M,,1957,Raw,SBD
1,Anatoliy Bochkovskyy,M_MR_4_WPC,Ukraine,66.5,147.5,162.5,170,170,,87.5,95,-100,95,,195,210,,210,,475,67.5,M,Анатолій Бочковський,1954,Raw,SBD
2,Anatoliy Nefedov,M_MR_3_WPC,Russia,67.3,,,,,,120,130,140,140,,,,,,,140,67.5,M,Анатолий Нефедов,1963,Raw,B
1,Anatoliy Nefedov,M_MEM_3_WPC,Russia,72.1,,,,,,155,160,165,165,,,,,,,165,75,M,Анатолий Нефедов,1963,Multi-ply,B
DQ,Andis Kaspars,M_OEM_WPC,Latvia,112,-345,-345,-345,,,,,,,,,,,,,,125,M,,1976,Multi-ply,SBD
6,András Gadó,M_OEM_WPC,Hungary,97.5,285,300,310,310,,195,202.5,-207.5,202.5,,-250,257.5,-262.5,257.5,,770,100,M,,1987,Multi-ply,SBD
1,Andreas Vigh,M_MR_6_WPC,Switzerland,71.4,,,,,,85,95,-100,95,,,,,,,95,75,M,,1944,Raw,B
1,Andrejs Mūrnieks,M_OR_WPC,Latvia,144.7,,,,,,280,-290,-290,280,,,,,,,280,140+,M,,1980,Raw,B
1,Andrey Gabuev,M_TR_2_WPC,Russia,87.9,,,,,,100,110,-115,110,,,,,,,110,90,M,Андрей Габуев,1996,Raw,B
9,Andrey Gogolev,M_OR_WPC,Russia,99,,,,,,-187.5,-195,195,195,,,,,,,195,100,M,Андрей Гоголев,1987,Raw,B
1,Andrey Kim #1,M_OR_WPC,Kazakhstan,59.9,150,-170,175,175,,135,142.5,-147.5,142.5,,190,210,227.5,227.5,,545,60,M,,1986,Raw,SBD
1,Andrey Kim #1,M_OR_WPC,Kazakhstan,59.8,,,,,,135,-142.5,-142.5,135,,,,,,,135,60,M,,1986,Raw,B
1,Andrey Kim #1,M_OR_WPC,Kazakhstan,61.3,,,,,,,,,,,185,200,,200,,200,67.5,M,,1986,Raw,D
2,Andrey Sazonov,M_OR_WPC,Kazakhstan,104.3,,,,,,212.5,-225,235,235,,,,,,,235,110,M,,1980,Raw,B
4,Andriy Dyatlov,M_OEM_WPC,Ukraine,82.2,280,300,310,310,,-205,-210,210,210,,250,265,280,280,,800,82.5,M,Андрій Дятлов,1985,Multi-ply,SBD
3,Andriy Dyatlov,M_OEM_WPC,Ukraine,82.5,,,,,,205,215,225,225,,,,,,,225,82.5,M,Андрій Дятлов,1985,Multi-ply,B
2,Andriy Dyatlov,M_OR_WPC,Ukraine,82.1,,,,,,,,,,,200,215,245,245,,245,82.5,M,Андрій Дятлов,1985,Raw,D
1,Andriy Dyatlov,M_OEM_WPC,Ukraine,82.1,,,,,,,,,,,240,,,240,,240,82.5,M,Андрій Дятлов,1985,Multi-ply,D
2,Andriy Galkevich,M_MR_1_WPC,Ukraine,89.1,-240,240,251,251,,160,170,-175,170,,-240,-240,240,240,,661,90,M,Андрій Галькевич,1971,Raw,SBD
1,Anna McCloskey,F_JR_WPC,USA,86.1,152.5,167.5,-175,167.5,,82.5,87.5,90,90,,202.5,-212.5,-212.5,202.5,,460,90,F,,1993,Raw,SBD
1,Anna McCloskey,F_OR_WPC,USA,86.1,152.5,167.5,-175,167.5,,82.5,87.5,90,90,,202.5,-212.5,-212.5,202.5,,460,90,F,,1993,Raw,SBD
1,Anna McCloskey,F_JEM_WPC,USA,86.8,-227.5,-227.5,227.5,227.5,,122.5,-140,140,140,,195,202.5,215,215,,582.5,90,F,,1993,Multi-ply,SBD
1,Anna McCloskey,F_OEM_WPC,USA,86.8,-227.5,-227.5,227.5,227.5,,122.5,-140,140,140,,195,202.5,215,215,,582.5,90,F,,1993,Multi-ply,SBD
1,Anna McCloskey,F_JR_WPC,USA,86.5,,,,,,85,-92.5,-92.5,85,,,,,,,85,90,F,,1993,Raw,B
1,Anna McCloskey,F_OR_WPC,USA,86.5,,,,,,85,-92.5,-92.5,85,,,,,,,85,90,F,,1993,Raw,B
1,Anna McCloskey,F_JEM_WPC,USA,86.3,,,,,,132.5,140,145,145,-150,,,,,,145,90,F,,1993,Multi-ply,B
1,Anna McCloskey,F_OEM_WPC,USA,86.3,,,,,,132.5,140,145,145,-150,,,,,,145,90,F,,1993,Multi-ply,B
2,Anna Pudovkina,F_OR_WPC,Russia,80.5,115,122.5,127.5,127.5,,95,100,-105,100,,160,167.5,172,172,,399.5,82.5,F,Анна Пудовкина,1975,Raw,SBD
1,Anna Turaeva,F_OR_WPC,Russia,82.4,,,,,,125,132.5,137.5,137.5,142,,,,,,137.5,82.5,F,Анна Тураева,1978,Raw,B
1,Anna Turaeva,F_OEM_WPC,Russia,82,,,,,,165,175,-185,175,,,,,,,175,82.5,F,Анна Тураева,1978,Multi-ply,B
1,Ano Turtiainen,M_MEM_2_WPC,Finland,129.1,,,,,,,,,,,325,-365,-365,325,,325,140,M,,1967,Multi-ply,D
DQ,Anthony Chirico,M_MEM_1_WPC,USA,109.7,390,-410,-410,390,,-257.5,-265,-265,,,,,,,,,110,M,,1970,Multi-ply,SBD
DQ,Anthony Giddings,M_MEM_1_WPC,UK,106.2,300,-330,-350,300,,-190,-190,-190,,,,,,,,,110,M,,1972,Multi-ply,SBD
3,Anton Galaguz,M_OR_WPC,Ukraine,90,-250,250,262.5,262.5,,175,-182.5,-182.5,175,,280,-300,-300,280,,717.5,90,M,Антон Галагуз,1986,Raw,SBD
4,Anton Popov,M_OEM_WPC,Ukraine,74.1,185,195,-202.5,195,,140,-150,150,150,,190,200,-207.5,200,,545,75,M,Антон Попов,1989,Multi-ply,SBD
DQ,Armen Khachaturyan,M_OEM_WPC,Russia,81.8,,,,,,-200,-200,-215,,,,,,,,,82.5,M,Армен Хачатурян,1978,Multi-ply,B
3,Armen Khachaturyan,M_OR_WPC,Russia,82.5,,,,,,,,,,,170,185,190,190,,190,82.5,M,Армен Хачатурян,1978,Raw,D
1,Artem Kobanov,M_JR_WPC,Russia,108.4,285,295,-302.5,295,,-215,215,225,225,-231,302.5,310,320,320,,840,110,M,Артем Кобанов,1992,Raw,SBD
3,Artem Kobanov,M_OR_WPC,Russia,108.4,285,295,-302.5,295,,-215,215,225,225,-231,302.5,310,320,320,,840,110,M,Артем Кобанов,1992,Raw,SBD
2,Artur Belous,M_OR_WPC,Russia,74.1,,,,,,170,180,-187.5,180,,,,,,,180,75,M,Артур Белоус,1985,Raw,B
7,Artur Dubinin,M_OR_WPC,Ukraine,78.7,190,200,210,210,,150,155,-160,155,,230,245,-255,245,,610,82.5,M,Артур Дубінін,1987,Raw,SBD
1,Artur Rejek,M_OR_WPC,Poland,107.9,,,,,,230,235,237.5,237.5,-242.5,,,,,,237.5,110,M,,1972,Raw,B
1,Artur Rejek,M_MR_1_WPC,Poland,107.9,,,,,,230,235,237.5,237.5,-242.5,,,,,,237.5,110,M,,1972,Raw,B
1,Artur Schoula Kurt,M_MR_5_WPC,Germany,97.8,,,,,,155,160,165,165,,,,,,,165,100,M,,1952,Raw,B
3,Atis Zembahs,M_OEM_WPC,Latvia,111.8,-360,-360,360,360,,-230,230,-265,230,,300,310,325,325,,915,125,M,,1988,Multi-ply,SBD
1,Attila Gembiczki,M_OR_WPC,Hungary,79.7,,,,,,185,190,-192.5,190,,,,,,,190,82.5,M,,1986,Raw,B
1,Ayrat Sufiyanov,M_OEM_WPC,Russia,64.6,,,,,,187.5,-195,-195,187.5,,,,,,,187.5,67.5,M,Айрат Суфиянов,1984,Multi-ply,B
9,Azer Aliyev,M_OR_WPC,Azerbaijan,100,210,220,-225,220,,150,160,165,165,,230,245,250,250,,635,100,M,,1986,Raw,SBD
4,Baatarjav Khishigtogtokh,M_MR_1_WPC,Mongolia,86.4,,,,,,150,-157.5,-157.5,150,,,,,,,150,90,M,,1971,Raw,B
DQ,Bahman Halimimaghani,M_OR_WPC,Iran,122.3,-260,-270,-270,,,-200,,,,,,,,,,,125,M,,1980,Raw,SBD
1,Bahman Halimimaghani,M_OEM_WPC,Iran,125.1,360,380,-400,380,,240,255,265,265,,270,290,310,310,,955,140,M,,1980,Multi-ply,SBD
DQ,Bahman Halimimaghani,M_OEM_WPC,Iran,125.4,,,,,,-350,-350,,,,,,,,,,140,M,,1980,Multi-ply,B
1,Bakhtiyar Guliyev,M_OR_WPC,Azerbaijan,114.3,,,,,,,,,,,325,342.5,-360,342.5,,342.5,125,M,,1976,Raw,D
1,Boris Doktorovich,M_MR_5_WPC,Israel,103.6,-80,-80,80,80,,100,110,-112.5,110,,120,140,-150,140,,330,110,M,,1950,Raw,SBD
3,Boris Doktorovich,M_MR_5_WPC,Israel,103.7,,,,,,100,110,-112.5,110,,,,,,,110,110,M,,1950,Raw,B
1,Boriss Laisin,M_MR_5_WPC,Estonia,66.5,,,,,,100,-105,-105,100,,,,,,,100,67.5,M,,1950,Raw,B
2,Boriss Laisin,M_MR_5_WPC,Estonia,66.8,,,,,,,,,,,120,130,-147.5,130,,130,67.5,M,,1950,Raw,D
2,Bruce McIntyre,M_MR_4_WPC,Canada,97.6,,,,,,-177.5,177.5,-180,177.5,,,,,,,177.5,100,M,,1957,Raw,B
DQ,Bruce McIntyre,M_MEM_4_WPC,Canada,98.1,,,,,,-235,-235,-235,,,,,,,,,100,M,,1957,Multi-ply,B
4,Bruno Ricardo Ruela Alves,M_OEM_WPC,Portugal,99.6,,,,,,220,232.5,245,245,,,,,,,245,100,M,,1988,Multi-ply,B
1,Bruno Szambelanczyk,M_OEM_WPC,France,109.3,,,,,,-300,300,305,305,,,,,,,305,110,M,,1980,Multi-ply,B
2,Bryan Walter,M_MEM_3_WPC,USA,84.3,-190,-215,215,215,,140,-160,-175,140,,190,-215,-215,190,,545,90,M,,1960,Multi-ply,SBD
DQ,Budgie Mullan,M_MR_6_WPC,UK,66.6,67.5,-80,80,80,,70,-77.5,-77.5,70,,-140,-150,-150,,,,67.5,M,,1943,Raw,SBD
1,Burkhard Steffen,M_MR_5_WPC,Germany,73.7,150,160,165,165,,95,100,-102.5,100,,140,147.5,155,155,,420,75,M,,1950,Raw,SBD
1,Byerdmurat Avdalkhamid,M_JR_WPC,Mongolia,74.2,-170,170,180,180,,130,140,147.5,147.5,,230,,,230,,557.5,75,M,,1992,Raw,SBD
1,Byerdmurat Avdalkhamid,M_JEM_WPC,Mongolia,74.5,250,265,280,280,,165,175,185,185,,230,245,260,260,,725,75,M,,1992,Multi-ply,SBD
1,Byerdmurat Avdalkhamid,M_JR_WPC,Mongolia,74.2,,,,,,,,,,,245,-255,-255,245,,245,75,M,,1992,Raw,D
1,Carla Carneiro,F_OEM_WPC,Portugal,80.6,-180,-180,180,180,,75,90,-100,90,,150,-170,175,175,,445,82.5,F,,1977,Multi-ply,SBD
1,Cheryl Kelsall,F_JR_WPC,UK,51.5,65,72.5,80,80,,52.5,57.5,-60,57.5,,130,140,145,145,150,282.5,52,F,,1990,Raw,SBD
4,Christian Clampariu,M_OR_WPC,Austria,71.3,,,,,,-145,145,147.5,147.5,,,,,,,147.5,75,M,,1985,Raw,B
6,Christian Hagl,M_JEM_WPC,Germany,85.7,210,230,-260,230,,135,145,-155,145,,180,-200,-220,180,,555,90,M,,1990,Multi-ply,SBD
11,Christian Krause,M_OR_WPC,Germany,102.7,170,180,187.5,187.5,,-147.5,147.5,-150,147.5,,190,200,205,205,,540,110,M,,1977,Raw,SBD
1,Christoph Scheel,M_OR_WPC,Germany,89.5,,,,,,200,-210,212.5,212.5,,,,,,,212.5,90,M,,1985,Raw,B
2,Christoph Scheel,M_OEM_WPC,Germany,90,,,,,,240,-245,245,245,,,,,,,245,90,M,,1985,Multi-ply,B
2,Christopher Kalisz,M_TR_2_WPC,UK,67.1,120,140,150,150,,-100,-100,100,100,,185,190,-202.5,190,,440,67.5,M,,1996,Raw,SBD
2,Chuluudai Bayasgalan,M_OEM_WPC,Mongolia,126.1,-372.5,-372.5,372.5,372.5,,240,-260,-265,240,,240,-280,,240,,852.5,140,M,,1977,Multi-ply,SBD
3,Cindy Costin-Fury,F_OR_WPC,Canada,86.9,67.5,-75,80,80,,65,67.5,-72.5,67.5,,110,125,,125,,272.5,90,F,,1983,Raw,SBD
2,Cindy Costin-Fury,F_OR_WPC,Canada,88,,,,,,67.5,-75,-75,67.5,,,,,,,67.5,90,F,,1983,Raw,B
1,Cindy Costin-Fury,F_OR_WPC,Canada,86.9,,,,,,,,,,,110,127.5,-137.5,127.5,,127.5,90,F,,1983,Raw,D
1,Claire Perroud,F_TR_1_WPC,France,43.9,45,47.5,-50,47.5,,25,-30,-30.5,25,,55,61,65,65,70,137.5,44,F,,2000,Raw,SBD
1,Claude Patout,M_MR_3_WPC,France,81,,,,,,-160,160,-165,160,,,,,,,160,82.5,M,,1962,Raw,B
DQ,Corinne Ingman,F_OR_WPC,UK,67.3,-130,-130,,,,,,,,,,,,,,,67.5,F,,1988,Raw,SBD
DQ,Corinne Ingman,F_OR_WPC,UK,66.5,,,,,,-105,-105,-105,,,,,,,,,67.5,F,,1988,Raw,B
1,Crystal Lahaie,F_OR_WPC,Canada,96.6,137.5,145,-150,145,,70,75,80,80,,142.5,-150,150,150,,375,90+,F,,1976,Raw,SBD
1,Crystal Lahaie,F_OR_WPC,Canada,96.6,,,,,,,,,,,-142.5,142.5,150,150,-157.5,150,90+,F,,1976,Raw,D
DQ,Csaba Keszthelyi,M_MEM_9_WPC,Hungary,77.8,-115,-115,115,115,,-87.5,-87.5,-87.5,,,,,,,,,82.5,M,,1933,Multi-ply,SBD
1,Dagmar Liptáková,F_OEM_WPC,Slovakia,62.7,,,,,,127.5,-135,135,135,,,,,,,135,67.5,F,,1976,Multi-ply,B
1,Dainis Polis,M_MR_3_WPC,Latvia,115.7,200,-220,-230,200,,155,-172.5,-172.5,155,,215,,,215,,570,125,M,,1959,Raw,SBD
1,Dainis Polis,M_MR_3_WPC,Latvia,116.5,,,,,,,,,,,220,230,250,250,,250,125,M,,1959,Raw,D
1,Dale Humphreys,M_JR_WPC,UK,63.6,122.5,-132.5,140,140,,-80,80,-87.5,80,,200,-212.5,-212.5,200,,420,67.5,M,,1991,Raw,SBD
4,Dallas Hogan,M_OR_WPC,Canada,119.5,280,-295,-295,280,,200,-212.5,-212.5,200,,340,-355,-355,340,,820,125,M,,1976,Raw,SBD
2,Dallas Hogan,M_OR_WPC,Canada,121.4,,,,,,,,,,,-342.5,342.5,-350,342.5,,342.5,125,M,,1976,Raw,D
3,Dan Stewart,M_JR_WPC,UK,97.8,210,-230,235,235,,-130,140,-145,140,,260,280,-290,280,,655,100,M,,1993,Raw,SBD
2,Daniel Acosta Florido,M_JR_WPC,Germany,112.9,240,-260,265,265,,175,187.5,192.5,192.5,,290,305,-310,305,,762.5,125,M,,1992,Raw,SBD
1,Dániel Égei,M_JEM_WPC,Hungary,79.4,,,,,,210,-225,230,230,,,,,,,230,82.5,M,,1992,Multi-ply,B
2,Daniel Martin #7,M_MEM_4_WPC,USA,96.7,,,,,,-187.5,-187.5,187.5,187.5,,,,,,,187.5,100,M,,1956,Multi-ply,B
1,Dans Minats,M_YR_WPC,Latvia,73.5,70,80,90,90,,40,45,-50,45,,92.5,-102.5,-102.5,92.5,,227.5,75,M,,2001,Raw,SBD
1,Daria Krenn,F_OR_WPC,Russia,64.7,,,,,,-110,110,115,115,,,,,,,115,67.5,F,,1975,Raw,B
DQ,Darran Kennedy,M_OEM_WPC,Ireland,137.3,-340,-340,-340,,,,,,,,,,,,,,140,M,,1988,Multi-ply,SBD
2,Darya Kogadeeva,F_OR_WPC,Russia,80.3,,,,,,120,125,130,130,,,,,,,130,82.5,F,Дарья Когадеева,1978,Raw,B
2,Darya Kremen,F_JR_WPC,Russia,64.6,102.5,107.5,112.5,112.5,,60,,,60,,150,157.5,-160,157.5,,330,67.5,F,Дарья Кремень,1989,Raw,SBD
1,Darya Kremen,F_JR_WPC,Russia,64.6,,,,,,,,,,,-160.5,-160.5,160.5,160.5,,160.5,67.5,F,Дарья Кремень,1989,Raw,D
2,Darya Kremen,F_OR_WPC,Russia,64.6,,,,,,,,,,,-160.5,-160.5,160.5,160.5,,160.5,67.5,F,Дарья Кремень,1989,Raw,D
3,Davaa Tumurau,F_OR_WPC,Mongolia,58.9,105,115,-125,115,,60,-70,72.5,72.5,,130,-140,-140,130,,317.5,60,F,,1980,Raw,SBD
1,Davaa Tumurau,F_OEM_WPC,Mongolia,59.7,-140,140,150,150,,70,80,-90,80,,140,150,-160,150,,380,60,F,,1980,Multi-ply,SBD
4,Davaa Tumurau,F_OR_WPC,Mongolia,59.1,,,,,,65,70,-75,70,,,,,,,70,60,F,,1980,Raw,B
1,Davaa Tumurau,F_OR_WPC,Mongolia,58.9,,,,,,,,,,,100,110,120,120,,120,60,F,,1980,Raw,D
3,Dave Rade,M_MR_1_WPC,Switzerland,86.6,200,210,220,220,,-150,150,-152.5,150,,240,260,-270,260,,630,90,M,,1969,Raw,SBD
7,David Cavanna,M_OR_WPC,France,81.3,,,,,,-160,160,-170,160,,,,,,,160,82.5,M,,1975,Raw,B
1,Dávid Mészáros,M_JR_WPC,Hungary,99.4,,,,,,195,205,212.5,212.5,,,,,,,212.5,100,M,,1993,Raw,B
2,David Perroud,M_MR_1_WPC,France,81.5,,,,,,-120,-120,120,120,,,,,,,120,82.5,M,,1969,Raw,B
1,Dean Piggott,M_TR_3_WPC,UK,73.6,155,165,170,170,,110,-120,-120,110,,-200,200,-212.5,200,,480,75,M,,1994,Raw,SBD
1,Debbie Damminga,F_MEM_3_WPC,USA,72.2,110,165,180,180,,60,85,-102.5,85,,192.5,-217.5,-217.5,192.5,,457.5,75,F,,1961,Multi-ply,SBD
7,Delger-Khishig Banzragch,M_OR_WPC,Mongolia,97.4,250,260,-270,260,,150,160,170,170,,262.5,-275,,262.5,,692.5,100,M,,1980,Raw,SBD
2,Delger-Khishig Banzragch,M_OEM_WPC,Mongolia,97.1,385,-395,-395,385,,-190,-190,190,190,,260,275,285,285,,860,100,M,,1980,Multi-ply,SBD
DQ,Delger-Khishig Banzragch,M_OEM_WPC,Mongolia,96.6,,,,,,,,,,,-285,-285,,,,,100,M,,1980,Multi-ply,D
4,Denis Bondarenko,M_OR_WPC,Israel,143.9,,,,,,212.5,220,230,230,,,,,,,230,140+,M,,1976,Raw,B
6,Denis Hofman,M_JR_WPC,Czechia,91.7,150,160,-170,160,,100,-107.5,107.5,107.5,,210,-225,-230,210,,477.5,100,M,,1993,Raw,SBD
5,Denis Makeev #1,M_OEM_WPC,Russia,132.4,,,,,,-190,190,195,195,,,,,,,195,140,M,Денис Макеев,1983,Multi-ply,B
1,Denis Makeev #1,M_OEM_WPC,Russia,132.7,,,,,,,,,,,275,300,315,315,,315,140,M,Денис Макеев,1983,Multi-ply,D
2,Denis Rodyakin,M_OR_WPC,Russia,107.7,290,310,322.5,322.5,,-185,190,-200,190,,315,320,327.5,327.5,,840,110,M,Денис Родякин,1988,Raw,SBD
4,Denis Semenov,M_OEM_WPC,Russia,126.3,,,,,,-280,280,-300,280,,,,,,,280,140,M,Денис Семенов,1974,Multi-ply,B
3,Didier Michelon,M_OEM_WPC,France,116.5,,,,,,-315,317.5,-335.5,317.5,,,,,,,317.5,125,M,,1963,Multi-ply,B
1,Didier Michelon,M_MEM_3_WPC,France,116.5,,,,,,-315,317.5,-335.5,317.5,,,,,,,317.5,125,M,,1963,Multi-ply,B
5,Didier Theux,M_OEM_WPC,France,89.1,,,,,,212.5,-220,-220,212.5,,,,,,,212.5,90,M,,1958,Multi-ply,B
DQ,Didier Theux,M_MEM_4_WPC,France,89.1,,,,,,-210,-210,-210,,,,,,,,,90,M,,1958,Multi-ply,B
2,Dmitriy Bubnov,M_MR_1_WPC,Russia,120.2,,,,,,215,225,230,230,,,,,,,230,125,M,Дмитрий Бубнов,1973,Raw,B
2,Dmitriy Kazakov,M_JR_WPC,Russia,80.4,,,,,,155,-160,162.5,162.5,,,,,,,162.5,82.5,M,Дмитрий Казаков,1990,Raw,B
DQ,Dmitriy Kochevatkin,M_OEM_WPC,Russia,81.4,,,,,,-225,-225,-225,,,,,,,,,82.5,M,Дмитрий Кочеваткин,1976,Multi-ply,B
1,Dmitriy Loginov,M_OEM_WPC,Russia,109.1,-325,325,340,340,,225,235,-245,235,,335,350,360,360,,935,110,M,Дмитрий Логинов,1989,Multi-ply,SBD
DQ,Dmitriy Lomeyko,M_OEM_WPC,Ukraine,89.9,,,,,,-240,-240,-240,,,,,,,,,90,M,Дмитро Ломейко,1983,Multi-ply,B
1,Dmitriy Permyakov,M_OEM_WPC,Russia,129.6,,,,,,330,345,-352.5,345,,,,,,,345,140,M,Дмитрий Пермяков,1975,Multi-ply,B
DQ,Dmitriy Tenetko,M_OR_WPC,Russia,109.2,,,,,,-245,-245,-245,,,,,,,,,110,M,Дмитрий Тенетко,1975,Raw,B
4,Dmitry Gorbachev,M_OEM_WPC,Russia,114.8,,,,,,-315,315,-320,315,,,,,,,315,125,M,Дмитрий Горбачев,1970,Multi-ply,B
1,Dmitry Gorbachev,M_MEM_1_WPC,Russia,114.8,,,,,,-315,315,-320,315,,,,,,,315,125,M,Дмитрий Горбачев,1970,Multi-ply,B
3,Dmitry Smirnov,M_OR_WPC,Russia,132.7,-265,275,290,290,,195,202.5,-210,202.5,,290,305,-312.5,305,,797.5,140,M,Дмитрий Смирнов,1978,Raw,SBD
DQ,Dmytro Derevyanko,M_OEM_WPC,Ukraine,95.1,-340,-340,-340,,,,,,,,,,,,,,100,M,Дмитро Дерев'янко,1984,Multi-ply,SBD
DQ,Dmytro Kharchenko,M_JEM_WPC,Ukraine,93.6,-380,-380,-380,,,,,,,,,,,,,,100,M,Дмитро Харченко,1991,Multi-ply,SBD
9,Dmytro Perederiy,M_OR_WPC,Ukraine,89.8,,,,,,-185,-185,185,185,,,,,,,185,90,M,Дмитро Передерій,1980,Raw,B
1,Dmytro Sharoyko,M_MEM_1_WPC,Ukraine,138.6,,,,,,300,-315,315,315,,,,,,,315,140,M,Дмитро Шаройко,1972,Multi-ply,B
5,Dmytro Voronin,M_OR_WPC,Ukraine,124.1,,,,,,205,-217.5,217.5,217.5,,,,,,,217.5,125,M,Дмитро Воронін,1980,Raw,B
1,Dominic Swanson,M_TR_1_WPC,USA,98.2,160,165,172.5,172.5,,120,-125,-125,120,,167.5,185,190,190,-200,482.5,100,M,,1998,Raw,SBD
1,Dominic Swanson,M_TR_1_WPC,USA,99,,,,,,117.5,120,125,125,-127.5,,,,,,125,100,M,,1998,Raw,B
6,Dora Lontro,F_OR_WPC,Portugal,67.5,100,105,-112.5,105,,50,55,60,60,,120,125,130,130,,295,67.5,F,,1987,Raw,SBD
1,Dóra Schopf,F_OR_WPC,Hungary,50.8,,,,,,70,75,77.5,77.5,,,,,,,77.5,52,F,,1974,Raw,B
DQ,Dusan Soukup,M_OR_WPC,Czechia,98,240,-260,-260,240,,,,,,,,,,,,,100,M,,1988,Raw,SBD
1,Eduard Khanjyan,M_OR_WPC,Finland,96.9,-255,265,275,275,,170,-175,,170,,282.5,310,-317.5,310,,755,100,M,,1985,Raw,SBD
2,Edvinas Vysniauskas,M_OR_WPC,UK,74.4,210,220,230,230,,140,150,-152.5,150,,200,225,-230,225,,605,75,M,,1987,Raw,SBD
3,Eglitis Aldis,M_MR_3_WPC,Latvia,81.9,,,,,,-110,-110,110,110,,,,,,,110,82.5,M,,1961,Raw,B
2,Ekaterina Mayorova,F_MR_1_WPC,Russia,63.3,60,70,75,75,,55,-60,-60,55,,70,80,90,90,,220,67.5,F,Екатерина Майорова,1970,Raw,SBD
1,Ekaterina Puzyrenko,F_OR_WPC,Russia,55.7,,,,,,85,-90,-90,85,,,,,,,85,56,F,Екатерина Пузыренко,1976,Raw,B
1,Elena Kuznetsova,F_MR_2_WPC,Russia,52.5,55,62.5,67.5,67.5,,35,37.5,-40,37.5,,70,80,90,90,,195,56,F,Елена Кузнецова,1966,Raw,SBD
1,Elena Sheverdina,F_MEM_2_WPC,Russia,73.6,,,,,,140,150,160,160,170,,,,,,160,75,F,Елена Шевердина,1968,Multi-ply,B
3,Elena Šimová,F_OR_WPC,Slovakia,64.2,125,132.5,137.5,137.5,,70,75,80,80,,150,157.5,162.5,162.5,,380,67.5,F,,1978,Raw,SBD
1,Elina Ponamareva,F_TR_1_WPC,Kazakhstan,58.3,70,75,-80,75,,30,-35,35,35,,80,90,100,100,,210,60,F,,1998,Raw,SBD
1,Elizabet Tomilov,F_YR_WPC,Israel,38.5,,,,,,30,32.5,-35,32.5,,,,,,,32.5,44,F,,2003,Raw,B
2,Elmin Neftaliyev,M_OR_WPC,Azerbaijan,81.7,250,270,-280,270,,170,180,182.5,182.5,,280,-300,-300,280,,732.5,82.5,M,,1982,Raw,SBD
2,Elmir Tarverdiyev,M_OR_WPC,Azerbaijan,59.8,175,185,-192.5,185,,100,112.5,,112.5,,212.5,-232.5,-232.5,212.5,,510,60,M,,1983,Raw,SBD
12,Emanuel Dias Deoliveria Ruben,M_OR_WPC,Portugal,89.8,,,,,,-160,-172.5,172.5,172.5,,,,,,,172.5,90,M,,1981,Raw,B
7,Emin Galib Ogly Mamedov,M_OEM_WPC,Russia,99.6,200,,,200,,300,315,330,330,340,220,-260,,220,,750,100,M,Емин Галиб Оглы Мамедов,1974,Multi-ply,SBD
DQ,Emin Galib Ogly Mamedov,M_OEM_WPC,Russia,99.7,,,,,,-320,-320,-320,,,,,,,,,100,M,Емин Галиб Оглы Мамедов,1974,Multi-ply,B
1,Emma Ylitalo-James,F_MES_1_WPC,UK,88.6,,,,,,192.5,200,-207.5,200,,,,,,,200,90,F,,1969,Single-ply,B
1,Emma Ylitalo-James,F_MR_1_WPC,UK,87.9,,,,,,,,,,,190,202.5,-207.5,202.5,,202.5,90,F,,1969,Raw,D
2,Emmy Louise,F_OR_WPC,UK,51.5,90,-100,100,100,,60,70,-72.5,70,,135,150,,150,,320,52,F,,1983,Raw,SBD
1,Emmy Louise,F_OR_WPC,UK,51.5,,,,,,,,,,,135,151,-160,151,,151,52,F,,1983,Raw,D
6,Erdenebayar Magmadorj,M_MR_1_WPC,Mongolia,85.3,,,,,,130,142.5,-147.5,142.5,,,,,,,142.5,90,M,,1968,Raw,B
1,Eric Athias,M_MEM_1_WPC,France,86.6,-320,320,-340,320,,200,210,222.5,222.5,,285,310,-322.5,310,,852.5,90,M,,1971,Multi-ply,SBD
DQ,Eric Platel,M_MEM_1_WPC,France,106.5,,,,,,-270,-270,-270,,,,,,,,,110,M,,1971,Multi-ply,B
2,Erik Jaškanič,M_JEM_WPC,Slovakia,106.5,-310,-310,310,310,,200,-210,,200,,310,335,350,350,,860,110,M,,1992,Multi-ply,SBD
1,Erik Karácsondi,M_TEM_3_WPC,Hungary,132,310,-330,-330,310,,230,-250,250,250,,-250,250,300,300,,860,140,M,,1995,Multi-ply,SBD
5,Erik Knöfler,M_OR_WPC,Germany,98.5,220,240,257.5,257.5,,155,165,172.5,172.5,,270,290,302.5,302.5,,732.5,100,M,,1981,Raw,SBD
1,Erik Susztay,M_MR_1_WPC,Slovakia,128.2,,,,,,-207.5,215,222.5,222.5,,,,,,,222.5,140,M,,1972,Raw,B
DQ,Ernest Ruzin,M_MR_8_WPC,Israel,62.7,-122.5,-122.5,-122.5,,,,,,,,,,,,,,67.5,M,,1937,Raw,SBD
1,Ernest Ruzin,M_MR_8_WPC,Israel,63,,,,,,,,,,,145,160,165,165,,165,67.5,M,,1937,Raw,D
1,Beasty Tuilagi,M_JR_WPC,UK,80.8,182.5,192.5,-200,192.5,,155,162.5,170,170,,265,280,287.5,287.5,293,650,82.5,M,,1991,Raw,SBD
3,Beasty Tuilagi,M_OR_WPC,UK,80.8,182.5,192.5,-200,192.5,,155,162.5,170,170,,265,280,287.5,287.5,293,650,82.5,M,,1991,Raw,SBD
5,Eva Vyhlídalová,F_OR_WPC,Czechia,70.2,100,-107.5,-110,100,,65,70,-75,70,,140,155,-165,155,,325,75,F,,1988,Raw,SBD
2,Evgeniy Basov,M_MR_4_WPC,Russia,88.7,,,,,,135,-145,-150,135,,,,,,,135,90,M,Евгений Басов,1955,Raw,B
1,Evgeniy Basov,M_MEM_4_WPC,Russia,89.2,,,,,,165,175,-185,175,,,,,,,175,90,M,Евгений Басов,1955,Multi-ply,B
1,Evgeniy Dmitriev,M_MR_7_WPC,Russia,122.3,,,,,,120,130,,130,,,,,,,130,125,M,Евгений Дмитриев,1940,Raw,B
1,Evgeniy Khudoleev,M_MR_6_WPC,Russia,86.8,,,,,,,,,,,210,225,230,230,,230,90,M,Евгений Худолеев,1946,Raw,D
1,Evgeniy Khudoleev,M_MEM_6_WPC,Russia,86.8,,,,,,,,,,,210,225,-235,225,,225,90,M,Евгений Худолеев,1946,Multi-ply,D
1,Evgeniy Stuchkov,M_MR_3_WPC,Russia,109.5,,,,,,180,-190,-190,180,,,,,,,180,110,M,Евгений Стучков,1961,Raw,B
1,Evgeniy Vyborov,M_MR_7_WPC,Russia,69.9,,,,,,80,90,-95,90,,,,,,,90,75,M,Евгений Выборов,1939,Raw,B
6,Evgeniy Zankov,M_OR_WPC,Russia,90,,,,,,202.5,-207.5,-207.5,202.5,,,,,,,202.5,90,M,Евгений Заньков,1987,Raw,B
1,Ferenc Gyenes,M_MR_2_WPC,Hungary,110.7,220,230,-240,230,,150,160,,160,,260,-270,-270,260,,650,125,M,,1968,Raw,SBD
1,Ferenc Smuk,M_MR_5_WPC,Hungary,88.4,200,210,-215,210,,90,-95,,90,,-222.5,222.5,230,230,-248,530,90,M,,1952,Raw,SBD
3,Fernando Santos,M_JEM_WPC,Portugal,89.9,-250,-260,260,260,,150,170,180,180,,225,250,-265,250,,690,90,M,,1991,Multi-ply,SBD
2,Filip Stanko,M_JEM_WPC,Slovakia,81,250,-265,-265,250,,-210,-210,210,210,-238,190,-207.5,207.5,207.5,,667.5,82.5,M,,1990,Multi-ply,SBD
6,Filipe Lavandeira,M_OEM_WPC,Portugal,102,-325,325,-350,325,,-190,200,-220,200,,260,-280,-280,260,,785,110,M,,1985,Multi-ply,SBD
3,Filipe Simoes Luis,M_OR_WPC,Portugal,82.4,,,,,,170,180,-192.5,180,,,,,,,180,82.5,M,,1981,Raw,B
2,Florindo Figueiredo Pinheiro,M_OR_WPC,Portugal,97.2,,,,,,235,240,-253,240,,,,,,,240,100,M,,1973,Raw,B
1,Forrest Grivetti,M_TEM_3_WPC,USA,73.6,-227.5,250,-272.5,250,,152.5,-167.5,167.5,167.5,,187.5,202.5,212.5,212.5,,630,75,M,,1995,Multi-ply,SBD
1,František Esser,M_MEM_6_WPC,Czechia,92.6,120,140,,140,,125,-135,,125,,160,180,200,200,,465,100,M,,1946,Multi-ply,SBD
1,František Esser,M_MR_6_WPC,Czechia,91.3,,,,,,110,120,-130,120,,,,,,,120,100,M,,1946,Raw,B
1,František Esser,M_MEM_6_WPC,Czechia,91.7,,,,,,130,-140,-140,130,,,,,,,130,100,M,,1946,Multi-ply,B
1,František Esser,M_MR_6_WPC,Czechia,92.6,,,,,,,,,,,160,175,180,180,190,180,100,M,,1946,Raw,D
DQ,Gabor Berek,M_OR_WPC,Hungary,97.3,,,,,,-230,-232.5,-237.5,,,,,,,,,100,M,,1987,Raw,B
1,Gábor Katona,M_JEM_WPC,Hungary,104.1,,,,,,320,330,343,343,,,,,,,343,110,M,,1991,Multi-ply,B
1,Gábor Novakovics,M_JR_WPC,Hungary,96.5,,,,,,,,,,,-270,270,280,280,,280,100,M,,1989,Raw,D
1,Gabriel Kováč,M_TR_3_WPC,Slovakia,80.8,,,,,,170,175,180,180,-185,,,,,,180,82.5,M,,1995,Raw,B
1,Gabriel Kováč,M_TEM_3_WPC,Slovakia,79.6,,,,,,230,250,-260,250,,,,,,,250,82.5,M,,1995,Multi-ply,B
DQ,Gary Croft,M_OR_WPC,UK,97.5,-185,-185,-185,,,,,,,,,,,,,,100,M,,1980,Raw,SBD
1,Gary Reichert,M_MEM_3_WPC,USA,67.1,210,225,237.5,237.5,,-100,-140,140,140,,210,235,-272.5,235,,612.5,67.5,M,,1960,Multi-ply,SBD
10,Gary Topley,M_OR_WPC,UK,95.9,,,,,,170,180,-190,180,,,,,,,180,100,M,,1985,Raw,B
4,Gatis Biezais,M_OR_WPC,Latvia,81.9,,,,,,170,-175,-175,170,,,,,,,170,82.5,M,,1975,Raw,B
11,Gavrilo Gavrilov,M_OR_WPC,Serbia,97.8,,,,,,180,-200,,180,,,,,,,180,100,M,,1985,Raw,B
1,Gennadiy Popov,M_TEM_3_WPC,Ukraine,96.1,,,,,,180,190,-205,190,,,,,,,190,100,M,Геннадій Попов,1994,Multi-ply,B
5,Gennady Obermeister,M_OEM_WPC,Israel,109.1,,,,,,240,250,-260,250,,,,,,,250,110,M,,1970,Multi-ply,B
2,Gennady Obermeister,M_MEM_1_WPC,Israel,109.1,,,,,,240,250,-260,250,,,,,,,250,110,M,,1970,Multi-ply,B
3,Georgiy Lopatskiy,M_OEM_WPC,Russia,128,,,,,,275,285,,285,,,,,,,285,140,M,Георгий Лопацкий,1962,Multi-ply,B
1,Georgiy Lopatskiy,M_MEM_3_WPC,Russia,128,,,,,,275,285,,285,,,,,,,285,140,M,Георгий Лопацкий,1962,Multi-ply,B
1,Gerd Meyerhofer,M_MR_8_WPC,Germany,77.7,,,,,,60,65,-67.5,65,,,,,,,65,82.5,M,,1938,Raw,B
2,Gerd Meyerhofer,M_MEM_8_WPC,Germany,78,,,,,,60,67.5,-72.5,67.5,,,,,,,67.5,82.5,M,,1938,Multi-ply,B
1,Gerrit Scheel,M_JR_WPC,Germany,82,,,,,,157.5,162.5,170,170,,,,,,,170,82.5,M,,1991,Raw,B
3,Gerrit Scheel,M_JEM_WPC,Germany,81.8,,,,,,175,182.5,185,185,,,,,,,185,82.5,M,,1991,Multi-ply,B
1,Grachik Egozaryan,M_MR_5_WPC,Russia,116.2,,,,,,180,190,-202.5,190,,,,,,,190,125,M,Грачик Егозарьян,1952,Raw,B
DQ,Gregg Damminga,M_MEM_3_WPC,USA,124.1,-335,-335,-335,,,,,,,,,,,,,,125,M,,1962,Multi-ply,SBD
DQ,Grigori Rubin,M_MEM_8_WPC,Israel,73.7,-155,-155,-160,,,,,,,,,,,,,,75,M,,1936,Multi-ply,SBD
1,Grigori Rubin,M_MR_8_WPC,Israel,73.7,,,,,,90,95,-97.5,95,,,,,,,95,75,M,,1936,Raw,B
1,Grigori Rubin,M_MEM_8_WPC,Israel,75.1,,,,,,110,115,-120,115,,,,,,,115,82.5,M,,1936,Multi-ply,B
DQ,Grigoriy Missurin,M_OR_WPC,Kazakhstan,81.2,,,,,,-197.5,-197.5,-197.5,,,,,,,,,82.5,M,,1983,Raw,B
6,Grzegorz Blachowiak,M_OR_WPC,Poland,106.4,,,,,,-230,230,-247.5,230,,,,,,,230,110,M,,1982,Raw,B
2,Gunduz Mamadov,M_OR_WPC,Azerbaijan,90,280,-292.5,-292.5,280,,182.5,190,195,195,,270,-282.5,,270,,745,90,M,,1983,Raw,SBD
10,Gunduz Mamadov,M_OR_WPC,Azerbaijan,89.5,,,,,,180,-202.5,,180,,,,,,,180,90,M,,1983,Raw,B
1,Gunduz Mamadov,M_OR_WPC,Azerbaijan,90,,,,,,,,,,,200,250,,250,,250,90,M,,1983,Raw,D
1,Gunel Talybova,F_OR_WPC,Azerbaijan,53.3,130,135.5,137.5,137.5,140,85.5,87.5,-90,87.5,,175,185,190,190,,415,56,F,,1982,Raw,SBD
1,Gyöngyi Balogh,F_OR_WPC,Hungary,47.1,,,,,,,,,,,100,110,-112.5,110,,110,48,F,,1984,Raw,D
1,Hans-Jürgen Borkowski,M_MEM_5_WPC,Germany,96.8,,,,,,150,160,,160,,,,,,,160,100,M,,1950,Multi-ply,B
1,Hans-Jürgen Kaule,M_MEM_4_WPC,Germany,74.2,,,,,,-160,-160,160,160,,,,,,,160,75,M,,1954,Multi-ply,B
1,Hans-Jürgen Kaule,M_MEM_4_WPC,Germany,74.3,,,,,,,,,,,210,230,240,240,,240,75,M,,1954,Multi-ply,D
1,Hans-Ulrich Vetter,M_MEM_5_WPC,Germany,107.8,,,,,,180,-190,-190,180,,,,,,,180,110,M,,1952,Multi-ply,B
2,Harri Peltomaa,M_OR_WPC,Finland,104.5,,,,,,,,,,,325,-345,-345,325,,325,110,M,,1983,Raw,D
1,Hartmut Niemann,M_MR_4_WPC,Germany,79.8,,,,,,135,145,-152.5,145,,,,,,,145,82.5,M,,1953,Raw,B
4,Hassan Zaid,M_OEM_WPC,UK,94.8,310,-330,-340,310,,180,-195,-195,180,,280,300,-317.5,300,,790,100,M,,1987,Multi-ply,SBD
6,Heiko Fritzsch,M_OEM_WPC,Germany,101.4,,,,,,230,-240,-240,230,,,,,,,230,110,M,,1979,Multi-ply,B
1,Helvijs Niedra,M_TR_2_WPC,Latvia,71.1,120,-140,-140,120,,75,80,-85,80,,140,160,-170,160,,360,75,M,,1997,Raw,SBD
DQ,Ian Phelan,M_OR_WPC,Ireland,96.1,-190,-190,-190,,,,,,,,,,,,,,100,M,,1976,Raw,SBD
DQ,Ibrahim Ibrahimov,M_OEM_WPC,Azerbaijan,109.8,,,,,,-310,-312.5,-312.5,,,,,,,,,110,M,,1981,Multi-ply,B
2,Ichinnorov Darkhanbaatar,F_OR_WPC,Mongolia,74.7,170,180,187.5,187.5,,105,112.5,-115,112.5,,155,165,175,175,,475,75,F,,1989,Raw,SBD
1,Ichinnorov Darkhanbaatar,F_OEM_WPC,Mongolia,74.9,-250,250,-260,250,,150,160,170,170,,180,-190,-190,180,,600,75,F,,1989,Multi-ply,SBD
2,Ichinnorov Darkhanbaatar,F_OR_WPC,Mongolia,74.9,,,,,,107.5,112.5,-117.5,112.5,,,,,,,112.5,75,F,,1989,Raw,B
1,Ichinnorov Darkhanbaatar,F_OEM_WPC,Mongolia,74.5,,,,,,150,157.5,162.5,162.5,,,,,,,162.5,75,F,,1989,Multi-ply,B
1,Igor Kuznetsov #1,M_OR_WPC,Russia,66.6,190,200,-205,200,,140,-150,150,150,-152.5,230,237.5,-240,237.5,,587.5,67.5,M,Игорь Кузнецов,1989,Raw,SBD
3,Igor Moroz,M_MR_2_WPC,Russia,84.9,,,,,,150,-160,160,160,,,,,,,160,90,M,Игорь Мороз,1965,Raw,B
2,Igor Pober,M_MR_1_WPC,Ukraine,132.8,,,,,,-220,-220,220,220,,,,,,,220,140,M,Ігор Побер,1968,Raw,B
4,Igor Sergeev,M_OR_WPC,Russia,97.9,,,,,,215,225,230,230,-233,,,,,,230,100,M,Игорь Сергеев,1966,Raw,B
1,Igor Sergeev,M_MR_2_WPC,Russia,97.9,,,,,,215,225,230,230,-233,,,,,,230,100,M,Игорь Сергеев,1966,Raw,B
2,Igor Sergeev,M_OEM_WPC,Russia,96.9,,,,,,-270,270,280,280,,,,,,,280,100,M,Игорь Сергеев,1966,Multi-ply,B
1,Igor Sergeev,M_MEM_2_WPC,Russia,96.9,,,,,,-270,270,280,280,,,,,,,280,100,M,Игорь Сергеев,1966,Multi-ply,B
2,Igor Shubin,M_MEM_2_WPC,Ukraine,89.9,,,,,,160,-180,,160,,,,,,,160,90,M,Ігор Шубін,1964,Multi-ply,B
2,Imrich Klacso,M_MR_1_WPC,Slovakia,98,,,,,,-185,185,-200,185,,,,,,,185,100,M,,1970,Raw,B
1,Imrich Klacso,M_MEM_1_WPC,Slovakia,98.3,,,,,,230,-237.5,237.5,237.5,,,,,,,237.5,100,M,,1970,Multi-ply,B
5,Inna Yudina,F_OEM_WPC,Ukraine,75,,,,,,-97.5,97.5,-107.5,97.5,,,,,,,97.5,75,F,Інна Юдіна,1978,Multi-ply,B
1,Iosif Plagov,M_MR_8_WPC,USA,64.3,,,,,,85,-90,-90,85,,,,,,,85,67.5,M,,1935,Raw,B
2,Irina Ignatovich,F_OR_WPC,Russia,56.9,115,130,137.5,137.5,,75,82.5,85,85,,140,150,,150,,372.5,60,F,Ирина Игнатович,1982,Raw,SBD
1,Irina Pomerantsev,F_OR_WPC,Israel,43,65,72.5,77.5,77.5,,57.5,62.5,-65,62.5,,87.5,95,100,100,,240,44,F,,1970,Raw,SBD
1,Irina Pomerantsev,F_MR_1_WPC,Israel,43,65,72.5,77.5,77.5,,57.5,62.5,-65,62.5,,87.5,95,100,100,,240,44,F,,1970,Raw,SBD
5,Irina Shiryaeva,F_OR_WPC,Russia,55.2,62.5,-75,-75,62.5,,37.5,40,42.5,42.5,,70,80,85,85,,190,56,F,Ирина Ширяева,1985,Raw,SBD
1,Ismo Åman,M_MR_4_WPC,Finland,135.1,210,225,-240,225,,110,120,130,130,,270,307.5,317.5,317.5,,672.5,140,M,,1955,Raw,SBD
1,Ivan Morgun,M_JEM_WPC,Ukraine,108,370,390,-400,390,,-260,260,272.5,272.5,,300,320,-337.5,320,,982.5,110,M,Іван Моргун,1990,Multi-ply,SBD
7,Ivan Solntsev,M_OR_WPC,Russia,97.9,,,,,,-200,200,-205,200,,,,,,,200,100,M,Иван Солнцев,1974,Raw,B
1,Ivars Cīrulis,M_OEM_WPC,Latvia,107.6,,,,,,,,,,,330,350,-370,350,,350,110,M,,1979,Multi-ply,D
5,Jacek Ostrowski,M_OR_WPC,Poland,104.9,250,,,250,,180,190,-195,190,,270,285,-295,285,,725,110,M,,1985,Raw,SBD
DQ,Jack Chambers,M_JEM_WPC,UK,82.5,-260,-260,-260,,,,,,,,,,,,,,82.5,M,,1991,Multi-ply,SBD
DQ,Jack Chambers,M_OEM_WPC,UK,89.8,200,250,-270,250,,-170,170,-200,170,,-230,-255,-255,,,,90,M,,1991,Multi-ply,SBD
3,Jakub Sedláček,M_OR_WPC,Czechia,82.4,235,250,260,260,,-190,190,200,200,,230,250,-275,250,,710,82.5,M,,1988,Raw,SBD
4,Jakub Sedláček,M_OR_WPC,Czechia,84.6,,,,,,195,205,-210,205,,,,,,,205,90,M,,1988,Raw,B
5,Jamal Mammadov,M_OR_WPC,Azerbaijan,82,,,,,,150,162.5,,162.5,,,,,,,162.5,82.5,M,,1991,Raw,B
2,Jamal Mammadov,M_JEM_WPC,Azerbaijan,82,,,,,,-180,180,187.5,187.5,,,,,,,187.5,82.5,M,,1991,Multi-ply,B
1,Jamal Mammadov,M_JR_WPC,Azerbaijan,82,,,,,,,,,,,150,180,200,200,,200,82.5,M,,1991,Raw,D
6,Ján Hubay,M_MR_1_WPC,Slovakia,119.9,,,,,,150,-160,160,160,,,,,,,160,125,M,,1971,Raw,B
5,Jan Jíša,M_OEM_WPC,Czechia,103.4,300,330,-332.5,330,,-220,-220,220,220,,260,285,-300,285,,835,110,M,,1988,Multi-ply,SBD
1,Jan Michalov,M_JR_WPC,Slovakia,112.9,250,270,280,280,,160,175,180,180,,300,315,-320,315,,775,125,M,,1990,Raw,SBD
1,Ján Orosz,M_MR_2_WPC,Slovakia,123.6,,,,,,215,-225,225,225,-231.5,,,,,,225,125,M,,1964,Raw,B
2,Jan Orosz Jr,M_TR_2_WPC,Slovakia,78.1,,,,,,95,100,-105,100,,,,,,,100,82.5,M,,1995,Raw,B
DQ,Jan Sedláček,M_JEM_WPC,Czechia,99.4,-150,-180,-180,,,,,,,,,,,,,,100,M,,1992,Multi-ply,SBD
2,Jan Sedláček,M_JEM_WPC,Czechia,99.4,,,,,,,,,,,200,220,-237.5,220,,220,100,M,,1992,Multi-ply,D
3,Jan Vítek,M_MR_1_WPC,Czechia,141.4,,,,,,170,175,180,180,,,,,,,180,140+,M,,1971,Raw,B
1,Jan Vítek,M_MEM_1_WPC,Czechia,142.3,,,,,,190,205,-217.5,205,,,,,,,205,140+,M,,1971,Multi-ply,B
1,Jan Žvak,M_OR_WPC,Czechia,125.4,-280,280,290,290,,200,210,-220,210,,330,-350,-350,330,,830,140,M,,1978,Raw,SBD
1,Jane Stabile,F_MEM_5_WPC,USA,73.2,-172.5,-172.5,172.5,172.5,,85,-92.5,-92.5,85,,160,-170,-170,160,,417.5,75,F,,1952,Multi-ply,SBD
1,Janica Timonen,F_JR_WPC,Finland,66.4,,,,,,70,75,-77.5,75,,,,,,,75,67.5,F,,1990,Raw,B
2,János Szabó Ozor,M_MR_1_WPC,Hungary,150,,,,,,185,200,210,210,,,,,,,210,140+,M,,1972,Raw,B
2,Jargalsaikhan Sosorbaram,M_MR_1_WPC,Mongolia,94.4,185,195,202.5,202.5,,-140,140,150,150,,180,,,180,,532.5,100,M,,1970,Raw,SBD
2,Jargalsaikhan Sosorbaram,M_MEM_1_WPC,Mongolia,94.1,275,-300,,275,,165,175,,175,,200,212.5,222.5,222.5,,672.5,100,M,,1970,Multi-ply,SBD
2,Jargalsaikhan Sosorbaram,M_MR_1_WPC,Mongolia,93.3,,,,,,,,,,,-180,180,,180,,180,100,M,,1970,Raw,D
DQ,Jaromír Kratochvíl,M_OEM_WPC,Czechia,97.3,-365,-370,-370,,,,,,,,,,,,,,100,M,,1978,Multi-ply,SBD
2,Jean Douliez,M_MR_3_WPC,France,81.5,,,,,,-125,125,-137.5,125,,,,,,,125,82.5,M,,1959,Raw,B
1,Jean-Claude Camicas,M_MR_7_WPC,France,58.4,,,,,,-80,80,82.5,82.5,,,,,,,82.5,60,M,,1943,Raw,B
1,Jeffrey Podszuweit,M_OR_WPC,Germany,73.7,205,-220,225,225,,167.5,175,-180,175,,220,242.5,-255,242.5,,642.5,75,M,,1977,Raw,SBD
5,Jelena Tomic,F_OR_WPC,Serbia,71.1,,,,,,70,77.5,-80,77.5,,,,,,,77.5,75,F,,1986,Raw,B
1,Jérémy Babin,M_JEM_WPC,France,81.6,240,-255,-262.5,240,,165,180,187.5,187.5,,205,235,247.5,247.5,,675,82.5,M,,1990,Multi-ply,SBD
10,Jeroem Pol,M_OR_WPC,Netherlands,114.4,,,,,,170,175,-180,175,,,,,,,175,125,M,,1986,Raw,B
DQ,Jindřich Dressler,M_OR_WPC,Czechia,108.2,,,,,,-210,-210,-220,,,,,,,,,110,M,,1978,Raw,B
2,Jiří Havrda,M_OEM_WPC,Czechia,139.9,,,,,,320,342.5,-352.5,342.5,,,,,,,342.5,140,M,,1974,Multi-ply,B
DQ,Jiří Tkadlčík,M_OR_WPC,Czechia,104.1,245,-260,-265,245,,180,190,-200,190,,,,,,,,110,M,,1990,Raw,SBD
4,Joäo Manaia,M_OR_WPC,Portugal,81.9,230,242.5,250,250,,145,152.5,-160,152.5,,250,270,-280,270,,672.5,82.5,M,,1982,Raw,SBD
1,Joaquim Morais,M_MR_4_WPC,Portugal,111.1,180,200,210,210,,155,160,-165,160,,200,220,-230,220,,590,125,M,,1958,Raw,SBD
3,Joaquim Morais,M_MR_4_WPC,Portugal,108,,,,,,155,162.5,-167.5,162.5,,,,,,,162.5,110,M,,1958,Raw,B
1,Joaquim Morais,M_MR_4_WPC,Portugal,113.3,,,,,,,,,,,200,220,230,230,,230,125,M,,1958,Raw,D
7,Joel Reis,M_OR_WPC,Portugal,85.1,115,-120,-130,115,,85,95,105,105,,130,140,160,160,,380,90,M,,1988,Raw,SBD
1,Joël Tartare,M_MR_5_WPC,France,72.9,,,,,,95,-101,-101,95,,,,,,,95,75,M,,1951,Raw,B
2,John Draher,M_OR_WPC,USA,119.6,,,,,,227.5,232.5,-247.5,232.5,,,,,,,232.5,125,M,,1976,Raw,B
6,Jordan Moffitt,M_OR_WPC,Canada,97.1,230,240,250,250,,152.5,165,170,170,,265,285,290,290,,710,100,M,,1987,Raw,SBD
1,Jorens Minats,M_YR_WPC,Latvia,59.5,52.5,57.5,62.5,62.5,,25,30,-35,30,,75,85,90,90,,182.5,60,M,,2002,Raw,SBD
DQ,Jose Eusebio Sandro,M_OEM_WPC,Portugal,127.5,,,,,,,,,,,,,,,,,140,M,,1975,Multi-ply,SBD
1,Jose Fontes Teixeira,M_MR_1_WPC,Portugal,97.2,220,230,240,240,,125,135,145,145,,265,275,285,285,-300.5,670,100,M,,1970,Raw,SBD
1,Jose Fontes Teixeira,M_MEM_1_WPC,Portugal,97.9,,,,,,,,,,,280,290,300,300,,300,100,M,,1970,Multi-ply,D
1,Josef Gabrhel,M_MR_4_WPC,Slovakia,73.2,,,,,,95,100,105,105,,,,,,,105,75,M,,1955,Raw,B
1,Josef Hakl,M_MR_5_WPC,Czechia,108.3,,,,,,-150,150,-165,150,,,,,,,150,110,M,,1950,Raw,B
1,Josef Hakl,M_MEM_5_WPC,Czechia,111.6,,,,,,170,-185,-185,170,,,,,,,170,125,M,,1950,Multi-ply,B
4,Josef Peška,M_JR_WPC,Czechia,97.9,,,,,,170,175,-182.5,175,,,,,,,175,100,M,,1990,Raw,B
1,Joe Smolinski,M_MR_4_WPC,USA,108.5,,,,,,175,185,-192.5,185,,,,,,,185,110,M,,1955,Raw,B
2,Joe Smolinski,M_MEM_4_WPC,USA,108,,,,,,225,236,242.5,242.5,-244,,,,,,242.5,110,M,,1955,Multi-ply,B
8,Josh Currann,M_OR_WPC,Canada,99.2,190,205,217.5,217.5,,130,140,145,145,,240,260,275,275,,637.5,100,M,,1989,Raw,SBD
2,Josh Sykes,M_JR_WPC,UK,63.6,105,115,-120,115,,80,85,-90,85,,160,-170,-172.5,160,,360,67.5,M,,1990,Raw,SBD
1,Jozef Péter,M_MR_5_WPC,Slovakia,130.9,,,,,,175,-180,180,180,,,,,,,180,140,M,,1950,Raw,B
DQ,Jozef Péter,M_MEM_5_WPC,Slovakia,131.9,,,,,,-200,-200,-210,,,,,,,,,140,M,,1950,Multi-ply,B
1,József Sztanke,M_MR_4_WPC,Hungary,91.8,180,210,230.5,230.5,,140,160,167.5,167.5,,200,220,-237.5,220,,618,100,M,,1954,Raw,SBD
DQ,József Sztanke,M_MEM_4_WPC,Hungary,89.3,,,,,,-200,-200,-212.5,,,,,,,,,90,M,,1954,Multi-ply,B
1,Júlia Kostúrová,F_JEM_WPC,Slovakia,78,,,,,,160,172.5,180,180,182.5,,,,,,180,82.5,F,,1989,Multi-ply,B
1,Julian Vigh,M_TR_2_WPC,Switzerland,63.7,,,,,,92.5,97.5,-105,97.5,,,,,,,97.5,67.5,M,,1997,Raw,B
4,Juraj Dzimas,M_MR_4_WPC,Slovakia,105.2,,,,,,147.5,-152.5,-155,147.5,,,,,,,147.5,110,M,,1955,Raw,B
1,Juraj Hájnik,M_TR_3_WPC,Slovakia,81.5,170,180,-187.5,180,,125,-135,135,135,,200,215,-230,215,-238,530,82.5,M,,1993,Raw,SBD
DQ,Oskari Lehtinen,M_OEM_WPC,Finland,99,-390,-390,-405,,,,,,,,,,,,,,100,M,,1989,Multi-ply,SBD
3,Oskari Lehtinen,M_OEM_WPC,Finland,97.7,,,,,,265,275,,275,,,,,,,275,100,M,,1989,Multi-ply,B
1,Kalle Räsänen,M_JEM_WPC,Finland,90,370,390,-402.5,390,,260,-270,-272.5,260,,320,-335,-335,320,,970,90,M,,1990,Multi-ply,SBD
1,Kalle Räsänen,M_JEM_WPC,Finland,89.7,,,,,,-250,250,-270,250,,,,,,,250,90,M,,1990,Multi-ply,B
1,Kalle Räsänen,M_JEM_WPC,Finland,90.3,,,,,,,,,,,290,310,,310,,310,100,M,,1990,Multi-ply,D
2,Kalle Räsänen,M_OEM_WPC,Finland,90.3,,,,,,,,,,,290,310,,310,,310,100,M,,1990,Multi-ply,D
DQ,Kalle Ylitalo-James,M_OEM_WPC,Finland,115.8,200,,,200,,-300,-300,-325,,,,,,,,,125,M,,1983,Multi-ply,SBD
DQ,Kalle Ylitalo-James,M_OEM_WPC,Finland,109.4,,,,,,-292.5,-292.5,-302.5,,,,,,,,,110,M,,1983,Multi-ply,B
2,Kamil Gafarov,M_OR_WPC,Azerbaijan,82.1,,,,,,190,-202.5,-202.5,190,,,,,,,190,82.5,M,,1984,Raw,B
1,Kamil Gafarov,M_OEM_WPC,Azerbaijan,82.1,,,,,,222.5,232.5,240,240,,,,,,,240,82.5,M,,1984,Multi-ply,B
3,Kamil Grim,M_MEM_1_WPC,Czechia,99,,,,,,-190,-190,190,190,,,,,,,190,100,M,,1969,Multi-ply,B
1,Kamil Kanas,M_JR_WPC,Poland,95.5,230,240,245,245,,180,190,195,195,,-260,260,265,265,,705,100,M,,1990,Raw,SBD
1,Kamila Tillack,F_MR_1_WPC,Germany,67.1,77.5,85,-87.5,85,,67.5,72.5,75,75,,127.5,137.5,145,145,,305,67.5,F,,1969,Raw,SBD
13,Karel Mikeš,M_OR_WPC,Czechia,89.9,,,,,,145,-150,-155,145,,,,,,,145,90,M,,1976,Raw,B
1,Karel Sazma,M_OR_WPC,Czechia,72.5,,,,,,,,,,,220,230,235,235,,235,75,M,,1975,Raw,D
1,Karel Schoř,M_MR_4_WPC,Czechia,86.2,170,182.5,190,190,,135,-140,140,140,,220,235,250,250,,580,90,M,,1955,Raw,SBD
1,Karel Schoř,M_MR_4_WPC,Czechia,85.5,,,,,,135,142.5,-147.5,142.5,,,,,,,142.5,90,M,,1955,Raw,B
2,Karel Schoř,M_MR_4_WPC,Czechia,86.2,,,,,,,,,,,220,235,245,245,,245,90,M,,1955,Raw,D
1,Karin Kaule Inge,F_MEM_5_WPC,Germany,50,,,,,,52.5,55,57.5,57.5,-60,,,,,,57.5,52,F,,1952,Multi-ply,B
2,Karl Schrabauer,M_MR_2_WPC,Austria,106.7,,,,,,135,-150,-155,135,,,,,,,135,110,M,,1967,Raw,B
DQ,Karol Kornel Repiský,M_MR_2_WPC,Slovakia,110,,,,,,-160,-160,-160,,,,,,,,,110,M,,1964,Raw,B
3,Karol Kornel Repiský,M_MEM_2_WPC,Slovakia,113.4,,,,,,210,230,242.5,242.5,,,,,,,242.5,125,M,,1964,Multi-ply,B
1,Katalin Schindlerné Kis,F_MEM_1_WPC,Hungary,66.6,-110,-110,110,110,,-70,80,-87.5,80,,120,130,132.5,132.5,,322.5,67.5,F,,1970,Multi-ply,SBD
1,Kaytee Poolton,F_TR_3_WPC,UK,50.6,100,-105,105,105,,50,55,-57.5,55,,120,127.5,-130,127.5,,287.5,52,F,,1994,Raw,SBD
1,Khishigtogtokh Baatarjav,M_MR_1_WPC,Mongolia,86.5,,,,,,,,,,,170,190,-200,190,,190,90,M,,1971,Raw,D
DQ,Kjell Nyhagebråten,M_MEM_2_WPC,Norway,108,-365,-365,,,,,,,,,,,,,,,110,M,,1966,Multi-ply,SBD
1,Klaus Krüger,M_MEM_5_WPC,Germany,88.6,,,,,,175,190,-200,190,,,,,,,190,90,M,,1952,Multi-ply,B
1,Konstantin Kiselev,M_MEM_2_WPC,Russia,95.9,-265,-265,265,265,,180,190,200,200,,210,230,245,245,,710,100,M,Константин Киселев,1965,Multi-ply,SBD
2,Konstantin Kiselev,M_MEM_2_WPC,Russia,93.4,,,,,,-195,200,-210,200,,,,,,,200,100,M,Константин Киселев,1965,Multi-ply,B
2,Konstantīns Soboļevs,M_JR_WPC,Latvia,99.6,,,,,,185,-190,-190,185,,,,,,,185,100,M,,1990,Raw,B
1,Kostantin Lapin,M_MR_1_WPC,Kazakhstan,89.6,,,,,,170,180,-185,180,,,,,,,180,90,M,,1973,Raw,B
1,Kostyantin Chernov,M_OEM_WPC,Ukraine,81.8,-310,310,-330,310,,252.5,-260,260,260,,230,250,265,265,,835,82.5,M,Костянтин Чернов,1984,Multi-ply,SBD
1,Krasimir Krachunov,M_OR_WPC,Bulgaria,99.3,,,,,,,,,,,295,315,326,326,,326,100,M,,1985,Raw,D
1,Kristy Reske,F_OR_WPC,USA,123.2,,,,,,125,137.5,141,141,142,,,,,,141,90+,F,,1977,Raw,B
2,Krisztián Kaiser,M_OR_WPC,Hungary,67.5,,,,,,125,-135,-135,125,,,,,,,125,67.5,M,,1977,Raw,B
5,Kseniya Gunina,F_OR_WPC,Russia,59.9,60,65,-70,65,,40,45,-47.5,45,,70,82.5,-90,82.5,,192.5,60,F,Ксения Гунина,1986,Raw,SBD
1,Kurt McEvansoneya,M_TR_3_WPC,UK,92.5,160,180,200,200,,-130,130,-140,130,,240,-260,-260,240,,570,100,M,,1993,Raw,SBD
1,Květoslav Štora,M_MR_7_WPC,Czechia,91.2,,,,,,95,-100,,95,,,,,,,95,100,M,,1940,Raw,B
3,Kyrylo Ostapishin,M_OEM_WPC,Ukraine,87,-315,315,-330,315,,215,222.5,-230,222.5,,270,-285,-285,270,,807.5,90,M,Кирило Остапішин,1985,Multi-ply,SBD
1,Kyrylo Sharoyko,M_TR_1_WPC,Ukraine,79.3,,,,,,85,-95,-95,85,,,,,,,85,82.5,M,Кирило Шаройко,1998,Raw,B
1,Ladislav Kollár,M_MR_7_WPC,Slovakia,79.4,,,,,,120,127.5,-130,127.5,,,,,,,127.5,82.5,M,,1943,Raw,B
1,Ladislav Pasecký,M_MR_3_WPC,Czechia,88.2,130,140,155,155,,75,85,90,90,,190,210,220,220,,465,90,M,,1959,Raw,SBD
1,Laresce Browne,F_TR_2_WPC,UK,50.2,65,75,81,81,85,47.5,51,-55,51,,92.5,100,105,105,-110,237,52,F,,1997,Raw,SBD
1,Larisa Gvozdeva,F_OR_WPC,Russia,60,,,,,,100,105,-107.5,105,,,,,,,105,60,F,Лариса Гвоздева,1965,Raw,B
1,Larisa Potapovich,F_MR_2_WPC,Russia,47.1,60,65,70,70,,40,42.5,-45,42.5,,80,100,-110,100,,212.5,48,F,Лариса Потапович,1965,Raw,SBD
1,László Kupcsik,M_OR_WPC,Hungary,82.5,,,,,,,,,,,210,230,247.5,247.5,,247.5,82.5,M,,1967,Raw,D
1,László Kupcsik,M_MR_2_WPC,Hungary,82.5,,,,,,,,,,,210,230,247.5,247.5,,247.5,82.5,M,,1967,Raw,D
1,László Mészáros,M_OR_WPC,Hungary,128.4,,,,,,280,290,303,303,,,,,,,303,140,M,,1968,Raw,B
3,Lauris Gabrāns,M_OR_WPC,Latvia,118.8,300,315,325,325,,200,210,,210,,280,295,300,300,,835,125,M,,1984,Raw,SBD
1,Lauris Kalašņikovs,M_TR_1_WPC,Latvia,67,-135,135,161,161,-165,90,95,-101,95,,185,195,-200,195,,451,67.5,M,,1998,Raw,SBD
3,Leah Gitterman,F_OR_WPC,Canada,51.3,92.5,97.5,102.5,102.5,,47.5,52.5,55,55,,127.5,135,-140,135,,292.5,52,F,,1978,Raw,SBD
1,Leo Joseph,M_TR_3_WPC,USA,59.5,-125,125,-140,125,,97.5,102.5,-107.5,102.5,,160,-172.5,-187.5,160,,387.5,60,M,,1994,Raw,SBD
4,Leonid Averbakh,M_MR_3_WPC,Israel,81.3,,,,,,-100,105,-110,105,,,,,,,105,82.5,M,,1959,Raw,B
1,Leslie Watson,F_MR_6_WPC,UK,43.4,45,47.5,50,50,,55,57.5,60,60,,80,85,90,90,,200,44,F,,1948,Raw,SBD
1,Leslie Watson,F_MR_6_WPC,UK,43.6,,,,,,57.5,-60,-60,57.5,,,,,,,57.5,44,F,,1948,Raw,B
1,Libor Bažant,M_MR_2_WPC,Czechia,106.7,,,,,,155,-160,-160,155,,,,,,,155,110,M,,1964,Raw,B
1,Liliana Duarte,F_JEM_WPC,Portugal,70.8,-155,155,-175,155,,55,62.5,-75,62.5,,100,120,145,145,,362.5,75,F,,1991,Multi-ply,SBD
5,Liliya Kuznetsova,F_OR_WPC,Russia,66.7,,,,,,42.5,45,-50,45,,,,,,,45,67.5,F,Лилия Кузнецова,1988,Raw,B
1,Lolita Zankl,F_MR_3_WPC,Germany,65.3,85,92.5,-102.5,92.5,,97.5,102.5,105,105,,120,130,140,140,145,337.5,67.5,F,,1959,Raw,SBD
2,Lolita Zankl,F_OR_WPC,Germany,67.5,,,,,,97.5,105,-107.5,105,,,,,,,105,67.5,F,,1959,Raw,B
1,Lolita Zankl,F_MR_3_WPC,Germany,67.5,,,,,,97.5,102.5,105,105,,,,,,,105,67.5,F,,1959,Raw,B
1,Lolita Zankl,F_MEM_3_WPC,Germany,65.7,,,,,,97.5,102.5,107.5,107.5,,,,,,,107.5,67.5,F,,1959,Multi-ply,B
1,Lothar Pritzl,M_MEM_3_WPC,Germany,89.7,180,210,230,230,,-100,150,160,160,,160,180,190,190,,580,90,M,,1959,Multi-ply,SBD
6,Lucas Gijsberten,M_OR_WPC,Netherlands,77.9,,,,,,160,-170,-170,160,,,,,,,160,82.5,M,,1981,Raw,B
1,Lukáš Čupka,M_TR_2_WPC,Slovakia,78.9,,,,,,110,115,117.5,117.5,,,,,,,117.5,82.5,M,,1995,Raw,B
2,Lukáš Čupka,M_TEM_3_WPC,Slovakia,78.6,,,,,,140,-170,-170,140,,,,,,,140,82.5,M,,1995,Multi-ply,B
3,Lukáš Jiruška,M_OEM_WPC,Czechia,98.6,290,-305,305,305,,210,220,227.5,227.5,,260,-270,-277.5,260,,792.5,100,M,,1983,Multi-ply,SBD
4,Lyubov Maltseva,F_OR_WPC,Russia,65.1,,,,,,85,-90,-97.5,85,,,,,,,85,67.5,F,Любовь Мальцева,1976,Raw,B
1,Maamchuluun Tseveendorj,M_MR_6_WPC,Mongolia,82.1,160,170,,170,,115,,,115,,180,,,180,,465,82.5,M,,1946,Raw,SBD
1,Maamchuluun Tseveendorj,M_MEM_6_WPC,Mongolia,81.7,-220,220,-232.5,220,,130,140,-147.5,140,,180,200,210,210,,570,82.5,M,,1946,Multi-ply,SBD
1,Maamchuluun Tseveendorj,M_MR_6_WPC,Mongolia,81.6,,,,,,115,120,125,125,,,,,,,125,82.5,M,,1946,Raw,B
3,Maciej Stępniak,M_JR_WPC,Poland,108.3,200,210,220,220,,170,180,190,190,,250,275,290,290,,700,110,M,,1991,Raw,SBD
2,Maksim Korepin,M_JR_WPC,Russia,99.8,230,242.5,250,250,-281,170,175,180,180,,240,252.5,-277.5,252.5,,682.5,100,M,Максим Корепин,1991,Raw,SBD
DQ,Marat Abdullin,M_OEM_WPC,Russia,98.5,,,,,,-307.5,-307.5,-307.5,,,,,,,,,100,M,Марат Абдуллин,1985,Multi-ply,B
1,Marco Schwarz,M_MR_1_WPC,Switzerland,76.3,-150,150,-160,150,,100,105,-110,105,,170,180,-190,180,,435,82.5,M,,1971,Raw,SBD
1,Marco Silva,M_OEM_WPC,Portugal,58.2,180,-200,-205,180,,90,-105,105,105,,165,185,-205,185,,470,60,M,,1992,Multi-ply,SBD
3,Marek Brna,M_JR_WPC,Slovakia,97.9,,,,,,170,180,182.5,182.5,,,,,,,182.5,100,M,,1993,Raw,B
1,Marek Herák,M_TR_2_WPC,Slovakia,54.9,,,,,,100,105,107.5,107.5,,,,,,,107.5,56,M,,1995,Raw,B
1,Marek Herák,M_TEM_2_WPC,Slovakia,55.2,,,,,,130,-140,-145,130,,,,,,,130,56,M,,1995,Multi-ply,B
1,Marek Vadkerti,M_TR_3_WPC,Slovakia,57.1,,,,,,85,90,95,95,,,,,,,95,60,M,,1995,Raw,B
1,Maria Lopes,F_MEM_3_WPC,Portugal,64.8,40,-50,55,55,,30,35,40,40,,65,80,-90,80,,175,67.5,F,,1960,Multi-ply,SBD
3,Marian Chrenovský,M_JR_WPC,Slovakia,79.1,140,150,-160,150,,95,-105,-105,95,,185,,-200,185,,430,82.5,M,,1990,Raw,SBD
1,Marianna Gasparyan,F_OR_WPC,Kazakhstan,60,-170,-170,170,170,,80,90,-100,90,,160,170,-180,170,,430,60,F,,1989,Raw,SBD
1,Marianna Óvári,F_MR_1_WPC,Hungary,75.3,,,,,,115,-122.5,-122.5,115,,,,,,,115,82.5,F,,1973,Raw,B
3,Mariks Daugavets,M_MR_1_WPC,Latvia,122.6,,,,,,220,227.5,-232.5,227.5,,,,,,,227.5,125,M,,1971,Raw,B
2,Marina Lemenovskaya,F_OR_WPC,Russia,54.1,100,107.5,112.5,112.5,,85,90,95,95,,130,140,150,150,,357.5,56,F,Марина Леменовская,1985,Raw,SBD
6,Mario Stellmach,M_OR_WPC,Germany,96.7,,,,,,-200,200,-212.5,200,,,,,,,200,100,M,,1979,Raw,B
1,Mariya Grishechkina,F_OR_WPC,Russia,74.2,,,,,,105,115,-120,115,,,,,,,115,75,F,Мария Гришечкина,1983,Raw,B
2,Mariya Kalanina,F_OEM_WPC,Russia,74.9,185,195,205,205,,-105,105,110,110,,190,-202.5,202.5,202.5,,517.5,75,F,Мария Каланина,1982,Multi-ply,SBD
1,Mariya Kalanina,F_OEM_WPC,Russia,74.9,,,,,,,,,,,185,195,205,205,,205,75,F,Мария Каланина,1982,Multi-ply,D
2,Mariya Timoshina,F_OR_WPC,Kazakhstan,58.9,,,,,,85,90,95,95,,,,,,,95,60,F,,1984,Raw,B
5,Mariya Yastrebova,F_OR_WPC,Kazakhstan,63.8,100,115,-122.5,115,,77.5,85,-90,85,,140,155,-177.5,155,,355,67.5,F,,1988,Raw,SBD
3,Mariya Yastrebova,F_OR_WPC,Kazakhstan,64.5,,,,,,80,85,-90,85,,,,,,,85,67.5,F,,1988,Raw,B
1,Mariya Yastrebova,F_OR_WPC,Kazakhstan,63.9,,,,,,,,,,,135,145,162.5,162.5,,162.5,67.5,F,,1988,Raw,D
1,Mark Towers,M_TR_1_WPC,UK,78.6,55,65,75,75,,-55,-60,60,60,,135,145,150.5,150.5,,285.5,82.5,M,,1998,Raw,SBD
2,Kari Markku Kalliola,M_OEM_WPC,Finland,168.2,-425,-425,425,425,,300,310,-320,310,,250,265,-297.5,265,,1000,140+,M,,1963,Multi-ply,SBD
1,Kari Markku Kalliola,M_MEM_3_WPC,Finland,167.2,,,,,,290,-320,-320,290,,,,,,,290,140+,M,,1963,Multi-ply,B
DQ,Markku Niemelä,M_OEM_WPC,Finland,124.9,-380,-380,-380,,,,,,,,,,,,,,125,M,,1984,Multi-ply,SBD
1,Marko Lempinen,M_MEM_2_WPC,Finland,106.6,,,,,,240,-250,-250,240,,,,,,,240,110,M,,1966,Multi-ply,B
1,Marko Traks,M_OEM_WPC,Estonia,159.5,,,,,,-315,315,-325,315,,,,,,,315,140+,M,,1989,Multi-ply,B
3,Martin Beránek,M_JEM_WPC,Slovakia,105.9,-280,280,-295,280,,160,170,-180,170,,250,270,-290,270,,720,110,M,,1993,Multi-ply,SBD
6,Martin Kostlán,M_OR_WPC,Czechia,88.1,180,195,-200,195,,120,-127.5,130,130,,240,-260,-260,240,,565,90,M,,1987,Raw,SBD
3,Martine George,F_OR_WPC,UK,56,70,85,95,95,,45,50,-55,50,,105,115,120,120,,265,56,F,,1983,Raw,SBD
1,Maryana Naumova,F_TR_1_WPC,Russia,72.6,,,,,,100,110,-115,110,,,,,,,110,75,F,Марьяна Наумова,1999,Raw,B
3,Maryana Naumova,F_OR_WPC,Russia,72.6,,,,,,100,110,-115,110,,,,,,,110,75,F,Марьяна Наумова,1999,Raw,B
1,Maryana Naumova,F_TEM_1_WPC,Russia,72.2,,,,,,112.5,120,130,130,135,,,,,,130,75,F,Марьяна Наумова,1999,Multi-ply,B
2,Maryana Naumova,F_OEM_WPC,Russia,72.2,,,,,,112.5,120,130,130,135,,,,,,130,75,F,Марьяна Наумова,1999,Multi-ply,B
10,Matias Suominen Ville,M_OR_WPC,Finland,107.5,210,220,,220,,-160,160,-165,160,,240,265,-280,265,,645,110,M,,1982,Raw,SBD
DQ,Matt Minuth,M_OEM_WPC,USA,99,400,-420,,400,,-370,-370,-370,,,,,,,,,100,M,,1980,Multi-ply,SBD
1,Max Reichert,M_TEM_2_WPC,USA,90.5,267.5,-272.5,-272.5,267.5,,-172.5,182.5,-187.5,182.5,,220,240,-250,240,,690,100,M,,1996,Multi-ply,SBD
1,Max Schröder,M_TEM_3_WPC,Germany,85.7,260,-285,-285,260,,170,-185,185,185,,250,265,272.5,272.5,,717.5,90,M,,1994,Multi-ply,SBD
1,Maxim Piskunov,M_OEM_WPC,Russia,88.4,350,-375,375,375,,240,250,-260,250,,285,300,317.5,317.5,,942.5,90,M,Максим Пискунов,1982,Multi-ply,SBD
3,Merja Mansikkaviita,F_OR_WPC,Finland,58.9,,,,,,87.5,90,93.5,93.5,,,,,,,93.5,60,F,,1962,Raw,B
1,Merja Mansikkaviita,F_MR_3_WPC,Finland,58.9,,,,,,87.5,90,93.5,93.5,94.5,,,,,,93.5,60,F,,1962,Raw,B
DQ,Michael Göck,M_MEM_2_WPC,Germany,100,,,,,,-200,-200,-200,,,,,,,,,100,M,,1968,Multi-ply,B
1,Michael Krause,M_MR_2_WPC,Canada,81.9,,,,,,177.5,185,-193.5,185,,,,,,,185,82.5,M,,1968,Raw,B
1,Michael Schrott,M_MR_1_WPC,Germany,130.2,300,322.5,-330,322.5,,205,215,220,220,,300,317.5,-327.5,317.5,,860,140,M,,1972,Raw,SBD
DQ,Michael Sommer,M_OR_WPC,Germany,130.8,280,,,280,,200,-210,-210,200,,,,,,,,140,M,,1988,Raw,SBD
1,Michaela Schneiderova,F_JR_WPC,Czechia,59.7,80,-90,-92.5,80,,47.5,-52.5,-52.5,47.5,,105,112.5,117.5,117.5,,245,60,F,,1989,Raw,SBD
3,Michal Berezňák,M_MR_2_WPC,Slovakia,98.2,,,,,,120,-135,,120,,,,,,,120,100,M,,1963,Raw,B
1,Michal Líška,M_JEM_WPC,Slovakia,110.3,,,,,,230,250,261,261,270,,,,,,261,125,M,,1993,Multi-ply,B
DQ,Michał Wilk,M_OEM_WPC,Poland,99.4,,,,,,-315,-315,-322.5,,,,,,,,,100,M,,1981,Multi-ply,B
2,Michel Faugue,M_MEM_3_WPC,France,74.5,,,,,,140,-150,150,150,,,,,,,150,75,M,,1959,Multi-ply,B
2,Michel Krzonkalla,M_MR_3_WPC,France,124.7,,,,,,170,180,-187.5,180,,,,,,,180,125,M,,1963,Raw,B
2,Michel Krzonkalla,M_MEM_3_WPC,France,123.2,,,,,,215,225,-230,225,,,,,,,225,125,M,,1963,Multi-ply,B
8,Mickaël Dupire,M_OR_WPC,France,118.1,,,,,,200,-210,-210,200,,,,,,,200,125,M,,1974,Raw,B
5,Mickaël Dupire,M_OEM_WPC,France,117.5,,,,,,-260,260,275,275,,,,,,,275,125,M,,1974,Multi-ply,B
1,Mike Towers,M_MEM_2_WPC,UK,106,270,285,-302.5,285,,-175,175,-180,175,,230,250,265,265,,725,110,M,,1966,Multi-ply,SBD
5,Mikhail Grinko,M_OR_WPC,Russia,111.5,,,,,,,,,,,270,-300,,270,,270,125,M,Михаил Гринько,1978,Raw,D
3,Mikhail Grinko,M_OEM_WPC,Russia,111.5,,,,,,,,,,,270,290,-300,290,,290,125,M,Михаил Гринько,1978,Multi-ply,D
DQ,Mikhail Nikolaev,M_OR_WPC,Russia,122.7,,,,,,-220,-220,-220,,,,,,,,,125,M,Михаил Николаев,1961,Raw,B
1,Mikhail Nikolaev,M_MR_3_WPC,Russia,122.7,,,,,,200,210,215,215,,,,,,,215,125,M,Михаил Николаев,1961,Raw,B
DQ,Mikhail Reutov,M_MEM_1_WPC,Russia,126.7,,,,,,-250,-250,-250,,,,,,,,,140,M,Михаил Реутов,1972,Multi-ply,B
3,Milan Vezmar,M_MR_4_WPC,Serbia,88.6,80,100,110,110,,80,100,110,110,,140,-160,180,180,,400,90,M,,1956,Raw,SBD
3,Milan Vezmar,M_MR_4_WPC,Serbia,88.2,,,,,,115,125,,125,,,,,,,125,90,M,,1956,Raw,B
2,Milan Vezmar,M_MEM_4_WPC,Serbia,89,,,,,,120,152.5,162.5,162.5,,,,,,,162.5,90,M,,1956,Multi-ply,B
1,Milivoj Gavrilov,M_MR_5_WPC,Serbia,97,170,190,,190,,125,130,,130,,150,170,-190,170,,490,100,M,,1953,Raw,SBD
2,Milivoj Gavrilov,M_MR_5_WPC,Serbia,97.7,,,,,,120,127.5,,127.5,,,,,,,127.5,100,M,,1953,Raw,B
1,Miroslav Adamove,M_TR_2_WPC,Slovakia,72.4,,,,,,120,127.5,132.5,132.5,,,,,,,132.5,75,M,,1997,Raw,B
1,Miroslav Adamove,M_TEM_2_WPC,Slovakia,74.8,,,,,,160,170,180,180,-188,,,,,,180,75,M,,1997,Multi-ply,B
2,Miroslav Čaba,M_JEM_WPC,Slovakia,88.4,,,,,,220,232.5,-240,232.5,,,,,,,232.5,90,M,,1993,Multi-ply,B
3,Miroslav Klus,M_OEM_WPC,Czechia,100.3,,,,,,,,,,,230,-245,245,245,,245,110,M,,1984,Multi-ply,D
4,Mojca Virant,F_OR_WPC,Slovakia,58.5,100,105,-110,105,,50,55,60,60,,-120,120,125,125,,290,60,F,,1980,Raw,SBD
2,Mushfig Aliyev,M_OR_WPC,Azerbaijan,66.7,180,-200,,180,,-130,130,-140,130,,180,,,180,,490,67.5,M,,1977,Raw,SBD
1,Nándor Tunkel,M_OR_WPC,Hungary,43.6,,,,,,130,138.5,140,140,,,,,,,140,52,M,,1988,Raw,B
2,Natalya Zorina,F_OR_WPC,Russia,54.6,,,,,,65,-70,-70,65,,,,,,,65,56,F,Наталья Зорина,1970,Raw,B
1,Natalya Zorina,F_MR_1_WPC,Russia,54.6,,,,,,65,-70,-70,65,,,,,,,65,56,F,Наталья Зорина,1970,Raw,B
1,Nelly Herrmann,F_MR_6_WPC,Switzerland,66.7,,,,,,52.5,55,-57.5,55,,,,,,,55,67.5,F,,1944,Raw,B
DQ,Nikhita Kumar,F_OR_WPC,UK,51.3,,,,,,,,,,,-105,-105,-105,,,,52,F,,1989,Raw,D
1,Nikolai Fesaniuk,M_OR_WPC,Russia,107.9,300,330,345,345,,190,-205,-205,190,,-320,320,347.5,347.5,,882.5,110,M,Николай Фесанюк,1984,Raw,SBD
3,Nikolay Altunin,M_OEM_WPC,Russia,73.5,220,230,240,240,,150,160,-170,160,,220,240,-250,240,,640,75,M,Николай Алтунин,1977,Multi-ply,SBD
2,Nikolay Altunin,M_OEM_WPC,Russia,72.9,,,,,,,,,,,200,220,240,240,245,240,75,M,Николай Алтунин,1977,Multi-ply,D
3,Nikolay Alyshev,M_OEM_WPC,Russia,105.2,,,,,,240,260,-270,260,,,,,,,260,110,M,Николай Алышев,1985,Multi-ply,B
3,Nikolay Boykov,M_OR_WPC,Russia,120.1,,,,,,220,225,230,230,,,,,,,230,125,M,Николай Бойков,1969,Raw,B
1,Nikolay Boykov,M_MR_1_WPC,Russia,120.1,,,,,,220,225,230,230,,,,,,,230,125,M,Николай Бойков,1969,Raw,B
1,Nikolay Sokolov #1,M_OES_WPC,Russia,74,290,315,-325,315,,-200,200,-230,200,,260,-285,285,285,,800,75,M,Николай Соколов,1979,Single-ply,SBD
2,Norbert Váczi,M_JR_WPC,Hungary,105.3,,,,,,195,200,202.5,202.5,,,,,,,202.5,110,M,,1990,Raw,B
1,Oleg Bazilevich,M_OR_WPC,Ukraine,96.6,,,,,,225,235,252.5,252.5,-256,,,,,,252.5,100,M,Олег Базилевич,1982,Raw,B
1,Oleg Kholodov,M_MEM_3_WPC,Russia,104.5,200,220,240,240,,165,175,,175,,180,200,,200,,615,110,M,Олег Холодов,1961,Multi-ply,SBD
2,Oleg Korotaev,M_MR_2_WPC,Russia,108.8,170,190,-200,190,,110,120,130,130,,200,220,-240,220,,540,110,M,Олег Коротаев,1965,Raw,SBD
DQ,Oleg Korotaev,M_MR_2_WPC,Russia,109.2,,,,,,,,,,,-200,,,,,,110,M,Олег Коротаев,1965,Raw,D
DQ,Oleg Korotaev,M_MEM_2_WPC,Russia,109.2,,,,,,,,,,,-200,,,,,,110,M,Олег Коротаев,1965,Multi-ply,D
DQ,Oleg Kozyrev,M_OEM_WPC,Russia,215,,,,,,-300,,,,,,,,,,,140+,M,Олег Козырев,1975,Multi-ply,B
2,Oleksiy Slyuschenko,M_OEM_WPC,Ukraine,74.8,,,,,,165,180,200,200,,,,,,,200,75,M,Олексій Слющенко,1984,Multi-ply,B
5,Oleksiy Solovyov,M_OR_WPC,Ukraine,105.6,,,,,,222.5,232.5,-237.5,232.5,,,,,,,232.5,110,M,Олексій Соловйов,1975,Raw,B
3,Olena Koroeva,F_OEM_WPC,Ukraine,59.1,-130,-130,130,130,,65,70,-75,70,,120,127.5,-132.5,127.5,,327.5,60,F,Олена Короєва,1983,Multi-ply,SBD
1,Olexiy Gornyy,M_JEM_WPC,Ukraine,66.4,,,,,,130,140,145,145,,,,,,,145,67.5,M,Олексій Горний,1992,Multi-ply,B
1,Olga Mikhaylova,F_OR_WPC,Russia,51.7,100,107.5,112.5,112.5,,62.5,67.5,-70,67.5,,150,160,165,165,,345,52,F,Ольга Михайлова,1971,Raw,SBD
1,Olga Mikhaylova,F_MR_1_WPC,Russia,51.7,100,107.5,112.5,112.5,,62.5,67.5,-70,67.5,,150,160,165,165,,345,52,F,Ольга Михайлова,1971,Raw,SBD
9,Oliver Hirschmann,M_OR_WPC,Germany,105.2,,,,,,200,-210,-210,200,,,,,,,200,110,M,,1980,Raw,B
3,Ondřej Kiml,M_JR_WPC,Czechia,114,200,210,220,220,,-120,120,140,140,,260,280,-300,280,,640,125,M,,1990,Raw,SBD
1,Ondřej Kiml,M_JR_WPC,Czechia,114,,,,,,,,,,,240,260,,260,,260,125,M,,1990,Raw,D
1,Otgontuya Gongor,F_JR_WPC,Mongolia,66,135,145,152.5,152.5,,82.5,-90,-90,82.5,,150,155,160,160,,395,67.5,F,,1991,Raw,SBD
2,Otgontuya Gongor,F_OR_WPC,Mongolia,66,135,145,152.5,152.5,,82.5,-90,-90,82.5,,150,155,160,160,,395,67.5,F,,1991,Raw,SBD
1,Otgontuya Gongor,F_JEM_WPC,Mongolia,67,-230,-230,230,230,,100,-110,-115,100,,180,195,205,205,,535,67.5,F,,1991,Multi-ply,SBD
1,Otgontuya Gongor,F_OEM_WPC,Mongolia,67,-230,-230,230,230,,100,-110,-115,100,,180,195,205,205,,535,67.5,F,,1991,Multi-ply,SBD
1,Otgontuya Gongor,F_JEM_WPC,Mongolia,66,,,,,,,,,,,190,200,,200,,200,67.5,F,,1991,Multi-ply,D
3,Pascal Costa,M_MR_2_WPC,France,74.6,,,,,,120,125,-127.5,125,,,,,,,125,75,M,,1967,Raw,B
1,Pascal Costa,M_MEM_2_WPC,France,75,,,,,,150,160,-170,160,,,,,,,160,75,M,,1967,Multi-ply,B
1,Pascal LeBlanc,M_MR_3_WPC,France,95.8,,,,,,135,-140,140,140,,,,,,,140,100,M,,1963,Raw,B
1,Patrik Navara,M_JEM_WPC,Czechia,114.4,-340,340,-355,340,,240,255,-262.5,255,,280,-300,-310,280,,875,125,M,,1991,Multi-ply,SBD
5,Patryk Szypuła,M_OR_WPC,Poland,89,,,,,,200,205,-210,205,,,,,,,205,90,M,,1979,Raw,B
DQ,Paul Fury,M_OR_WPC,Canada,136.5,,,,,,-230,-230,,,,,,,,,,140,M,,1976,Raw,B
1,Paul Fury,M_OR_WPC,Canada,134.9,,,,,,,,,,,200,250,275,275,-300,275,140,M,,1976,Raw,D
1,Paul George,M_MR_3_WPC,UK,81,195,210,235,235,,135,137.5,140,140,,245,272.5,,272.5,,647.5,82.5,M,,1962,Raw,SBD
8,Darren Hammond,M_OR_WPC,UK,104.5,-220,230,-240,230,,130,140,-150,140,,300,-312.5,-312.5,300,,670,110,M,,1972,Raw,SBD
1,Paul Radelat,M_MR_9_WPC,USA,78.5,,,,,,-72.5,78.5,-86,78.5,,,,,,,78.5,82.5,M,,1933,Raw,B
5,Paulo Santos #1,M_OEM_WPC,Portugal,95.7,280,-300,-300,280,,180,200,-210,200,,270,290,-300,290,,770,100,M,,1988,Multi-ply,SBD
1,Pavel Balážik,M_OR_WPC,Slovakia,52,95,102.5,110,110,115,82.5,87.5,91,91,,-140,140,150.5,150.5,160,351.5,52,M,,1979,Raw,SBD
7,Pavel Redkin,M_OR_WPC,Russia,109,,,,,,215,-225,-225,215,,,,,,,215,110,M,Павел Редькин,1985,Raw,B
DQ,Pavel Tilis,M_OR_WPC,Israel,74.6,-190,-190,-190,,,,,,,,,,,,,,75,M,,1978,Raw,SBD
7,Pavlo Kutsyy,M_OR_WPC,Ukraine,114.1,,,,,,-200,-200,200,200,,,,,,,200,125,M,Павло Куций,1974,Raw,B
2,Pedro Claro,M_MR_2_WPC,Portugal,74.3,,,,,,120,125,127.5,127.5,,,,,,,127.5,75,M,,1965,Raw,B
3,Pedro Madureira,M_MEM_1_WPC,Portugal,99.5,240,-270,270,270,,130,-140,-140,130,,210,-230,230,230,,630,100,M,,1969,Multi-ply,SBD
5,Pedro Vareiro,M_JEM_WPC,Portugal,87.8,240,-260,260,260,,130,142.5,-150,142.5,,200,215,230,230,,632.5,90,M,,1992,Multi-ply,SBD
DQ,Pekka Korhonen,M_MEM_6_WPC,Finland,102.8,,,,,,-140,-145,-145,,,,,,,,,110,M,,1944,Multi-ply,B
2,Peter Herák,M_MR_3_WPC,Slovakia,82,170,185,190,190,,105,-112.5,-112.5,105,,200,210,-215,210,,505,82.5,M,,1960,Raw,SBD
2,Peter Hermann,M_MR_7_WPC,Switzerland,81.1,,,,,,105,110,-115,110,,,,,,,110,82.5,M,,1942,Raw,B
1,Peter Hermann,M_MEM_7_WPC,Switzerland,81.6,,,,,,120,125,-130,125,,,,,,,125,82.5,M,,1942,Multi-ply,B
DQ,Péter Juhász,M_JR_WPC,Hungary,119.9,210,230,240,240,,180,-187.5,,180,,,,,,,,125,M,,1993,Raw,SBD
6,Péter Kerecsényi,M_OR_WPC,Hungary,116.3,,,,,,202.5,210,-217.5,210,,,,,,,210,125,M,,1979,Raw,B
1,Péter Mihály,M_MEM_4_WPC,Slovakia,150.8,,,,,,-230,280,305,305,,,,,,,305,140+,M,,1958,Multi-ply,B
1,Péter Szabó,M_MR_2_WPC,Slovakia,125.8,,,,,,160,167.5,-170,167.5,,,,,,,167.5,140,M,,1964,Raw,B
2,Petr Bolf,M_OEM_WPC,Czechia,109.4,,,,,,300,-310,-310,300,,,,,,,300,110,M,,1987,Multi-ply,B
4,Petr Folprecht,M_OR_WPC,Czechia,106.3,270,285,-290,285,,155,-165,165,165,,310,-327.5,327.5,327.5,,777.5,110,M,,1985,Raw,SBD
3,Petr Folprecht,M_OR_WPC,Czechia,106.3,,,,,,,,,,,290,300,310,310,,310,110,M,,1985,Raw,D
5,Petr Krastenics,M_OR_WPC,Czechia,88.3,180,200,210,210,,120,130,-137.5,130,,240,-260,260,260,,600,90,M,,1989,Raw,SBD
8,Petr Maceášik,M_OR_WPC,Czechia,99.8,,,,,,200,-210,-210,200,,,,,,,200,100,M,,1976,Raw,B
3,Petr Maceášik,M_OR_WPC,Czechia,99.8,,,,,,,,,,,280,-300,300,300,,300,100,M,,1976,Raw,D
4,Petr Maceášik,M_OEM_WPC,Czechia,99.8,,,,,,,,,,,250,280,-300,280,,280,100,M,,1976,Multi-ply,D
DQ,Petr Myšák,M_OEM_WPC,Czechia,99.6,-280,-280,-280,,,,,,,,,,,,,,100,M,,1981,Multi-ply,SBD
3,Petri Billy Haavisto,M_MR_2_WPC,Finland,120.1,,,,,,175,190,200,200,,,,,,,200,125,M,,1965,Raw,B
DQ,Petteri Hosio Henrik,M_OEM_WPC,Finland,117.1,-360,-360,-360,,,,,,,,,,,,,,125,M,,1979,Multi-ply,SBD
2,Petteri Hosio Henrik,M_OEM_WPC,Finland,114,,,,,,320,-330,-337.5,320,,,,,,,320,125,M,,1979,Multi-ply,B
1,Philippe Herzog,M_OR_WPC,Switzerland,65.7,,,,,,145,150,155,155,,,,,,,155,67.5,M,,1961,Raw,B
1,Philippe Herzog,M_MR_3_WPC,Switzerland,65.7,,,,,,145,150,155,155,,,,,,,155,67.5,M,,1961,Raw,B
3,Philippe Jarnetin,M_MR_1_WPC,France,98.6,,,,,,165,172.5,175,175,,,,,,,175,100,M,,1972,Raw,B
4,Pieter Flamme,M_OEM_WPC,France,88.4,,,,,,200,210,220,220,,,,,,,220,90,M,,1984,Multi-ply,B
1,Precious Collins,F_JR_WPC,UK,82.3,125,135,-142.5,135,,65,70,72.5,72.5,,140,150,155,155,,362.5,82.5,F,,1991,Raw,SBD
2,Rade Savić,M_OR_WPC,Serbia,150.5,,,,,,280,-285,-285,280,,,,,,,280,140+,M,,1984,Raw,B
8,Rami Leiviskä,M_OR_WPC,Finland,88.4,,,,,,190,-200,-200,190,,,,,,,190,90,M,,1978,Raw,B
5,Ramil Ahmadov,M_OEM_WPC,Azerbaijan,81.9,290,305,315,315,,180,-192.5,-192.5,180,,275,-287.5,-287.5,275,,770,82.5,M,,1988,Multi-ply,SBD
1,Reinis Kindzulis,M_JR_WPC,Latvia,103.2,,,,,,220,234.5,,234.5,,,,,,,234.5,110,M,,1992,Raw,B
1,Reza Golmohammadi,M_OEM_WPC,Finland,98.4,,,,,,-315,315,-325,315,,,,,,,315,100,M,,1975,Multi-ply,B
1,Reza Zare Bahram Abadi,M_MR_1_WPC,Iran,88.9,240,-265,-265,240,,160,175,-182.5,175,,260,290,-307.5,290,,705,90,M,,1972,Raw,SBD
2,Reza Zare Bahram Abadi,M_MEM_1_WPC,Iran,89.4,320,-340,340,340,,190,200,-220,200,,280,300,-335,300,,840,90,M,,1972,Multi-ply,SBD
1,Reza Zare Bahram Abadi,M_MR_1_WPC,Iran,91.5,,,,,,,,,,,230,270,-300,270,,270,100,M,,1972,Raw,D
1,Rhys Browning,M_JR_WPC,UK,104.4,,,,,,,,,,,280,295,-310,295,,295,110,M,,1990,Raw,D
1,Rhys Browning,M_JEM_WPC,UK,104.4,,,,,,,,,,,315,-325.5,,315,,315,110,M,,1990,Multi-ply,D
DQ,Richard Ligier,M_OEM_WPC,France,148.3,,,,,,-440,-480,-500,,,,,,,,,140+,M,,1974,Multi-ply,B
1,Richard Novotný,M_JR_WPC,Czechia,88.8,,,,,,,,,,,240,265,-272.5,265,,265,90,M,,1993,Raw,D
3,Richard Riso,M_MEM_1_WPC,France,104.4,,,,,,-190,-190,190,190,,,,,,,190,110,M,,1970,Multi-ply,B
1,Dick Zenzen,M_MEM_5_WPC,USA,109.1,262.5,-285,292.5,292.5,,165,-175,-182.5,165,,185,205,215,215,,672.5,110,M,,1952,Multi-ply,SBD
1,Tomass Rihards Chiapas,M_TEM_1_WPC,Latvia,79.1,150,160,170,170,,65,90,,90,,140,150,-155,150,,410,82.5,M,,2000,Multi-ply,SBD
1,Tomass Rihards Chiapas,M_TEM_1_WPC,Latvia,79.9,,,,,,,,,,,140,150,-160,150,,150,82.5,M,,2000,Multi-ply,D
3,Rikard Erlandsson,M_OR_WPC,Sweden,153.9,,,,,,230,-240,240,240,,,,,,,240,140+,M,,1977,Raw,B
2,Rob Bragg,M_JR_WPC,UK,82,165,-185,200,200,,120,130,135,135,,215,235,252.5,252.5,,587.5,82.5,M,,1991,Raw,SBD
1,Robin Pacholder,F_MR_2_WPC,USA,51.6,87.5,95,-97.5,95,,57.5,60.5,62.5,62.5,-65,110,125,137.5,137.5,140,295,52,F,,1967,Raw,SBD
1,Rocky Tilson,M_MEM_3_WPC,USA,116.2,185,-257.5,-257.5,185,,127.5,140,-185,140,,185,-230,,185,,510,125,M,,1963,Multi-ply,SBD
4,Roman Chuťka,M_JEM_WPC,Czechia,86.4,230,245,260,260,,120,135,-150,135,,225,245,255,255,,650,90,M,,1993,Multi-ply,SBD
2,Roman Grigar,M_JR_WPC,Czechia,87.5,140,155,175,175,,110,120,-130,120,,200,220,-235,220,,515,90,M,,1993,Raw,SBD
1,Roman Mandík,M_MR_2_WPC,Czechia,74.3,132.5,140,145,145,,102.5,-107.5,107.5,107.5,,175,185,-195,185,,437.5,75,M,,1968,Raw,SBD
1,Roman Pelykh,M_OEM_WPC,Ukraine,74.6,,,,,,220,-235,-235,220,,,,,,,220,75,M,Роман Пелих,1985,Multi-ply,B
2,Rostyslav Borovskyy,M_OR_WPC,Ukraine,60,,,,,,105,110,-115,110,,,,,,,110,60,M,Ростислав Боровський,1986,Raw,B
1,Roza Ovechkina,F_OEM_WPC,Russia,55.7,140,150,-160,150,,75,80,-85,80,,140,150,155,155,,385,56,F,Роза Овечкина,1980,Multi-ply,SBD
1,Rufat Agaev,M_OEM_WPC,Azerbaijan,123.3,460,480,500,500,,270,285,-300,285,,350,365,,365,,1150,125,M,,1975,Multi-ply,SBD
2,Rui Carreira,M_TR_3_WPC,Portugal,81.9,,,,,,160,-172.5,-177.5,160,,,,,,,160,82.5,M,,1994,Raw,B
1,Rui Faria,M_MR_5_WPC,Portugal,80.5,-170,-170,170,170,,95,-105,-105,95,,160,170,,170,,435,82.5,M,,1951,Raw,SBD
1,Rui Faria,M_MR_5_WPC,Portugal,80.8,,,,,,95,-105,105,105,,,,,,,105,82.5,M,,1951,Raw,B
1,Rui Faria,M_MR_5_WPC,Portugal,80.5,,,,,,,,,,,160,180.5,-185,180.5,,180.5,82.5,M,,1951,Raw,D
3,Ruslan Kulebyakin,M_JR_WPC,Russia,106.3,,,,,,160,170,175,175,,,,,,,175,110,M,Руслан Кулебякин,1991,Raw,B
2,Ruslan Kulebyakin,M_JR_WPC,Russia,105.8,,,,,,,,,,,240,250,260,260,,260,110,M,Руслан Кулебякин,1991,Raw,D
7,Saifolla Tilyeubyerd,M_OR_WPC,Mongolia,109.1,250,-260,-260,250,,190,-200,-202.5,190,,270,,,270,,710,110,M,,1987,Raw,SBD
4,Saifolla Tilyeubyerd,M_OEM_WPC,Mongolia,108.3,350,365,-375,365,,240,-250,-250,240,,265,-275,275,275,,880,110,M,,1987,Multi-ply,SBD
DQ,Saifolla Tilyeubyerd,M_OEM_WPC,Mongolia,112,,,,,,,,,,,-275,-275,-292.5,,,,125,M,,1987,Multi-ply,D
1,Samir Mamadov,M_OR_WPC,Azerbaijan,74.4,,,,,,175,185,-187.5,185,,,,,,,185,75,M,,1981,Raw,B
3,Samir Salimkhanov,M_OEM_WPC,Azerbaijan,108.2,-332.5,-332.5,332.5,332.5,,212.5,222.5,230,230,,-290,290,317.5,317.5,,880,110,M,,1988,Multi-ply,SBD
4,Sandrine Chabert,F_OR_WPC,France,74.2,,,,,,85,90,-95,90,,,,,,,90,75,F,,1974,Raw,B
3,Sandrine Chabert,F_OEM_WPC,France,73.5,,,,,,125,-130,-132.5,125,,,,,,,125,75,F,,1974,Multi-ply,B
4,Sara Abbasova,F_OR_WPC,Azerbaijan,65.9,120,-132.5,-132.5,120,,70,-75,-75,70,,130,140,,140,,330,67.5,F,,1983,Raw,SBD
3,Sara Abbasova,F_OR_WPC,Azerbaijan,65.9,,,,,,,,,,,120,130,-140,130,,130,67.5,F,,1983,Raw,D
1,Sarah Edgar King,F_OR_WPC,UK,63,145,152.5,-157.5,152.5,,80,92.5,-100,92.5,,165,180,-187.5,180,,425,67.5,F,,1977,Raw,SBD
DQ,Sarah Edgar King,F_OR_WPC,UK,63,,,,,,,,,,,-165,,,,,,67.5,F,,1977,Raw,D
2,Scott Halliday,M_OR_WPC,UK,99.7,-245,245,255,255,,180,190,200,200,,280,300,-307.5,300,,755,100,M,,1977,Raw,SBD
DQ,Scott Kuderick,M_OEM_WPC,USA,89.7,-322.5,-322.5,-322.5,,,,,,,,,,,,,,90,M,,1974,Multi-ply,SBD
1,Sebastian Schindecker,M_TR_2_WPC,Germany,96.4,170,-185,185,185,,125,130,135,135,,220,230,240,240,-250,560,100,M,,1996,Raw,SBD
1,Sebastian Schindecker,M_TR_2_WPC,Germany,95,,,,,,-130,130,-140,130,,,,,,,130,100,M,,1996,Raw,B
1,Sebastian Schindecker,M_TR_2_WPC,Germany,98.6,,,,,,,,,,,210,220,,220,,220,100,M,,1996,Raw,D
4,Sébastien Hupfer,M_OR_WPC,France,89.3,230,250,-255,250,,150,160,-170,160,,240,250,260,260,,670,90,M,,1981,Raw,SBD
1,Sergei Lukyanov,M_OR_WPC,Russia,90,255,265,275,275,,175,-180,,175,,300,-317.5,-317.5,300,,750,90,M,Сергей Лукьянов,1986,Raw,SBD
2,Sergey Rubtsov,M_OR_WPC,Kazakhstan,172,270,280,290,290,,180,190,-200,190,,280,300,340,340,,820,140+,M,,1964,Raw,SBD
1,Sergey Rubtsov,M_MR_2_WPC,Kazakhstan,172.3,240,,,240,,170,180,,180,,260,,,260,,680,140+,M,,1964,Raw,SBD
5,Sergey Rubtsov,M_OR_WPC,Kazakhstan,170.5,,,,,,175,,,175,,,,,,,175,140+,M,,1964,Raw,B
1,Sergey Rubtsov,M_MR_2_WPC,Kazakhstan,170.5,,,,,,175,,,175,,,,,,,175,140+,M,,1964,Raw,B
1,Sergey Rubtsov,M_MR_2_WPC,Kazakhstan,172,,,,,,,,,,,175,,,175,,175,140+,M,,1964,Raw,D
DQ,Sergei Rudikov,M_OR_WPC,Israel,115,,,,,,-210,-210,,,,,,,,,,125,M,,1973,Raw,B
5,Sergei Rudikov,M_MR_1_WPC,Israel,115,,,,,,195,205,-212.5,205,,,,,,,205,125,M,,1973,Raw,B
1,Sergei Tymchenko,M_OR_WPC,Kazakhstan,151.3,,,,,,,,,,,250,-270,-270,250,,250,140+,M,,1970,Raw,D
1,Sergei Tymchenko,M_MR_1_WPC,Kazakhstan,151.3,,,,,,,,,,,250,-270,-270,250,,250,140+,M,,1970,Raw,D
2,Sergejs Mahsumovs,M_MR_1_WPC,Latvia,90,,,,,,160,-170,170,170,,,,,,,170,90,M,,1970,Raw,B
2,Sergejs Vinogradovs,M_MR_2_WPC,Latvia,95.8,,,,,,145,150,155,155,,,,,,,155,100,M,,1965,Raw,B
3,Sergejs Vinogradovs,M_MEM_2_WPC,Latvia,96.5,,,,,,185,-190,-190,185,,,,,,,185,100,M,,1965,Multi-ply,B
5,Sergey Didovyk,M_OR_WPC,Ukraine,98.3,,,,,,210,-215,,210,,,,,,,210,100,M,Сергій Дідовик,1978,Raw,B
DQ,Sergey Didovyk,M_OEM_WPC,Ukraine,99.3,,,,,,-300,-300,-300,,,,,,,,,100,M,Сергій Дідовик,1978,Multi-ply,B
1,Sergey Emelyanov,M_MEM_1_WPC,Russia,79.3,225,230,-235,230,,150,160,165,165,,210,220,-230,220,,615,82.5,M,Сергей Емельянов,1971,Multi-ply,SBD
4,Sergey Kakichev,M_OEM_WPC,Russia,109.2,,,,,,260,-280,-280,260,,,,,,,260,110,M,Сергей Какичев,1980,Multi-ply,B
1,Sergey Koshkin,M_MR_1_WPC,Russia,81.6,,,,,,218.5,222.5,-227.5,222.5,,,,,,,222.5,82.5,M,Сергей Кошкин,1971,Raw,B
3,Sergey Kultashov,M_OR_WPC,Russia,87.2,,,,,,200,-210,210,210,,,,,,,210,90,M,Сергей Култашов,1979,Raw,B
2,Sergey Mavrenkov,M_MEM_2_WPC,Russia,103,260,-270,-270,260,,-210,-210,210,210,,230,-250,252.5,252.5,,722.5,110,M,Сергей Мавренков,1966,Multi-ply,SBD
2,Sergey Mavrenkov,M_MEM_2_WPC,Russia,103,,,,,,210,-222.5,-240,210,,,,,,,210,110,M,Сергей Мавренков,1966,Multi-ply,B
2,Sergey Samoylenko,M_MR_1_WPC,Russia,109.3,120,-140,140,140,,150,-160,-160,150,,150,180,,180,,470,110,M,Сергей Самойленко,1969,Raw,SBD
2,Sergey Starodubskiy,M_OEM_WPC,Russia,110,350,-370,,350,,250,-270,270,270,,260,285,,285,,905,110,M,Сергей Стародубский,1977,Multi-ply,SBD
4,Sergey Starodubskiy,M_OEM_WPC,Russia,113.2,,,,,,,,,,,290,-315,-315,290,,290,125,M,Сергей Стародубский,1977,Multi-ply,D
3,Sergey Vinnichenko,M_OEM_WPC,Russia,90,,,,,,-230,230,-242.5,230,,,,,,,230,90,M,Сергей Винниченко,1974,Multi-ply,B
5,Sergiy Burik,M_OEM_WPC,Ukraine,98.4,,,,,,220,-232.5,-232.5,220,,,,,,,220,100,M,Сергій Бурик,1976,Multi-ply,B
2,Sergiy Ivanov,M_JEM_WPC,Ukraine,103.8,,,,,,300,-320,-332.5,300,,,,,,,300,110,M,Сергій Іванов,1990,Multi-ply,B
4,Sergiy Polutin,M_OR_WPC,Ukraine,104.2,,,,,,-225,232.5,-237.5,232.5,,,,,,,232.5,110,M,Сергій Полутін,1975,Raw,B
DQ,Sergiy Polutin,M_OEM_WPC,Ukraine,104.6,,,,,,-300,-300,,,,,,,,,,110,M,Сергій Полутін,1975,Multi-ply,B
1,Sergiy Sokolovskyy,M_OEM_WPC,Ukraine,88.5,,,,,,,,,,,280,300,-320,300,,300,90,M,Сергій Соколовський,1976,Multi-ply,D
2,Shinebayar Rentsentsedev,M_JEM_WPC,Mongolia,89.7,270,290,-300,290,,220,-230,,220,,230,,,230,,740,90,M,,1992,Multi-ply,SBD
1,Shinebayar Rentsentsedev,M_JR_WPC,Mongolia,89.4,,,,,,150,162.5,-175,162.5,,,,,,,162.5,90,M,,1992,Raw,B
3,Shinebayar Rentsentsedev,M_JEM_WPC,Mongolia,89.4,,,,,,230,-240,-240,230,,,,,,,230,90,M,,1992,Multi-ply,B
DQ,Simon Norcup,M_OR_WPC,UK,109.3,270,290,-300,290,,190,200,205,205,,-300,,,,,,110,M,,1968,Raw,SBD
2,Stacey Jensen,F_JEM_WPC,Canada,64.4,170.5,-185,-185,170.5,,109,-115,115,115,,175,-185,-185,175,,460.5,67.5,F,,1990,Multi-ply,SBD
1,Stanislav Kolachev,M_OR_WPC,Russia,117.9,,,,,,-245,245,-250,245,,,,,,,245,125,M,Станислав Колачев,1987,Raw,B
1,Stanislav Marochko,M_OR_WPC,Ukraine,67.1,,,,,,130,137.5,-142.5,137.5,,,,,,,137.5,67.5,M,Станіслав Марочко,1981,Raw,B
2,Stanislav Marochko,M_OEM_WPC,Ukraine,67.1,,,,,,155,-165,165,165,,,,,,,165,67.5,M,Станіслав Марочко,1981,Multi-ply,B
2,Stanislav Mordvinov,M_OR_WPC,Russia,121.6,-310,310,-325,310,,-215,-215,215,215,,310,320,-327.5,320,,845,125,M,Станислав Мордвинов,1983,Raw,SBD
2,Stanislav Pryakhin,M_OEM_WPC,Russia,81.6,315,325,-335,325,,-210,215,-220,215,,270,280,-295,280,,820,82.5,M,Станислав Пряхин,1975,Multi-ply,SBD
3,Steffen Hackbart,M_OR_WPC,Germany,74.6,205,-212.5,215,215,,155,160,-162.5,160,,205,215,-225,215,,590,75,M,,1984,Raw,SBD
2,Sten Haugas,M_JR_WPC,Estonia,125,,,,,,180,-190,-200,180,,,,,,,180,125,M,,1990,Raw,B
1,Sten Haugas,M_JEM_WPC,Estonia,126.1,,,,,,230,240,-250,240,,,,,,,240,140,M,,1990,Multi-ply,B
DQ,Stéphane Gurini,M_MEM_2_WPC,France,98.5,,,,,,-210,-210,-210,,,,,,,,,100,M,,1965,Multi-ply,B
1,Steve Creedon,M_MR_2_WPC,USA,88,160,-175,-180,160,,107.5,115,-125,115,,165,175,-185,175,,450,90,M,,1964,Raw,SBD
4,Steve Macneil,M_OEM_WPC,UK,121.5,330,360,-380,360,,260,-280,-280,260,,-270,270,-295,270,,890,125,M,,1984,Multi-ply,SBD
1,Stoyan Andreev,M_OR_WPC,Bulgaria,109.7,,,,,,,,,,,340,365.5,-380,365.5,,365.5,110,M,,1978,Raw,D
4,Suzanne Prusnek,F_OR_WPC,USA,68.5,-137.5,-140,140,140,,75,80,-82.5,80,,182.5,187.5,190,190,-190.5,410,75,F,,1956,Raw,SBD
1,Suzanne Prusnek,F_MR_4_WPC,USA,68.5,-137.5,-140,140,140,,75,80,-82.5,80,,182.5,187.5,190,190,-190.5,410,75,F,,1956,Raw,SBD
1,Svetlana Kivorkova,F_MR_2_WPC,Russia,55.6,,,,,,40,45,-55,45,,,,,,,45,56,F,Светлана Киворкова,1967,Raw,B
1,Svetlana Sinacheva,F_MR_2_WPC,Russia,73.4,,,,,,102.5,107.5,-110,107.5,,,,,,,107.5,75,F,Светлана Синачева,1966,Raw,B
2,Svetlana Veselova,F_OEM_WPC,Russia,60,110,130,140,140,,70,80,85,85,,110,125,132.5,132.5,,357.5,60,F,Светлана Веселова,1987,Multi-ply,SBD
1,Svitlana Klochkova,F_MR_1_WPC,Ukraine,50.9,,,,,,-37.5,-37.5,37.5,37.5,,,,,,,37.5,52,F,Світлана Клочкова,1968,Raw,B
2,Szilvia Kaiser,F_OR_WPC,Hungary,51.9,,,,,,47.5,-52.5,52.5,52.5,,,,,,,52.5,52,F,,1982,Raw,B
2,Tamás Molnár,M_OR_WPC,Hungary,98.9,,,,,,,,,,,300,315,-325.5,315,,315,100,M,,1975,Raw,D
1,Tamás Molnár,M_OEM_WPC,Hungary,98.9,,,,,,,,,,,-287.5,312.5,-320,312.5,,312.5,100,M,,1975,Multi-ply,D
3,Tania George,F_OR_WPC,UK,73.9,120,132.5,145,145,,100,105,110,110,,180,192.5,200,200,,455,75,F,,1970,Raw,SBD
1,Tania George,F_MR_1_WPC,UK,73.9,120,132.5,145,145,,100,105,110,110,,180,192.5,200,200,,455,75,F,,1970,Raw,SBD
1,Tánia Salgueiro,F_JEM_WPC,Portugal,55,140,-160,-160,140,,75,-85,95,95,,115,125,-140,125,,360,56,F,,1990,Multi-ply,SBD
1,Tánia Salgueiro,F_JEM_WPC,Portugal,55.4,,,,,,75,85,-92.5,85,,,,,,,85,56,F,,1990,Multi-ply,B
1,Tapio Laine,M_MEM_5_WPC,Finland,132.1,,,,,,250,260,-270,260,,,,,,,260,140,M,,1952,Multi-ply,B
1,Tatyana Merezhko,F_OR_WPC,Russia,80.8,195,207.5,-215,207.5,,102.5,-110,110,110,,210,225,-232.5,225,,542.5,82.5,F,Татьяна Мережко,1978,Raw,SBD
2,Thomas Wagner,M_MR_4_WPC,Germany,80.7,,,,,,107.5,112.5,-115,112.5,,,,,,,112.5,82.5,M,,1956,Raw,B
1,Thomas Wagner,M_MEM_4_WPC,Germany,81.5,,,,,,112.5,117.5,120,120,,,,,,,120,82.5,M,,1956,Multi-ply,B
2,Tilo Kupper,M_MR_2_WPC,Switzerland,87.6,,,,,,155,162.5,-165,162.5,,,,,,,162.5,90,M,,1964,Raw,B
3,Tim Walsh,M_MR_3_WPC,USA,81.4,130,-140,145,145,,77.5,85,90,90,,165,185,-192.5,185,,420,82.5,M,,1963,Raw,SBD
2,Tímea Szuromi,F_OR_WPC,Hungary,83.3,135,150,-160,150,,95,102.5,105,105,,160,165,175,175,,430,90,F,,1983,Raw,SBD
2,Timo Juhani Majuri,M_MR_2_WPC,Estonia,120,,,,,,200,210,220,220,231,,,,,,220,125,M,,1967,Raw,B
1,Timo Juhani Majuri,M_MEM_2_WPC,Estonia,121.1,,,,,,310,325.5,330,330,,,,,,,330,125,M,,1967,Multi-ply,B
1,Tom Sparks,M_JR_WPC,UK,86.5,190,200,220,220,,130,140,-145,140,,260,280,-300,280,,640,90,M,,1990,Raw,SBD
2,Tomáš Kalenský,M_JR_WPC,Czechia,89.3,,,,,,132.5,140,-147.5,140,,,,,,,140,90,M,,1993,Raw,B
1,Tomáš Kalenský,M_JEM_WPC,Czechia,91,,,,,,182.5,192.5,200,200,,,,,,,200,100,M,,1993,Multi-ply,B
1,Tony Chard,M_MEM_2_WPC,France,120.8,255,-282.5,-292.5,255,,195,-200,-200,195,,260,305,,305,,755,125,M,,1968,Multi-ply,SBD
1,Tracy Campbell,F_OR_WPC,USA,75,152.5,162.5,172.5,172.5,,112.5,117.5,122.5,122.5,-128,165,175,185,185,,480,75,F,,1975,Raw,SBD
1,Tsegmed Byambaa,M_MR_7_WPC,Mongolia,74.3,160,-180.5,-180.5,160,,80,85,87.5,87.5,,175,-185.5,-185.5,175,,422.5,75,M,,1940,Raw,SBD
1,Tsegmed Byambaa,M_MEM_7_WPC,Mongolia,75,200,210,215,215,,90,97.5,,97.5,,167.5,180,-185,180,,492.5,75,M,,1940,Multi-ply,SBD
2,Tsegmed Byambaa,M_MR_7_WPC,Mongolia,75,,,,,,-82.5,82.5,-92.5,82.5,,,,,,,82.5,75,M,,1940,Raw,B
1,Tsegmed Byambaa,M_MEM_7_WPC,Mongolia,74.7,,,,,,85,100,,100,,,,,,,100,75,M,,1940,Multi-ply,B
9,Tsogzoldorzh Dondog,M_OR_WPC,Mongolia,106.1,245,-255,260,260,,150,160,-165,160,,230,,,230,,650,110,M,,1974,Raw,SBD
7,Tsogzoldorzh Dondog,M_OEM_WPC,Mongolia,107,300,315,330,330,,162.5,170,,170,,270,,,270,,770,110,M,,1974,Multi-ply,SBD
2,Tsogzoldorzh Dondog,M_OEM_WPC,Mongolia,106.7,,,,,,,,,,,280,295,-305,295,,295,110,M,,1974,Multi-ply,D
1,Tünde Stér,F_MR_1_WPC,Hungary,60,105,115,125,125,,-75,80,85,85,,140,150,160,160,,370,60,F,,1971,Raw,SBD
3,Tuomas Mononen,M_JR_WPC,Finland,81.6,,,,,,155,162.5,-170,162.5,,,,,,,162.5,82.5,M,,1990,Raw,B
1,Ulfert Rinas,M_MEM_3_WPC,Germany,97.6,,,,,,185,190,,190,,,,,,,190,100,M,,1959,Multi-ply,B
2,Ulrich Mielich,M_MR_7_WPC,Germany,74.2,70,-80,80,80,,57.5,-62.5,62.5,62.5,,-110,-115,115,115,,257.5,75,M,,1939,Raw,SBD
1,Ursula Eulenstein,F_MR_5_WPC,Germany,73.4,,,,,,97.5,102.5,105,105,,,,,,,105,75,F,,1949,Raw,B
1,Václav Mareš,M_MR_2_WPC,Czechia,109.3,170,-200,210,210,,150,160,170,170,,230,250,265,265,,645,110,M,,1968,Raw,SBD
1,Václav Mareš,M_MR_2_WPC,Czechia,109.3,,,,,,,,,,,240,260,,260,,260,110,M,,1968,Raw,D
1,Václav Mareš,M_MEM_2_WPC,Czechia,109.3,,,,,,,,,,,-250,260,-280,260,,260,110,M,,1968,Multi-ply,D
2,Vaclav Papirnik,M_MR_5_WPC,Czechia,104.2,,,,,,110,-120,120,120,,,,,,,120,110,M,,1949,Raw,B
6,Vadim Evtushenko,M_OEM_WPC,Russia,114.6,,,,,,260,-270,-270,260,,,,,,,260,125,M,Вадим Евтушенко,1974,Multi-ply,B
1,Vadim Zaytsev,M_MR_3_WPC,Russia,94.1,,,,,,,,,,,240,250,,250,,250,100,M,Вадим Зайцев,1960,Raw,D
1,Vadim Zaytsev,M_MEM_3_WPC,Russia,94.1,,,,,,,,,,,240,-250,,240,,240,100,M,Вадим Зайцев,1960,Multi-ply,D
2,Vadims Grabars,M_MR_5_WPC,Latvia,83,150,170,177.5,177.5,,85,92.5,97.5,97.5,,220,235,247.5,247.5,,522.5,90,M,,1951,Raw,SBD
1,Vadims Grabars,M_MEM_5_WPC,Latvia,82.2,190,210,-230,210,,115,125,-135,125,,210,230,250,250,,585,82.5,M,,1951,Multi-ply,SBD
1,Vadims Grabars,M_MR_5_WPC,Latvia,83,,,,,,,,,,,220,250,255,255,,255,90,M,,1951,Raw,D
4,Vadym Katunin,M_OR_WPC,Israel,98.2,230,245,255,255,,175,185,-192.5,185,,280,300,-307.5,300,,740,100,M,,1980,Raw,SBD
4,Orkhan Akhmadzade,M_OR_WPC,Azerbaijan,98.2,,,,,,,,,,,260,-270,-280,260,,260,100,M,,1988,Raw,D
DQ,Rustam Musaev,M_OEM_WPC,Azerbaijan,73,-300,305,-325,305,,80,90,,90,,-260,-276,-276,,,,75,M,,1978,Multi-ply,SBD
1,Rustam Musaev,M_OEM_WPC,Azerbaijan,74.4,,,,,,,,,,,230,240,242.5,242.5,,242.5,75,M,,1978,Multi-ply,D
2,Valerijs Lagejevs,M_MEM_5_WPC,Latvia,89.9,,,,,,150,160,-165,160,,,,,,,160,90,M,,1949,Multi-ply,B
1,Valērijs Ņegajevs,M_MR_5_WPC,Latvia,89.4,,,,,,135,140,-145,140,,,,,,,140,90,M,,1949,Raw,B
1,Valērijs Petrovs,M_MR_6_WPC,Latvia,88.3,,,,,,125,130,-135,130,,,,,,,130,90,M,,1946,Raw,B
1,Valērijs Petrovs,M_MEM_6_WPC,Latvia,88.4,,,,,,140,150,-157.5,150,,,,,,,150,90,M,,1946,Multi-ply,B
2,Valeriy Akentyev,M_MR_4_WPC,Russia,104.9,,,,,,155,-162.5,165,165,,,,,,,165,110,M,Валерий Акентьев,1958,Raw,B
1,Valeriy Akentyev,M_MEM_4_WPC,Russia,104.7,,,,,,230,237.5,243,243,245,,,,,,243,110,M,Валерий Акентьев,1958,Multi-ply,B
1,Valeriy Bystrov,M_MR_7_WPC,Russia,98.4,-180,-180,180,180,,100,110,-115,110,,180,190,205,205,,495,100,M,Валерий Быстров,1941,Raw,SBD
1,Valeriy Bystrov,M_MR_7_WPC,Russia,98.4,,,,,,,,,,,-195,-195,195,195,,195,100,M,Валерий Быстров,1941,Raw,D
1,Valeriy Razdorozhnyy,M_MR_2_WPC,Ukraine,97,-170,170,185,185,,145,-155,-155,145,,180,200,205,205,,535,100,M,Валерий Раздорожный,1965,Raw,SBD
1,Valery Tomilov,M_MEM_2_WPC,Israel,89.7,290,300,,300,,220,,,220,,260,-280,,260,,780,90,M,,1965,Multi-ply,SBD
1,Valery Tomilov,M_MEM_2_WPC,Israel,89.6,,,,,,-220,-220,220,220,,,,,,,220,90,M,,1965,Multi-ply,B
3,Vasiliy Tsvetkov,M_OEM_WPC,Russia,79,305,325,-340,325,,195,205,215,215,,250,270,-280,270,,810,82.5,M,Василий Цветков,1981,Multi-ply,SBD
3,Vasily Chernyshenko,M_MR_3_WPC,Russia,122.6,,,,,,157.5,167.5,172.5,172.5,,,,,,,172.5,125,M,Василий Чернышенко,1963,Raw,B
4,Veronika Strolena,F_OR_WPC,Czechia,55.3,-60,80,87.5,87.5,,40,45,-47.5,45,,100,120,-125,120,,252.5,56,F,,1985,Raw,SBD
2,Victor Lambert Francois,M_MR_6_WPC,Switzerland,78.8,,,,,,95,100,-102.5,100,,,,,,,100,82.5,M,,1946,Raw,B
7,Viesturs Eidemanis,M_OR_WPC,Latvia,88.5,,,,,,195,-200,-200,195,,,,,,,195,90,M,,1979,Raw,B
DQ,Viktor Galaguz,M_OR_WPC,Ukraine,89.8,-260,260,270,270,,195,-202.5,-202.5,195,,-300,-300,-300,,,,90,M,Віктор Галагуз,1984,Raw,SBD
9,Viktor Klimov,M_OR_WPC,Russia,113.2,,,,,,190,-197.5,-200,190,,,,,,,190,125,M,Виктор Климов,1975,Raw,B
DQ,Viktor Klimov,M_OEM_WPC,Russia,115.3,,,,,,-310,-310,-315,,,,,,,,,125,M,Виктор Климов,1975,Multi-ply,B
1,Viktor Kochmar,M_MR_1_WPC,Ukraine,145.8,,,,,,215,220,,220,,,,,,,220,140+,M,Віктор Кочмар,1970,Raw,B
1,Viktor Kozlov,M_MR_3_WPC,Russia,125.3,,,,,,200,210,215,215,,,,,,,215,140,M,Виктор Козлов,1963,Raw,B
1,Viktor Mima,M_JR_WPC,Ukraine,122.8,,,,,,180,190,-200,190,,,,,,,190,125,M,Віктор Міма,1991,Raw,B
1,Viktor Naydenov,M_OEM_WPC,Russia,121.1,,,,,,-380,380,-400,380,,,,,,,380,125,M,Виктор Найденов,1987,Multi-ply,B
3,Viktoriya Doga,F_OR_WPC,Moldova,80.3,72.5,80,90,90,,62.5,70,-75,70,,122.5,135,142.5,142.5,,302.5,82.5,F,Виктория Дога,1982,Raw,SBD
2,Vilas Boas Paulo,M_OEM_WPC,Portugal,75,260,-290,-290,260,,135,150,160,160,,-240,240,-255,240,,660,75,M,,1986,Multi-ply,SBD
6,Ville Antikainen,M_OR_WPC,Finland,107.7,250,265,280,280,,145,155,-160,155,,290,-310,,290,,725,110,M,,1988,Raw,SBD
DQ,Vitaliy Kulikov,M_MR_1_WPC,Russia,99.3,-185,-190,-190,,,,,,,,,,,,,,100,M,Виталий Куликов,1971,Raw,SBD
1,Vitaliy Ponomarev,M_MR_4_WPC,Russia,99.2,,,,,,200,207.5,212.5,212.5,-215,,,,,,212.5,100,M,Виталий Пономарев,1957,Raw,B
1,Vitaliy Ponomarev,M_MEM_4_WPC,Russia,98.3,,,,,,237.5,242.5,247.5,247.5,,,,,,,247.5,100,M,Виталий Пономарев,1957,Multi-ply,B
1,Vizhe Mirmirani,F_MEM_2_WPC,Russia,60,140,150,160,160,,90,-100,100,100,,140,-150,-150,140,,400,60,F,Виже Мирмирани,1965,Multi-ply,SBD
1,Vladimir Chernyshov,M_MR_6_WPC,Russia,120.8,-200,200,-215,200,,115,125,132.5,132.5,,205,220,-235,220,,552.5,125,M,Владимир Чернышов,1948,Raw,SBD
1,Vladimir Golubev,M_OR_WPC,Kazakhstan,120.8,302.5,315,325,325,,215,225,230,230,,300,315,330,330,,885,125,M,,1986,Raw,SBD
4,Vladimir Golubev,M_OR_WPC,Kazakhstan,119.9,,,,,,215,225,-235,225,,,,,,,225,125,M,,1986,Raw,B
3,Vladimir Golubev,M_OR_WPC,Kazakhstan,120.5,,,,,,,,,,,280,305,310,310,,310,125,M,,1986,Raw,D
2,Vladimír Jeřábek,M_OR_WPC,Czechia,125.1,260,280,-287.5,280,,190,200,-205,200,,305,320,-330,320,,800,140,M,,1989,Raw,SBD
1,Vladimír Jeřábek,M_OEM_WPC,Czechia,120,,,,,,,,,,,300,320,340,340,,340,125,M,,1989,Multi-ply,D
1,Vladimir Omelkov,M_MEM_1_WPC,Russia,107.4,,,,,,250,-260,-265,250,,,,,,,250,110,M,Владимир Омельков,1970,Multi-ply,B
1,Vladimir Shmelev,M_MEM_1_WPC,Russia,79.9,,,,,,170,175,180,180,,,,,,,180,82.5,M,Владимир Шмелев,1972,Multi-ply,B
1,Vladimir Sviderskiy,M_MR_5_WPC,Russia,65.1,125,130,132.5,132.5,,85,90,-93,90,,140,147.5,-152.5,147.5,,370,67.5,M,Владимир Свидерский,1951,Raw,SBD
2,Vladimir Sviderskiy,M_MR_5_WPC,Russia,65.3,,,,,,85,-90,90,90,,,,,,,90,67.5,M,Владимир Свидерский,1951,Raw,B
1,Vladimir Sviderskiy,M_MR_5_WPC,Russia,65.1,,,,,,,,,,,135,142.5,147.5,147.5,,147.5,67.5,M,Владимир Свидерский,1951,Raw,D
2,Vladimir Varaksin,M_MR_1_WPC,Russia,107.7,,,,,,162.5,167.5,175,175,,,,,,,175,110,M,Владимир Вараксин,1972,Raw,B
2,Vladimir Zhabin,M_OEM_WPC,Russia,89,-340,340,-360,340,,-220,220,235,235,,300,333,-370,333,,908,90,M,Владимир Жабин,1980,Multi-ply,SBD
5,Vladislav Kalinichev,M_MR_1_WPC,Russia,87.6,,,,,,-145,-145,147.5,147.5,,,,,,,147.5,90,M,Владислав Калиничев,1970,Raw,B
DQ,Vladislav Láník,M_OR_WPC,Czechia,108.9,250,260,-265,260,,200,-205,-205,200,,-300,,,,,,110,M,,1989,Raw,SBD
DQ,Vladislava Dluzhnevskaya,F_TR_1_WPC,Russia,52,,,,,,-80,-80,-80,,,,,,,,,52,F,Владислава Длужневская,2000,Raw,B
1,Vladislava Dluzhnevskaya,F_TEM_1_WPC,Russia,51.9,,,,,,80,85,-92.5,85,,,,,,,85,52,F,Владислава Длужневская,2000,Multi-ply,B
1,Vladislava Dluzhnevskaya,F_OEM_WPC,Russia,51.9,,,,,,80,85,-92.5,85,,,,,,,85,52,F,Владислава Длужневская,2000,Multi-ply,B
2,Volodymyr Rozhanskyy,M_OEM_WPC,Ukraine,115.1,-390,-390,390,390,,240,245,250,250,,320,-340,340,340,,980,125,M,Володимир Рожанський,1980,Multi-ply,SBD
1,Yakov Berman,M_MR_1_WPC,Russia,103.1,230,240,250,250,,180,190,200,200,,270,285,-300,285,,735,110,M,Яков Берман,1972,Raw,SBD
1,Yakov Berman,M_MR_1_WPC,Russia,99.9,,,,,,190,200,-205,200,,,,,,,200,100,M,Яков Берман,1972,Raw,B
5,Yerlan Alkeyev,M_OR_WPC,Kazakhstan,82.5,230,-245,245,245,,170,182.5,-192.5,182.5,,230,240,,240,,667.5,82.5,M,,1989,Raw,SBD
DQ,Yerlan Alkeyev,M_OR_WPC,Kazakhstan,82.5,,,,,,-200,-200,-200,,,,,,,,,82.5,M,,1989,Raw,B
2,Yerlan Alkeyev,M_OEM_WPC,Kazakhstan,82.5,,,,,,212.5,-225,227.5,227.5,,,,,,,227.5,82.5,M,,1989,Multi-ply,B
2,Yevgeniy Borisov,M_MR_1_WPC,Kazakhstan,116.2,170,190,200,200,,130,140,160,160,,240,260,,260,,620,125,M,,1971,Raw,SBD
4,Yevgeniy Borisov,M_OR_WPC,Kazakhstan,116.8,,,,,,,,,,,280,302.5,305,305,,305,125,M,,1971,Raw,D
1,Yevgeniy Borisov,M_MR_1_WPC,Kazakhstan,116.8,,,,,,,,,,,280,302.5,305,305,,305,125,M,,1971,Raw,D
DQ,Yuriy Babakov,M_OR_WPC,Russia,123.4,,,,,,-210,-210,-210,,,,,,,,,125,M,Юрий Бабаков,1979,Raw,B
1,Yuriy Chepets,M_MR_7_WPC,Russia,77.8,190,200,205,205,,100,110,115,115,117.5,200,-210,-210,200,,520,82.5,M,Юрий Чепец,1943,Raw,SBD
1,Yuriy Chepets,M_MEM_7_WPC,Russia,78.8,200,210,,210,,140,145,150,150,,195,200,-205,200,,560,82.5,M,Юрий Чепец,1943,Multi-ply,SBD
DQ,Yuriy Korikov,M_OEM_WPC,Russia,89.4,,,,,,-220,-230,-230,,,,,,,,,90,M,Юрий Кориков,1962,Multi-ply,B
2,Yuriy Korikov,M_MEM_3_WPC,Russia,89.4,,,,,,210,-220,-220,210,,,,,,,210,90,M,Юрий Кориков,1962,Multi-ply,B
3,Yuriy Ustinov,M_OEM_WPC,Russia,92.6,,,,,,,,,,,270,285,,285,,285,100,M,Юрий Устинов,1975,Multi-ply,D
1,Yuriy Zakharov,M_MR_1_WPC,Kazakhstan,124,270,290,302.5,302.5,,207.5,213,-220,213,,290,300,-307.5,300,,815.5,125,M,,1972,Raw,SBD
4,Yuriy Zakharov,M_MR_1_WPC,Kazakhstan,124.8,,,,,,205,212.5,217.5,217.5,,,,,,,217.5,125,M,,1972,Raw,B
1,Yuriy Zakharov,M_MR_1_WPC,Kazakhstan,126.3,,,,,,,,,,,260,280,290,290,,290,140,M,,1972,Raw,D
1,Zdeněk Trnka,M_MEM_3_WPC,Czechia,135.5,240,255,260,260,,140,150,,150,,250,260,270,270,,680,140,M,,1963,Multi-ply,SBD
4,Zdenka Hudíková,F_OEM_WPC,Slovakia,75,,,,,,95,102.5,-110,102.5,,,,,,,102.5,75,F,,1980,Multi-ply,B
3,Zsolt Hetyési,M_OR_WPC,Hungary,99.5,,,,,,232.5,-237.5,-242.5,232.5,,,,,,,232.5,100,M,,1985,Raw,B
