Division,WeightClassKg,Place,Name,Team,BodyweightKg,Best3SquatKg,Best3BenchKg,Best3DeadliftKg,TotalKg,Equipment,Event,Sex,BirthDate
Boys,55.79,1,Col Stevens,Big Sandy Harmony,55.7,167.83,81.65,161.03,410.5,Single-ply,SBD,M,
Boys,55.79,2,Isaiah O'Neal,Gladewater Union Grove,55.79,140.61,68.04,136.08,344.73,Single-ply,SBD,M,
Boys,55.79,3,Lane Turner,Gladewater Union Grove,54.88,136.08,74.84,131.54,342.46,Single-ply,SBD,M,
Boys,55.79,4,Travis Coe,Big Sandy Harmony,53.52,127.01,52.16,136.08,315.25,Single-ply,SBD,M,
Boys,59.87,1,Devin Espinoza,Gilmer Union Hill,59.42,154.22,92.99,163.29,410.5,Single-ply,SBD,M,
Boys,59.87,DQ,Caleb Simmons,Gilmer Union Hill,59.78,92.99,,,,Single-ply,SBD,M,
Boys,67.13,1,Leo Cornejo,Gilmer Union Hill,66.18,142.88,113.4,167.83,424.11,Single-ply,SBD,M,
Boys,67.13,2,Carter Smith,Gladewater Union Grove,67,154.22,90.72,154.22,399.16,Single-ply,SBD,M,
Boys,67.13,3,James Evans,Gladewater Union Grove,66.5,149.69,86.18,147.42,383.29,Single-ply,SBD,M,
Boys,67.13,4,Matt Massingill,Gilmer Union Hill,66.72,124.74,92.99,154.22,371.95,Single-ply,SBD,M,
Boys,67.13,5,Daniel Dunn,Gilmer Union Hill,67.13,115.67,77.11,154.22,347,Single-ply,SBD,M,
Boys,67.13,6,Jacob Hart,Gladewater Union Grove,66.22,97.52,61.23,95.25,254.01,Single-ply,SBD,M,
Boys,67.13,DQ,Wesley Sweaney,Big Sandy Harmony,67.13,131.54,,,,Single-ply,SBD,M,
Boys,74.84,1,Mason Byers,Gladewater Union Grove,72.35,149.69,97.52,149.69,396.89,Single-ply,SBD,M,
Boys,74.84,2,Trent Wheat,Laird Hill Leveretts Chapel,67.59,113.4,58.97,147.42,319.78,Single-ply,SBD,M,
Boys,74.84,DQ,Jayke Bass,Gilmer Union Hill,74.16,,,,,Single-ply,SBD,M,
Boys,74.84,DQ,Jasper Giles,Gilmer Union Hill,74.39,127.01,90.72,,,Single-ply,SBD,M,
Boys,82.1,1,Macen Clark,Gilmer Union Hill,82.1,190.51,136.08,204.12,530.7,Single-ply,SBD,M,
Boys,82.1,2,Jonathon Peery,Laird Hill Leveretts Chapel,82.1,163.29,115.67,185.97,464.93,Single-ply,SBD,M,
Boys,82.1,3,Jacob Griffin,Gladewater Union Grove,80.29,167.83,102.06,183.7,453.59,Single-ply,SBD,M,
Boys,89.81,1,Brayden DeGoede,Big Sandy Harmony,82.55,158.76,113.4,167.83,439.98,Single-ply,SBD,M,
Boys,89.81,2,Konner Ellison,Big Sandy Harmony,89.36,145.15,83.91,165.56,394.63,Single-ply,SBD,M,
Boys,89.81,3,Josh Joyner,Gladewater Union Grove,88.27,138.35,88.45,158.76,385.55,Single-ply,SBD,M,
Boys,99.79,1,Tyler Rodgers,Gladewater Union Grove,97.89,195.04,136.08,195.04,526.17,Single-ply,SBD,M,
Boys,99.79,2,Tommy Branscom,Gladewater Union Grove,98.43,170.1,120.2,163.29,453.59,Single-ply,SBD,M,
Boys,99.79,3,David McGhee,Gilmer Union Hill,91.17,158.76,90.72,149.69,399.16,Single-ply,SBD,M,
Boys,109.77,1,Alec Vickers,Laird Hill Leveretts Chapel,107.95,204.12,127.01,195.04,526.17,Single-ply,SBD,M,
Boys,109.77,DQ,Reed Cooper,Gladewater Union Grove,103.42,,,,,Single-ply,SBD,M,
Boys,124.74,1,Michael Sanchez,Big Sandy Harmony,114.53,244.94,131.54,210.92,587.4,Single-ply,SBD,M,
Boys,124.74,2,Aaron Wells,Big Sandy Harmony,124.69,158.76,97.52,158.76,415.04,Single-ply,SBD,M,
Boys,139.71+,1,Kayden Ballard,Big Sandy Harmony,146.06,204.12,138.35,170.1,512.56,Single-ply,SBD,M,
Boys,139.71+,DQ,Robert Dyer,Big Sandy Harmony,147.42,222.26,,,,Single-ply,SBD,M,
