<svg width="19" height="19" viewBox="0 0 19 19" fill="none" xmlns="http://www.w3.org/2000/svg">
<path d="M4.62573 7.5945L9.10419 12.073L13.5826 7.5945L13.0229 7.03479L9.10419 10.9535L5.18544 7.03479L4.62573 7.5945Z" fill="#8D8D8D"/>
</svg>
