<svg width="20" height="20" viewBox="0 0 20 20" fill="none" xmlns="http://www.w3.org/2000/svg">
<path d="M8.16667 14.9995C7.91667 14.9995 7.75 14.9162 7.58333 14.7495L3.5 10.4162C3.16667 10.0829 3.16667 9.58286 3.5 9.24953C3.83333 8.91619 4.33333 8.91619 4.66667 9.24953L8.08333 12.9162L15.0833 5.24953C15.3333 4.91619 15.9167 4.83286 16.25 5.08286C16.5833 5.33286 16.6667 5.91619 16.4167 6.24953L16.3333 6.33286L8.75 14.6662C8.66667 14.9162 8.41667 14.9995 8.16667 14.9995Z" fill="#144916"/>
</svg>
