<svg width="100" height="100" viewBox="0 0 100 100" fill="none" xmlns="http://www.w3.org/2000/svg">
<rect x="30" y="18.5513" width="46.6974" height="56.6554" fill="white"/>
<path d="M50 0C22.3884 0 0 22.3884 0 50C0 77.6116 22.3884 100 50 100C77.6116 100 100 77.6116 100 50C100 22.3884 77.6116 0 50 0ZM66.0826 50.7701L41.7076 68.5045C41.574 68.6005 41.4164 68.6578 41.2523 68.6702C41.0883 68.6825 40.9239 68.6493 40.7775 68.5744C40.631 68.4994 40.508 68.3855 40.422 68.2452C40.3361 68.1049 40.2904 67.9436 40.2902 67.779V32.3326C40.2896 32.1677 40.3348 32.0059 40.4206 31.8651C40.5064 31.7243 40.6295 31.61 40.7762 31.5349C40.923 31.4597 41.0877 31.4267 41.2521 31.4395C41.4165 31.4522 41.5742 31.5103 41.7076 31.6071L66.0826 49.3304C66.1977 49.4118 66.2917 49.5197 66.3565 49.6449C66.4213 49.7702 66.4552 49.9092 66.4552 50.0502C66.4552 50.1913 66.4213 50.3302 66.3565 50.4555C66.2917 50.5808 66.1977 50.6887 66.0826 50.7701Z" fill="#FF9C30"/>
</svg>
