<svg width="100" height="137" viewBox="0 0 100 137" fill="none" xmlns="http://www.w3.org/2000/svg">
<circle cx="50" cy="50" r="50" fill="#72C899"/>
<g clip-path="url(#clip0_1_521)">
<path d="M71.2534 28.7475C71.0176 28.5117 70.7774 28.2819 70.5352 28.0549C70.5281 28.0482 70.5222 28.0408 70.515 28.0341C70.5075 28.0272 70.4994 28.0214 70.4917 28.0145C59.202 17.0486 39.6643 17.3752 28.7496 28.7478C16.7844 40.2703 17.1465 60.8946 29.5138 71.9866C29.5224 71.9948 29.5296 72.0037 29.5383 72.0119C29.548 72.0209 29.5583 72.0284 29.568 72.037C40.8643 82.953 60.3586 82.6022 71.2533 71.2511C82.9122 60.0647 82.9129 39.934 71.2534 28.7475ZM23.4688 49.9994C23.4326 27.7076 49.5939 15.3482 66.7893 29.4496L51.8839 45.4466C52.2472 35.8771 48.6793 31.1237 46.485 29.1225C45.7076 28.4136 44.4701 28.6324 43.9797 29.5631C43.5582 30.3446 43.6976 31.3138 44.3318 31.9352C44.4992 32.0992 44.6784 32.2874 44.8648 32.5017L32.0326 45.3563C31.8351 45.1838 31.6597 45.0173 31.5052 44.8607C30.8556 44.2024 29.8561 44.0394 29.0305 44.4558C28.1333 44.9551 27.9238 46.1607 28.6101 46.9244C30.614 49.1543 35.4858 52.8714 45.4409 52.3616L30.69 68.1929C26.0277 63.2514 23.4688 56.8223 23.4688 49.9994ZM64.5883 53.3373L52.8341 65.1118C52.3507 64.1519 51.9549 63.1401 51.6471 62.078L61.5584 52.147C62.6192 52.4556 63.6296 52.8524 64.5883 53.3373ZM46.7845 35.5639C47.1526 36.3885 47.5024 37.3809 47.7807 38.5606L38.0817 48.2795C36.9031 48.0005 35.9117 47.6496 35.0883 47.2804L46.7845 35.5639ZM48.3583 42.9675C48.4254 44.6138 48.3547 46.4804 48.0883 48.5881C45.9851 48.8547 44.1225 48.9253 42.4798 48.8583L48.3583 42.9675ZM50.9036 57.8372C50.7632 55.9096 50.8558 53.8552 51.1828 51.6813C53.3522 51.3539 55.4023 51.2613 57.326 51.4021L50.9036 57.8372ZM68.763 68.761C59.5838 78.3136 43.3452 79.1171 33.2678 70.5926L47.332 55.4982C47.1793 61.759 49.2748 67.9205 53.5192 71.8835C54.2415 72.5571 55.3969 72.4105 55.9247 71.5757C56.4409 70.7708 56.3236 69.7166 55.6451 69.0428C55.3868 68.7863 55.1014 68.4811 54.8027 68.1248L67.5953 55.31C68.0131 55.6617 68.3604 55.9947 68.6406 56.2864C70.32 57.9039 72.73 55.5974 71.1823 53.8499C67.1245 49.6009 60.8953 47.6007 54.4638 47.844L69.3602 31.8568C79.0897 41.8166 78.8217 59.1071 68.763 68.761Z" fill="white"/>
</g>
<path d="M8.89992 132V122H12.5399L12.7199 125.86L12.2999 125.42C12.4066 124.647 12.6266 123.993 12.9599 123.46C13.2933 122.913 13.7199 122.5 14.2399 122.22C14.7733 121.94 15.3866 121.8 16.0799 121.8C16.7599 121.8 17.3399 121.933 17.8199 122.2C18.3133 122.453 18.6933 122.84 18.9599 123.36C19.2266 123.867 19.3599 124.493 19.3599 125.24V132H15.3199V126.28C15.3199 125.72 15.2266 125.34 15.0399 125.14C14.8666 124.927 14.6133 124.82 14.2799 124.82C14.0266 124.82 13.7933 124.887 13.5799 125.02C13.3799 125.14 13.2199 125.34 13.0999 125.62C12.9933 125.9 12.9399 126.267 12.9399 126.72V132H8.89992ZM26.3023 121.8C27.3956 121.8 28.3489 122.007 29.1623 122.42C29.9756 122.82 30.6089 123.407 31.0623 124.18C31.5156 124.953 31.7423 125.893 31.7423 127C31.7423 128.093 31.5156 129.033 31.0623 129.82C30.6089 130.593 29.9756 131.187 29.1623 131.6C28.3489 132 27.3956 132.2 26.3023 132.2C25.2356 132.2 24.2889 132 23.4623 131.6C22.6489 131.187 22.0089 130.593 21.5423 129.82C21.0889 129.033 20.8623 128.093 20.8623 127C20.8623 125.893 21.0889 124.953 21.5423 124.18C22.0089 123.407 22.6489 122.82 23.4623 122.42C24.2889 122.007 25.2356 121.8 26.3023 121.8ZM26.3023 124.58C26.0089 124.58 25.7556 124.653 25.5423 124.8C25.3423 124.947 25.1889 125.2 25.0823 125.56C24.9756 125.92 24.9223 126.4 24.9223 127C24.9223 127.6 24.9756 128.08 25.0823 128.44C25.1889 128.787 25.3423 129.04 25.5423 129.2C25.7556 129.347 26.0089 129.42 26.3023 129.42C26.6089 129.42 26.8623 129.347 27.0623 129.2C27.2623 129.04 27.4156 128.787 27.5223 128.44C27.6289 128.08 27.6823 127.6 27.6823 127C27.6823 126.4 27.6289 125.92 27.5223 125.56C27.4156 125.2 27.2623 124.947 27.0623 124.8C26.8623 124.653 26.6089 124.58 26.3023 124.58ZM33.2554 132V122H36.8954L37.0754 125.86L36.6554 125.42C36.7621 124.647 36.9821 123.993 37.3154 123.46C37.6487 122.913 38.0754 122.5 38.5954 122.22C39.1287 121.94 39.7421 121.8 40.4354 121.8C41.1154 121.8 41.6954 121.933 42.1754 122.2C42.6687 122.453 43.0487 122.84 43.3154 123.36C43.5821 123.867 43.7154 124.493 43.7154 125.24V132H39.6754V126.28C39.6754 125.72 39.5821 125.34 39.3954 125.14C39.2221 124.927 38.9687 124.82 38.6354 124.82C38.3821 124.82 38.1487 124.887 37.9354 125.02C37.7354 125.14 37.5754 125.34 37.4554 125.62C37.3487 125.9 37.2954 126.267 37.2954 126.72V132H33.2554ZM61.1098 119.02L61.3898 121.6C61.2698 121.573 61.1631 121.56 61.0698 121.56C60.9764 121.547 60.8831 121.54 60.7898 121.54C60.2164 121.54 59.7964 121.687 59.5298 121.98C59.2631 122.26 59.1298 122.593 59.1298 122.98L57.8698 122.56C57.8698 122 57.9631 121.447 58.1498 120.9C58.3364 120.353 58.6364 119.9 59.0498 119.54C59.4764 119.18 60.0364 119 60.7298 119C60.7831 119 60.8431 119 60.9098 119C60.9764 119 61.0431 119.007 61.1098 119.02ZM57.5498 129.46C58.7898 129.46 59.7298 129.713 60.3698 130.22C61.0231 130.713 61.3498 131.453 61.3498 132.44C61.3498 133.32 61.1164 134.047 60.6498 134.62C60.1964 135.193 59.5431 135.613 58.6898 135.88C57.8364 136.16 56.8098 136.3 55.6098 136.3C53.7164 136.3 52.3631 136.087 51.5498 135.66C50.7498 135.233 50.3498 134.627 50.3498 133.84C50.3498 133.28 50.5964 132.833 51.0898 132.5C51.5831 132.18 52.3898 132.013 53.5098 132L53.4498 132.34C52.5031 132.233 51.8098 131.98 51.3698 131.58C50.9431 131.167 50.7298 130.627 50.7298 129.96C50.7298 129.28 51.0031 128.74 51.5498 128.34C52.0964 127.94 52.7964 127.727 53.6498 127.7L54.9698 128.3H54.6098C54.1298 128.313 53.7964 128.373 53.6098 128.48C53.4231 128.587 53.3298 128.727 53.3298 128.9C53.3298 129.087 53.4031 129.227 53.5498 129.32C53.7098 129.413 53.9564 129.46 54.2898 129.46H57.5498ZM55.6498 133.78C56.2498 133.78 56.7431 133.747 57.1298 133.68C57.5298 133.627 57.8231 133.54 58.0098 133.42C58.2098 133.3 58.3098 133.16 58.3098 133C58.3098 132.867 58.2631 132.76 58.1698 132.68C58.0764 132.613 57.8964 132.58 57.6298 132.58H53.8898C53.7031 132.58 53.5564 132.627 53.4498 132.72C53.3431 132.813 53.2898 132.933 53.2898 133.08C53.2898 133.307 53.4964 133.48 53.9098 133.6C54.3364 133.72 54.9164 133.78 55.6498 133.78ZM55.8498 121.8C56.9564 121.8 57.8831 121.933 58.6298 122.2C59.3898 122.453 59.9631 122.833 60.3498 123.34C60.7498 123.833 60.9498 124.46 60.9498 125.22C60.9498 125.953 60.7498 126.573 60.3498 127.08C59.9631 127.587 59.3898 127.967 58.6298 128.22C57.8831 128.473 56.9564 128.6 55.8498 128.6C54.1831 128.6 52.9164 128.313 52.0498 127.74C51.1964 127.167 50.7698 126.327 50.7698 125.22C50.7698 124.46 50.9631 123.833 51.3498 123.34C51.7364 122.833 52.3098 122.453 53.0698 122.2C53.8298 121.933 54.7564 121.8 55.8498 121.8ZM55.8498 123.98C55.5031 123.98 55.2231 124.08 55.0098 124.28C54.8098 124.48 54.7098 124.787 54.7098 125.2C54.7098 125.6 54.8098 125.907 55.0098 126.12C55.2231 126.32 55.5031 126.42 55.8498 126.42C56.1964 126.42 56.4698 126.32 56.6698 126.12C56.8831 125.907 56.9898 125.6 56.9898 125.2C56.9898 124.787 56.8831 124.48 56.6698 124.28C56.4698 124.08 56.1964 123.98 55.8498 123.98ZM62.3765 132V122H66.0165L66.1165 124.06C66.4098 123.327 66.8498 122.767 67.4365 122.38C68.0232 121.993 68.7232 121.8 69.5365 121.8C70.2832 121.8 70.9165 121.973 71.4365 122.32C71.9698 122.653 72.3498 123.147 72.5765 123.8C72.7898 123.36 73.0565 122.993 73.3765 122.7C73.7098 122.407 74.0898 122.187 74.5165 122.04C74.9565 121.88 75.4232 121.8 75.9165 121.8C76.5832 121.8 77.1565 121.933 77.6365 122.2C78.1298 122.453 78.5098 122.84 78.7765 123.36C79.0432 123.867 79.1765 124.493 79.1765 125.24V132H75.1365V126.24C75.1365 125.707 75.0498 125.34 74.8765 125.14C74.7032 124.927 74.4565 124.82 74.1365 124.82C73.8698 124.82 73.6298 124.887 73.4165 125.02C73.2165 125.153 73.0632 125.367 72.9565 125.66C72.8498 125.94 72.7965 126.293 72.7965 126.72V132H68.7565V126.24C68.7565 125.707 68.6698 125.34 68.4965 125.14C68.3232 124.927 68.0765 124.82 67.7565 124.82C67.5032 124.82 67.2698 124.887 67.0565 125.02C66.8565 125.153 66.6965 125.367 66.5765 125.66C66.4698 125.94 66.4165 126.3 66.4165 126.74V132H62.3765ZM86.107 121.8C87.2003 121.8 88.1536 122.007 88.967 122.42C89.7803 122.82 90.4136 123.407 90.867 124.18C91.3203 124.953 91.547 125.893 91.547 127C91.547 128.093 91.3203 129.033 90.867 129.82C90.4136 130.593 89.7803 131.187 88.967 131.6C88.1536 132 87.2003 132.2 86.107 132.2C85.0403 132.2 84.0936 132 83.267 131.6C82.4536 131.187 81.8136 130.593 81.347 129.82C80.8936 129.033 80.667 128.093 80.667 127C80.667 125.893 80.8936 124.953 81.347 124.18C81.8136 123.407 82.4536 122.82 83.267 122.42C84.0936 122.007 85.0403 121.8 86.107 121.8ZM86.107 124.58C85.8136 124.58 85.5603 124.653 85.347 124.8C85.147 124.947 84.9936 125.2 84.887 125.56C84.7803 125.92 84.727 126.4 84.727 127C84.727 127.6 84.7803 128.08 84.887 128.44C84.9936 128.787 85.147 129.04 85.347 129.2C85.5603 129.347 85.8136 129.42 86.107 129.42C86.4136 129.42 86.667 129.347 86.867 129.2C87.067 129.04 87.2203 128.787 87.327 128.44C87.4336 128.08 87.487 127.6 87.487 127C87.487 126.4 87.4336 125.92 87.327 125.56C87.2203 125.2 87.067 124.947 86.867 124.8C86.667 124.653 86.4136 124.58 86.107 124.58Z" fill="#12142D"/>
<defs>
<clipPath id="clip0_1_521">
<rect width="60" height="60" fill="white" transform="translate(20 20)"/>
</clipPath>
</defs>
</svg>
