<svg width="80" height="80" viewBox="0 0 80 80" fill="none" xmlns="http://www.w3.org/2000/svg">
<g clip-path="url(#clip0_1_2389)">
<path d="M41.5 1H25L35.5 12L38.5 24L36 35.5L29.5 48.5L25.5 52L14 59L7.5 69L15 76L20 66L27 61L31 70L38.5 79H55.5L47.5 70.5L41.5 59V48.5L47.5 36.5H55L63 41L69 52L75.5 46L72 40L63 30.5L51.5 27V18.5L48.5 9.5L41.5 1Z" fill="#72C899"/>
<path d="M54.9994 80C54.5727 80 54.1461 79.8366 53.8194 79.5133L47.2861 72.98C38.7094 64.4033 36.8061 51.46 42.5627 40.7766L44.6627 36.86C45.7094 34.9033 47.8894 33.89 50.0527 34.32L55.5861 35.43C60.1461 36.3466 63.9627 39.2566 66.0561 43.4166L69.8227 50.9166C70.2327 51.74 69.8994 52.74 69.0794 53.1533C68.2594 53.56 67.2527 53.2366 66.8394 52.4133L63.0727 44.9133C61.4494 41.6766 58.4794 39.41 54.9294 38.6966L49.3961 37.5866C48.6594 37.4433 47.9461 37.7833 47.5994 38.4333L45.4994 42.3533C40.4461 51.7333 42.1127 63.09 49.6427 70.62L56.1761 77.1533C56.8261 77.8033 56.8261 78.86 56.1761 79.51C55.8527 79.8366 55.4261 80 54.9994 80Z" fill="#9FEDC2"/>
<path d="M75.0005 46.6666C74.4405 46.6666 73.8905 46.3833 73.5771 45.8666L70.5771 40.9333C66.4871 34.2799 61.0638 30.5433 53.5005 29.1766C51.0105 28.7266 49.2505 26.3966 49.4871 23.8699C50.2471 15.8133 46.9305 7.99994 40.6305 2.96994C39.9105 2.39661 39.7905 1.34661 40.3671 0.626607C40.9438 -0.0900602 41.9905 -0.206727 42.7071 0.363273C49.8938 6.09661 53.6671 15.0033 52.8071 24.1833C52.7305 24.9999 53.2938 25.7499 54.0938 25.8933C62.6538 27.4399 68.7971 31.6666 73.4205 39.1933L76.4238 44.1333C76.9038 44.9199 76.6538 45.9433 75.8671 46.4233C75.5971 46.5899 75.2971 46.6666 75.0005 46.6666Z" fill="#9FEDC2"/>
<path d="M38.3334 79.9999C37.9067 79.9999 37.4801 79.8366 37.1534 79.5133L33.9534 76.3133C30.6834 73.0466 28.2934 68.9699 27.0401 64.5299C26.8901 63.9966 26.4967 63.5566 25.99 63.3533C25.74 63.2499 25.2367 63.1299 24.7301 63.4366C22.8034 64.5833 21.2567 66.2433 20.2567 68.2433L16.49 75.7466C16.0734 76.5666 15.0667 76.8933 14.25 76.4866C13.43 76.0733 13.0967 75.0733 13.5067 74.2499L17.2734 66.7499C18.56 64.1799 20.5467 62.0433 23.0234 60.5699C24.2967 59.8133 25.8267 59.6933 27.2234 60.2533C28.6867 60.8366 29.8167 62.0933 30.25 63.6199C31.3467 67.5133 33.4434 71.0866 36.31 73.9533L39.51 77.1533C40.16 77.8033 40.16 78.8599 39.51 79.5099C39.1867 79.8366 38.76 79.9999 38.3334 79.9999Z" fill="#9FEDC2"/>
<path d="M8.33342 70.0001C8.03676 70.0001 7.73676 69.9235 7.46676 69.7568C6.68009 69.2768 6.43009 68.2535 6.91009 67.4668L9.91009 62.5335C13.3168 56.9968 18.5468 52.7701 24.6334 50.6168C26.0401 50.1201 27.1301 49.0501 27.6268 47.6901C28.0701 46.4801 28.6068 45.2801 29.2234 44.1168L33.6268 35.9401C38.9901 25.9868 36.5634 13.4835 27.8601 6.21013L23.9368 2.95013C23.2268 2.36013 23.1268 1.31013 23.7168 0.603463C24.3068 -0.103204 25.3634 -0.19987 26.0634 0.383463L29.9968 3.65013C39.9168 11.9368 42.6801 26.1835 36.5701 37.5235L32.1701 45.6901C31.6268 46.7101 31.1501 47.7701 30.7634 48.8301C29.9268 51.1301 28.0968 52.9268 25.7501 53.7601C20.3768 55.6601 15.7601 59.3901 12.7568 64.2735L9.75676 69.2001C9.44342 69.7168 8.89342 70.0001 8.33342 70.0001Z" fill="#9FEDC2"/>
<path d="M18.3336 26.6665C18.0136 26.6665 17.6936 26.5765 17.4103 26.3865C16.6436 25.8765 16.4369 24.8432 16.9469 24.0765C21.2903 17.5632 29.5103 14.7465 36.9303 17.2199L38.0269 17.5865C38.9003 17.8765 39.3703 18.8232 39.0803 19.6932C38.7869 20.5699 37.8436 21.0432 36.9703 20.7465L35.8736 20.3799C29.8736 18.3765 23.2303 20.6565 19.7169 25.9232C19.3969 26.4065 18.8703 26.6665 18.3336 26.6665Z" fill="#9FEDC2"/>
<path d="M61.6667 66.6667C61.2033 66.6667 60.7433 66.4734 60.4133 66.0967C57.02 62.2234 52.1233 60.0001 46.9767 60.0001H41.6667C40.7467 60.0001 40 59.2534 40 58.3334C40 57.4134 40.7467 56.6667 41.6667 56.6667H46.9767C53.0867 56.6667 58.8967 59.3034 62.92 63.9034C63.53 64.5967 63.4567 65.6468 62.7633 66.2568C62.4467 66.5301 62.0567 66.6667 61.6667 66.6667Z" fill="#9FEDC2"/>
</g>
<defs>
<clipPath id="clip0_1_2389">
<rect width="80" height="80" fill="white"/>
</clipPath>
</defs>
</svg>
