<svg width="80" height="80" viewBox="0 0 80 80" fill="none" xmlns="http://www.w3.org/2000/svg">
<g clip-path="url(#clip0_1_855)">
<path d="M5 8H10.5V12.5L14.5 14L17.5 12.5V8H28V12.5L31.5 14L35 12V8L45 8.5L45.5 12.5L48.5 14L51.5 12.5V8H63V13.5L66 14L69.5 13.5V8H74.5L78.5 11V23.5H1.5V12.5L5 8Z" fill="white"/>
<path d="M78.5 23.5H2V75L5.5 78.5H75L78.5 75V23.5Z" fill="#72C899"/>
<path d="M73.5938 79.8438H6.40625C2.96 79.8438 0.15625 77.04 0.15625 73.5938V12.6562C0.15625 9.21 2.96 6.40625 6.40625 6.40625H11.0938C11.9566 6.40625 12.6562 7.10594 12.6562 7.96875V11.0192C12.6562 11.8922 13.3313 12.6261 14.1613 12.6552C15.0278 12.6927 15.7812 11.9953 15.7812 11.0938V7.96875C15.7812 7.10594 16.4808 6.40625 17.3438 6.40625H28.2812C29.1441 6.40625 29.8438 7.10594 29.8438 7.96875V11.0192C29.8438 11.8922 30.5188 12.6261 31.3488 12.6552C32.2213 12.6927 32.9688 11.9891 32.9688 11.0938V7.96875C32.9688 7.10594 33.6683 6.40625 34.5312 6.40625H45.4688C46.3316 6.40625 47.0312 7.10594 47.0312 7.96875V11.0192C47.0312 11.8922 47.7062 12.6261 48.5362 12.6552C49.4003 12.6925 50.1562 11.9972 50.1562 11.0938V7.96875C50.1562 7.10594 50.8559 6.40625 51.7188 6.40625H62.6562C63.5191 6.40625 64.2188 7.10594 64.2188 7.96875V11.0192C64.2188 11.8922 64.8937 12.6261 65.7237 12.6552C66.5933 12.6927 67.3438 11.9925 67.3438 11.0938V7.96875C67.3438 7.10594 68.0434 6.40625 68.9062 6.40625H73.5938C77.04 6.40625 79.8438 9.21 79.8438 12.6562V73.5938C79.8438 77.04 77.04 79.8438 73.5938 79.8438ZM6.40625 9.53125C4.68313 9.53125 3.28125 10.9331 3.28125 12.6562V73.5938C3.28125 75.3169 4.68313 76.7188 6.40625 76.7188H73.5938C75.3169 76.7188 76.7188 75.3169 76.7188 73.5938V12.6562C76.7188 10.9331 75.3169 9.53125 73.5938 9.53125H70.4688V11.0938C70.4688 13.7444 68.2806 15.8702 65.6144 15.7783C63.0794 15.6895 61.0938 13.5991 61.0938 11.0192V9.53125H53.2812V11.0938C53.2812 13.7458 51.0916 15.8702 48.4269 15.7783C45.8919 15.6895 43.9062 13.5991 43.9062 11.0192V9.53125H36.0938V11.0938C36.0938 13.7423 33.9073 15.8703 31.2394 15.7783C28.7044 15.6895 26.7188 13.5991 26.7188 11.0192V9.53125H18.9062V11.0938C18.9062 13.7375 16.7252 15.8703 14.0519 15.7783C11.5169 15.6895 9.53125 13.5991 9.53125 11.0192V9.53125H6.40625Z" fill="#9FEDC2"/>
<path d="M78.2812 25.1562H1.71875C0.855781 25.1562 0.15625 24.4567 0.15625 23.5938C0.15625 22.7308 0.855781 22.0312 1.71875 22.0312H78.2812C79.1441 22.0312 79.8438 22.7308 79.8438 23.5938C79.8438 24.4567 79.1441 25.1562 78.2812 25.1562Z" fill="#9FEDC2"/>
<ellipse cx="14.5" cy="8" rx="3.5" ry="6" fill="#72C899"/>
<ellipse cx="31.5" cy="8" rx="3.5" ry="6" fill="#72C899"/>
<ellipse cx="48.5" cy="8" rx="3.5" ry="6" fill="#72C899"/>
<ellipse cx="65.5" cy="8" rx="3.5" ry="6" fill="#72C899"/>
<path d="M65.7812 15.7812C63.1966 15.7812 61.0938 13.6784 61.0938 11.0938V4.84375C61.0938 2.25906 63.1966 0.15625 65.7812 0.15625C68.3713 0.15625 70.4688 2.25391 70.4688 4.84375V11.0938C70.4688 13.6784 68.3659 15.7812 65.7812 15.7812ZM65.7812 3.28125C64.9197 3.28125 64.2188 3.98219 64.2188 4.84375V11.0938C64.2188 11.9553 64.9197 12.6562 65.7812 12.6562C66.6428 12.6562 67.3438 11.9553 67.3438 11.0938V4.84375C67.3438 3.98141 66.6439 3.28125 65.7812 3.28125Z" fill="#9FEDC2"/>
<path d="M48.5938 15.7812C46.0091 15.7812 43.9062 13.6784 43.9062 11.0938V4.84375C43.9062 2.25906 46.0091 0.15625 48.5938 0.15625C51.1838 0.15625 53.2812 2.25391 53.2812 4.84375V11.0938C53.2812 13.6784 51.1784 15.7812 48.5938 15.7812ZM48.5938 3.28125C47.7322 3.28125 47.0312 3.98219 47.0312 4.84375V11.0938C47.0312 11.9553 47.7322 12.6562 48.5938 12.6562C49.4553 12.6562 50.1562 11.9553 50.1562 11.0938V4.84375C50.1562 3.98141 49.4564 3.28125 48.5938 3.28125Z" fill="#9FEDC2"/>
<path d="M31.4062 15.7812C28.8216 15.7812 26.7188 13.6784 26.7188 11.0938V4.84375C26.7188 2.25906 28.8216 0.15625 31.4062 0.15625C33.9963 0.15625 36.0938 2.25391 36.0938 4.84375V11.0938C36.0938 13.6784 33.9909 15.7812 31.4062 15.7812ZM31.4062 3.28125C30.5447 3.28125 29.8438 3.98219 29.8438 4.84375V11.0938C29.8438 11.9553 30.5447 12.6562 31.4062 12.6562C32.2678 12.6562 32.9688 11.9553 32.9688 11.0938V4.84375C32.9688 3.98141 32.2689 3.28125 31.4062 3.28125Z" fill="#9FEDC2"/>
<path d="M14.2188 15.7812C11.6341 15.7812 9.53125 13.6784 9.53125 11.0938V4.84375C9.53125 2.25906 11.6341 0.15625 14.2188 0.15625C16.8086 0.15625 18.9062 2.25391 18.9062 4.84375V11.0938C18.9062 13.6784 16.8034 15.7812 14.2188 15.7812ZM14.2188 3.28125C13.3572 3.28125 12.6562 3.98219 12.6562 4.84375V11.0938C12.6562 11.9553 13.3572 12.6562 14.2188 12.6562C15.0803 12.6562 15.7812 11.9553 15.7812 11.0938V4.84375C15.7812 3.98141 15.0814 3.28125 14.2188 3.28125Z" fill="#9FEDC2"/>
<rect x="13" y="32" width="7" height="7" fill="white"/>
<rect x="13" y="48" width="7" height="7" fill="white"/>
<rect x="13" y="63" width="7" height="7" fill="white"/>
<rect x="28" y="32" width="7" height="7" fill="white"/>
<rect x="28" y="48" width="7" height="7" fill="white"/>
<rect x="28" y="63" width="7" height="7" fill="white"/>
<rect x="44" y="32" width="7" height="7" fill="white"/>
<rect x="44" y="48" width="7" height="7" fill="white"/>
<rect x="44" y="63" width="7" height="7" fill="white"/>
<rect x="60" y="32" width="7" height="7" fill="white"/>
<rect x="60" y="48" width="7" height="7" fill="white"/>
<rect x="60" y="63" width="7" height="7" fill="white"/>
<path d="M20.4688 40.7812H12.6562C11.7933 40.7812 11.0938 40.0816 11.0938 39.2188V31.4062C11.0938 30.5433 11.7933 29.8438 12.6562 29.8438H20.4688C21.3316 29.8438 22.0312 30.5433 22.0312 31.4062V39.2188C22.0312 40.0816 21.3316 40.7812 20.4688 40.7812ZM14.2188 37.6562H18.9062V32.9688H14.2188V37.6562Z" fill="#9FEDC2"/>
<path d="M36.0938 40.7812H28.2812C27.4183 40.7812 26.7188 40.0816 26.7188 39.2188V31.4062C26.7188 30.5433 27.4183 29.8438 28.2812 29.8438H36.0938C36.9567 29.8438 37.6562 30.5433 37.6562 31.4062V39.2188C37.6562 40.0816 36.9567 40.7812 36.0938 40.7812ZM29.8438 37.6562H34.5312V32.9688H29.8438V37.6562Z" fill="#9FEDC2"/>
<path d="M51.7188 40.7812H43.9062C43.0434 40.7812 42.3438 40.0816 42.3438 39.2188V31.4062C42.3438 30.5433 43.0434 29.8438 43.9062 29.8438H51.7188C52.5816 29.8438 53.2812 30.5433 53.2812 31.4062V39.2188C53.2812 40.0816 52.5816 40.7812 51.7188 40.7812ZM45.4688 37.6562H50.1562V32.9688H45.4688V37.6562Z" fill="#9FEDC2"/>
<path d="M67.3438 40.7812H59.5312C58.6684 40.7812 57.9688 40.0816 57.9688 39.2188V31.4062C57.9688 30.5433 58.6684 29.8438 59.5312 29.8438H67.3438C68.2066 29.8438 68.9062 30.5433 68.9062 31.4062V39.2188C68.9062 40.0816 68.2066 40.7812 67.3438 40.7812ZM61.0938 37.6562H65.7812V32.9688H61.0938V37.6562Z" fill="#9FEDC2"/>
<path d="M51.7188 56.4062H43.9062C43.0434 56.4062 42.3438 55.7066 42.3438 54.8438V47.0312C42.3438 46.1684 43.0434 45.4688 43.9062 45.4688H51.7188C52.5816 45.4688 53.2812 46.1684 53.2812 47.0312V54.8438C53.2812 55.7066 52.5816 56.4062 51.7188 56.4062ZM45.4688 53.2812H50.1562V48.5938H45.4688V53.2812Z" fill="#9FEDC2"/>
<path d="M67.3438 56.4062H59.5312C58.6684 56.4062 57.9688 55.7066 57.9688 54.8438V47.0312C57.9688 46.1684 58.6684 45.4688 59.5312 45.4688H67.3438C68.2066 45.4688 68.9062 46.1684 68.9062 47.0312V54.8438C68.9062 55.7066 68.2066 56.4062 67.3438 56.4062ZM61.0938 53.2812H65.7812V48.5938H61.0938V53.2812Z" fill="#9FEDC2"/>
<path d="M51.7188 72.0312H43.9062C43.0434 72.0312 42.3438 71.3316 42.3438 70.4688V62.6562C42.3438 61.7934 43.0434 61.0938 43.9062 61.0938H51.7188C52.5816 61.0938 53.2812 61.7934 53.2812 62.6562V70.4688C53.2812 71.3316 52.5816 72.0312 51.7188 72.0312ZM45.4688 68.9062H50.1562V64.2188H45.4688V68.9062Z" fill="#9FEDC2"/>
<path d="M67.3438 72.0312H59.5312C58.6684 72.0312 57.9688 71.3316 57.9688 70.4688V62.6562C57.9688 61.7934 58.6684 61.0938 59.5312 61.0938H67.3438C68.2066 61.0938 68.9062 61.7934 68.9062 62.6562V70.4688C68.9062 71.3316 68.2066 72.0312 67.3438 72.0312ZM61.0938 68.9062H65.7812V64.2188H61.0938V68.9062Z" fill="#9FEDC2"/>
<path d="M20.4688 56.4062H12.6562C11.7933 56.4062 11.0938 55.7066 11.0938 54.8438V47.0312C11.0938 46.1684 11.7933 45.4688 12.6562 45.4688H20.4688C21.3316 45.4688 22.0312 46.1684 22.0312 47.0312V54.8438C22.0312 55.7066 21.3316 56.4062 20.4688 56.4062ZM14.2188 53.2812H18.9062V48.5938H14.2188V53.2812Z" fill="#9FEDC2"/>
<path d="M36.0938 56.4062H28.2812C27.4183 56.4062 26.7188 55.7066 26.7188 54.8438V47.0312C26.7188 46.1684 27.4183 45.4688 28.2812 45.4688H36.0938C36.9567 45.4688 37.6562 46.1684 37.6562 47.0312V54.8438C37.6562 55.7066 36.9567 56.4062 36.0938 56.4062ZM29.8438 53.2812H34.5312V48.5938H29.8438V53.2812Z" fill="#9FEDC2"/>
<path d="M20.4688 72.0312H12.6562C11.7933 72.0312 11.0938 71.3316 11.0938 70.4688V62.6562C11.0938 61.7934 11.7933 61.0938 12.6562 61.0938H20.4688C21.3316 61.0938 22.0312 61.7934 22.0312 62.6562V70.4688C22.0312 71.3316 21.3316 72.0312 20.4688 72.0312ZM14.2188 68.9062H18.9062V64.2188H14.2188V68.9062Z" fill="#9FEDC2"/>
<path d="M36.0938 72.0312H28.2812C27.4183 72.0312 26.7188 71.3316 26.7188 70.4688V62.6562C26.7188 61.7934 27.4183 61.0938 28.2812 61.0938H36.0938C36.9567 61.0938 37.6562 61.7934 37.6562 62.6562V70.4688C37.6562 71.3316 36.9567 72.0312 36.0938 72.0312ZM29.8438 68.9062H34.5312V64.2188H29.8438V68.9062Z" fill="#9FEDC2"/>
</g>
<defs>
<clipPath id="clip0_1_855">
<rect width="80" height="80" fill="white"/>
</clipPath>
</defs>
</svg>
