<svg width="16" height="16" viewBox="0 0 16 16" fill="none" xmlns="http://www.w3.org/2000/svg">
<path fill-rule="evenodd" clip-rule="evenodd" d="M8.33371 4.83423C9.23416 4.83458 10.1103 5.12664 10.8308 5.66668C11.5513 6.20672 12.0775 6.96566 12.3305 7.82983C12.5835 8.69401 12.5498 9.61689 12.2343 10.4603C11.9188 11.3036 11.3385 12.0221 10.5804 12.508C9.82236 12.9939 8.92725 13.2212 8.02919 13.1557C7.13112 13.0903 6.27844 12.7356 5.59885 12.1449C4.91926 11.5541 4.44935 10.7591 4.2595 9.8789C4.06965 8.99869 4.17008 8.08067 4.54575 7.26232C4.58663 7.16283 4.58746 7.05138 4.54804 6.95129C4.50862 6.8512 4.43202 6.77024 4.33427 6.72535C4.23652 6.68046 4.12519 6.67511 4.02358 6.71043C3.92198 6.74576 3.83798 6.81901 3.78915 6.91486C3.33837 7.89692 3.2179 8.9986 3.4458 10.0549C3.67369 11.1111 4.23767 12.0652 5.05326 12.774C5.86885 13.4828 6.89215 13.9084 7.96988 13.9868C9.0476 14.0653 10.1217 13.7924 11.0314 13.2092C11.941 12.6259 12.6372 11.7637 13.0157 10.7515C13.3942 9.73939 13.4345 8.63188 13.1307 7.59489C12.8269 6.55789 12.1953 5.64724 11.3305 4.99934C10.4657 4.35144 9.41429 4.00116 8.33371 4.00098V4.83423Z" fill="#6C757D"/>
<path d="M8.33357 6.05587V2.77952C8.33355 2.73994 8.32226 2.70118 8.30102 2.66779C8.27977 2.63439 8.24945 2.60774 8.2136 2.59095C8.17775 2.57416 8.13787 2.56794 8.09861 2.573C8.05935 2.57806 8.02235 2.59421 7.99194 2.61954L6.02546 4.25771C6.00202 4.27726 5.98316 4.30173 5.97021 4.32937C5.95727 4.35702 5.95056 4.38717 5.95056 4.4177C5.95056 4.44822 5.95727 4.47838 5.97021 4.50602C5.98316 4.53367 6.00202 4.55813 6.02546 4.57768L7.99194 6.21586C8.02235 6.24119 8.05935 6.25733 8.09861 6.26239C8.13787 6.26746 8.17775 6.26123 8.2136 6.24445C8.24945 6.22766 8.27977 6.20101 8.30102 6.16761C8.32226 6.13421 8.33355 6.09545 8.33357 6.05587Z" fill="#6C757D"/>
</svg>
