<svg width="45" height="44" viewBox="0 0 45 44" fill="none" xmlns="http://www.w3.org/2000/svg">
<rect x="1" y="0.5" width="43" height="43" rx="21.5" fill="white"/>
<path d="M28.1683 16.328C27.4312 15.5872 26.5532 14.9998 25.5855 14.6001C24.6179 14.2004 23.5799 13.9964 22.5322 14C18.1422 14 14.5643 17.56 14.5643 21.928C14.5643 23.328 14.9342 24.688 15.6256 25.888L14.7285 29.1653C14.6269 29.5364 14.965 29.8784 15.3373 29.781L18.7211 28.896C19.8869 29.528 21.1975 29.864 22.5322 29.864C26.9221 29.864 30.5 26.304 30.5 21.936C30.5 19.816 29.6719 17.824 28.1683 16.328ZM22.5322 28.52C21.3422 28.52 20.1764 28.2 19.1553 27.6L18.9141 27.456L16.4055 28.112L17.0729 25.68L16.9121 25.432C16.251 24.3816 15.8999 23.1674 15.899 21.928C15.899 18.296 18.8739 15.336 22.5241 15.336C24.293 15.336 25.9573 16.024 27.2035 17.272C27.8206 17.8832 28.3096 18.6102 28.6422 19.4108C28.9748 20.2114 29.1444 21.0697 29.1412 21.936C29.1573 25.568 26.1824 28.52 22.5322 28.52ZM26.1663 23.592C25.9653 23.496 24.9844 23.016 24.8075 22.944C24.6226 22.88 24.494 22.848 24.3573 23.04C24.2206 23.24 23.8427 23.688 23.7302 23.816C23.6176 23.952 23.497 23.968 23.296 23.864C23.095 23.768 22.4518 23.552 21.696 22.88C21.101 22.352 20.707 21.704 20.5864 21.504C20.4739 21.304 20.5704 21.2 20.6749 21.096C20.7633 21.008 20.8759 20.864 20.9724 20.752C21.0688 20.64 21.109 20.552 21.1734 20.424C21.2377 20.288 21.2055 20.176 21.1573 20.08C21.109 19.984 20.707 19.008 20.5462 18.608C20.3854 18.224 20.2166 18.272 20.096 18.264H19.71C19.5734 18.264 19.3643 18.312 19.1794 18.512C19.0025 18.712 18.4879 19.192 18.4879 20.168C18.4879 21.144 19.2035 22.088 19.3 22.216C19.3965 22.352 20.707 24.352 22.701 25.208C23.1754 25.416 23.5452 25.536 23.8347 25.624C24.309 25.776 24.7432 25.752 25.0889 25.704C25.4749 25.648 26.2709 25.224 26.4317 24.76C26.6005 24.296 26.6005 23.904 26.5442 23.816C26.4879 23.728 26.3673 23.688 26.1663 23.592Z" fill="#198754"/>
<rect x="1" y="0.5" width="43" height="43" rx="21.5" stroke="#198754"/>
</svg>
