<svg width="90" height="90" viewBox="0 0 90 90" fill="none" xmlns="http://www.w3.org/2000/svg">
<circle cx="45" cy="45" r="45" fill="white"/>
<path fill-rule="evenodd" clip-rule="evenodd" d="M39.6157 44.2043H44.0807V40.7773H45.4174V49.4799H44.0807V45.3561H39.6157V49.4799H38.2648V40.7773H39.6157V44.2043ZM28.5383 40.7346C29.4199 40.7346 30.4153 40.7346 30.9059 40.7488C30.926 40.7488 30.9501 40.7486 30.9779 40.7484C31.6401 40.742 34.3961 40.7156 34.3756 43.3084C34.3898 45.7045 32.3137 46.1027 31.5174 46.1169C31.3074 46.1221 31.0789 46.1293 30.8571 46.1363C30.4782 46.1482 30.1187 46.1596 29.9034 46.1596V49.4728H28.5383V40.7346ZM18.3212 49.4728L18.307 40.7346H23.803C23.803 40.7346 23.7888 41.211 23.803 41.9007H19.6863V44.2825H22.6014C22.5914 44.6189 22.5955 44.8986 22.5988 45.1215C22.6002 45.2143 22.6014 45.2972 22.6014 45.3703H19.6863V48.3352H23.803V49.4728H18.3212ZM13.3442 42.2988C12.2279 41.3816 10.3367 41.4385 10.3367 42.8676C10.3367 43.5781 11.0476 43.9479 11.855 44.3679C12.9464 44.9356 14.2141 45.595 14.1405 47.3114C14.0481 49.6861 11.197 50.2407 9 49.0889C9.19908 48.6765 9.39816 48.2641 9.51903 47.9228C11.1828 48.9325 12.6261 48.4703 12.8536 47.6598C13.1593 46.6085 12.3193 46.2045 11.3479 45.7374C10.2631 45.2157 9.01422 44.6151 9.01422 42.9458C9.01422 41.6234 10.5002 39.5544 13.7566 41.1186C13.7566 41.1186 13.7281 41.1968 13.3442 42.2988ZM64.8604 40.7672C65.6395 40.7777 67.7735 40.8065 67.9561 43.1876C68.0628 44.6309 67.2025 45.2637 66.463 45.5339L69.2146 49.4586H67.558L65.0695 45.7614C64.3727 45.7898 64.2234 45.7898 63.7612 45.7898V49.4586H62.3961V40.7346C63.2422 40.7346 64.2234 40.7488 64.6855 40.7631C64.7313 40.7654 64.7904 40.7662 64.8604 40.7672ZM63.7612 44.7518C64.0669 44.766 64.3016 44.766 64.6073 44.766C64.6166 44.766 64.627 44.766 64.6383 44.7661C65.0756 44.7674 66.9559 44.7731 66.7687 43.1236C66.6208 41.7719 65.01 41.7941 64.5471 41.8005C64.5206 41.8008 64.4978 41.8011 64.4793 41.8011H63.7612V44.7518ZM75.3861 40.7488H76.9645L80.1 49.5013H78.6993C78.6993 49.5013 78.3936 48.6125 77.9812 47.4465L74.4475 47.4607C74.4475 47.4607 74.3053 47.9086 73.8787 49.487H72.5278L75.3861 40.7488ZM76.1397 42.1424L74.7604 46.4582L77.5973 46.444L76.1539 42.1424H76.1397ZM49.2995 45.1073C49.2995 42.5548 51.1125 40.5 53.8925 40.5C56.6726 40.5 58.4856 42.5548 58.4856 45.1073C58.4856 47.6598 56.6726 49.7146 53.8925 49.7146C51.1125 49.7146 49.2995 47.6598 49.2995 45.1073ZM50.7001 45.1073C50.7001 46.9701 51.852 48.4561 53.8925 48.4561C55.9331 48.4561 57.0849 46.9488 57.0849 45.1073C57.0849 43.2445 55.9189 41.7585 53.8925 41.7585C51.852 41.7585 50.7001 43.2658 50.7001 45.1073ZM29.9248 41.8651H30.6927C30.7147 41.8651 30.7433 41.8645 30.7778 41.8638C31.3006 41.8534 33.1563 41.8165 33.2096 43.344C33.3021 44.9366 31.6383 45.0148 30.8278 45.0148H29.9248V41.8651Z" fill="black"/>
</svg>
