<svg width="132" height="132" viewBox="0 0 132 132" fill="none" xmlns="http://www.w3.org/2000/svg">
<rect width="132" height="132" rx="18" fill="#2969FF"/>
<path d="M88.2291 33.6V37.6893C82.1126 32.866 74.3884 30 66 30C46.2175 30 30.1049 46.0777 30 65.8252C30 65.8951 30 65.9301 30 66C30 85.8524 46.1476 102 66 102C74.3884 102 82.1126 99.134 88.2291 94.3107V100.986H102V66.035V30.4194L88.2291 33.6ZM66 88.1592C53.767 88.1592 43.8408 78.1981 43.8408 66C43.8408 65.9301 43.8408 65.8951 43.8408 65.8252C43.9107 53.6621 53.8369 43.8058 66 43.8058C78.1631 43.8058 88.0893 53.6621 88.1592 65.8252C88.1592 65.9301 88.1592 65.965 88.1592 66C88.1592 78.233 78.233 88.1592 66 88.1592Z" fill="white"/>
</svg>
