<svg width="90" height="90" viewBox="0 0 90 90" fill="none" xmlns="http://www.w3.org/2000/svg">
<circle cx="45" cy="45" r="45" fill="white"/>
<path d="M41.3327 50.1475L39.3594 42.4305L37.416 50.1475H34.8746L31.6455 38.901H34.3364L36.3097 47.0367L38.4624 38.901H40.346L42.4689 47.0367L44.4422 38.901H47.1331L43.9339 50.1475H41.3327Z" fill="#85B553"/>
<path d="M46.0566 46.0794C46.0566 43.7165 47.8207 41.8022 50.2724 41.8022C52.7241 41.8022 54.3386 43.6267 54.3386 46.2589V46.7674H48.299C48.4485 47.7544 49.2558 48.5919 50.6311 48.5919C51.3188 48.5919 52.2756 48.2928 52.7839 47.8143L53.7406 49.2201C52.9334 49.9678 51.6477 50.3567 50.392 50.3567C47.9104 50.3567 46.0566 48.6817 46.0566 46.0794ZM50.2724 43.5669C48.9269 43.5669 48.3588 44.4942 48.2691 45.3017H52.2756C52.2158 44.5241 51.6776 43.5669 50.2724 43.5669Z" fill="#85B553"/>
<path d="M54.7871 50.1475V38.9011H56.9398V50.1475H54.7871Z" fill="#85B553"/>
<path d="M57.8369 50.1475V38.9011H59.9896V50.1475H57.8369Z" fill="#85B553"/>
<path d="M60.6777 48.981C60.6777 48.2332 61.3056 47.6051 62.0531 47.6051C62.8005 47.6051 63.4284 48.2332 63.4284 48.981C63.4284 49.7288 62.8005 50.3569 62.0531 50.3569C61.3056 50.3569 60.6777 49.7288 60.6777 48.981Z" fill="#85B553"/>
<path d="M63.3677 46.0794C63.3677 43.5968 65.1915 41.8022 67.6731 41.8022C69.3474 41.8022 70.364 42.52 70.9022 43.2678L69.4969 44.5839C69.1082 44.0156 68.5103 43.7165 67.7628 43.7165C66.4771 43.7165 65.5503 44.6736 65.5503 46.0794C65.5503 47.4852 66.4472 48.4424 67.7628 48.4424C68.5103 48.4424 69.1082 48.1134 69.4969 47.5451L70.9022 48.8611C70.364 49.6089 69.3474 50.3567 67.6731 50.3567C65.1915 50.3567 63.3677 48.5919 63.3677 46.0794Z" fill="#85B553"/>
<path d="M76.0742 50.1473V49.2799C75.5061 49.9678 74.5493 50.3567 73.5029 50.3567C72.2172 50.3567 70.6924 49.4893 70.6924 47.6647C70.6924 45.7504 72.2172 45.0325 73.5029 45.0325C74.6091 45.0325 75.536 45.3915 76.0742 46.0196V45.0026C76.0742 44.1651 75.3566 43.6267 74.2802 43.6267C73.4132 43.6267 72.6059 43.9558 71.9481 44.5839L71.111 43.0883C72.0976 42.191 73.3833 41.8022 74.6689 41.8022C76.5525 41.8022 78.2568 42.55 78.2568 44.883V50.1473H76.0742ZM76.0742 48.2031V47.1861C75.7154 46.7076 75.0576 46.4683 74.34 46.4683C73.5029 46.4683 72.8152 46.9169 72.8152 47.6946C72.8152 48.4723 73.5029 48.9209 74.34 48.9209C75.0576 48.9209 75.7453 48.6817 76.0742 48.2031Z" fill="#85B553"/>
<path d="M29.8517 44.6442C29.8517 39.8884 25.9947 36 21.2109 36C16.4271 36 12.6001 39.8884 12.6001 44.6442C12.6001 49.2505 16.2178 53.0491 20.7924 53.2585V53.2286V52.4509V51.434C20.9418 51.4639 21.1212 51.4938 21.3006 51.4938C21.5099 51.4938 21.6893 51.4639 21.8986 51.404V52.4509V53.2585C26.3535 52.9295 29.8517 49.1906 29.8517 44.6442ZM21.3305 38.4228L23.1245 40.0978L21.3305 41.713L19.5366 40.1576L21.3305 38.4228ZM21.2109 50.7759C19.3273 50.3871 17.9819 49.4598 17.2344 48.0241C16.8158 47.2165 16.5766 46.2295 16.5168 45.0929C16.4869 44.1656 16.5766 43.1786 16.7859 42.1018C17.0849 40.6063 17.5334 39.4098 17.7128 38.9911L21.5398 42.4009C22.4069 43.1786 22.9451 44.1058 23.1245 45.1527C23.2441 45.9902 23.1544 46.9174 22.8255 47.8746C22.2873 49.3402 21.4202 50.5067 21.2109 50.7759ZM26.0844 45.063C26.0545 46.1996 25.8153 47.1866 25.3968 47.9942C24.7091 49.3402 23.3935 50.3273 21.6594 50.7759C22.0182 50.2973 22.8255 49.1308 23.2441 47.8148C23.5729 46.8277 23.6626 45.8705 23.5131 45.033C23.3337 43.9563 22.7657 42.9991 21.8687 42.2214L21.5697 41.9522C23.8719 39.8884 24.6493 39.2005 24.8885 38.9911C25.0679 39.4098 25.5164 40.6063 25.8153 42.1018C26.0246 43.1487 26.1143 44.1656 26.0844 45.063Z" fill="#85B553"/>
</svg>
