<svg width="90" height="90" viewBox="0 0 90 90" fill="none" xmlns="http://www.w3.org/2000/svg">
<circle cx="45" cy="45" r="45" fill="white"/>
<path d="M12.3958 55.5265V60.1777H13.5755C14.8593 60.1777 15.8655 59.1364 15.8308 57.8521C15.8655 56.6025 14.894 55.5612 13.6449 55.5265C13.6102 55.5265 13.5755 55.5265 13.5755 55.5265H12.3958ZM13.5755 54.0687C15.7961 54.0687 17.4615 55.7348 17.4615 57.8521C17.4615 59.9694 15.7961 61.6355 13.5755 61.6355H10.9733C10.8692 61.6355 10.7998 61.5661 10.7998 61.462V54.277C10.7998 54.1728 10.8692 54.1034 10.9733 54.1034L13.5755 54.0687Z" fill="#FF3008"/>
<path d="M23.2211 60.3517C24.609 60.3517 25.7192 59.2409 25.7192 57.8525C25.7192 56.4641 24.609 55.3534 23.2211 55.3534C21.8333 55.3534 20.723 56.4641 20.723 57.8525C20.723 59.2062 21.8333 60.3517 23.2211 60.3517ZM23.2211 53.8955C25.5458 53.8955 27.3153 55.6658 27.3153 57.8525C27.3153 60.0393 25.5458 61.8095 23.2211 61.8095C20.8965 61.8095 19.127 60.0393 19.127 57.8525C19.127 55.6658 20.8965 53.8955 23.2211 53.8955Z" fill="#FF3008"/>
<path d="M32.9706 60.3517C34.3585 60.3517 35.4688 59.2409 35.4688 57.8525C35.4688 56.4641 34.3585 55.3534 32.9706 55.3534C31.5828 55.3534 30.4725 56.4641 30.4725 57.8525C30.5072 59.2062 31.6175 60.3517 32.9706 60.3517ZM32.9706 53.8955C35.2953 53.8955 37.0648 55.6658 37.0648 57.8525C37.0648 60.0393 35.2953 61.8095 32.9706 61.8095C30.646 61.8095 28.8765 60.0393 28.8765 57.8525C28.8765 55.6658 30.646 53.8955 32.9706 53.8955Z" fill="#FF3008"/>
<path d="M42.5471 55.5271H40.8817V57.5403H42.5471C43.1023 57.575 43.5533 57.1585 43.588 56.6031V56.5684C43.6227 56.013 43.1717 55.5618 42.6165 55.5271C42.5818 55.5271 42.5818 55.5271 42.5471 55.5271ZM39.251 54.2428C39.251 54.1387 39.3204 54.0692 39.4245 54.0692H42.5818C44.0738 54.0692 45.184 55.18 45.184 56.5684C45.184 57.5056 44.6636 58.3733 43.8309 58.7898L45.2881 61.3584C45.3575 61.4278 45.3228 61.5667 45.2187 61.6361C45.1841 61.6708 45.1493 61.6708 45.1147 61.6708H43.8309C43.7615 61.6708 43.6921 61.6361 43.6574 61.5667L42.2696 59.0328H40.847V61.4972C40.847 61.6014 40.7776 61.6708 40.6735 61.6708H39.4592C39.3551 61.6708 39.2857 61.6014 39.2857 61.4972L39.251 54.2428Z" fill="#FF3008"/>
<path d="M49.4173 55.5616V60.2128H50.597C51.8808 60.2128 52.887 59.1715 52.8523 57.8872C52.887 56.6377 51.9155 55.5964 50.6664 55.5616C50.6317 55.5616 50.597 55.5616 50.597 55.5616H49.4173ZM50.597 54.1038C52.8176 54.1038 54.483 55.7699 54.483 57.8872C54.483 60.0046 52.8176 61.6707 50.597 61.6707H47.9948C47.8907 61.6707 47.8213 61.6012 47.8213 61.4971V54.3121C47.8213 54.208 47.8907 54.1385 47.9948 54.1385L50.597 54.1038Z" fill="#FF3008"/>
<path d="M59.4445 55.9436L58.5424 58.4428H60.3813L59.4445 55.9436ZM57.9872 59.8312L57.3974 61.4973C57.3627 61.5667 57.2933 61.6361 57.2239 61.6361H55.9054C55.8014 61.6361 55.6973 61.5667 55.6973 61.4626C55.6973 61.4279 55.6973 61.3932 55.732 61.3585L58.5424 54.1734C58.5771 54.104 58.6465 54.0346 58.7158 54.0346H60.1731C60.2425 54.0346 60.3466 54.0693 60.3466 54.1734L63.157 61.3585C63.1917 61.4626 63.157 61.5667 63.0529 61.6014C63.0182 61.6014 62.9835 61.6361 62.9488 61.6361H61.6303C61.5609 61.6361 61.4569 61.6014 61.4569 61.4973L60.867 59.8312H57.9872Z" fill="#FF3008"/>
<path d="M64.7177 56.117C64.7177 54.9368 65.7586 53.8955 67.3546 53.8955C68.2221 53.8955 69.0548 54.2079 69.714 54.798C69.7834 54.8674 69.7834 55.0063 69.714 55.0757L68.9854 55.8046C68.916 55.874 68.8119 55.874 68.7078 55.8046C68.3608 55.4922 67.9098 55.3187 67.4587 55.3187C66.7995 55.3187 66.3138 55.7005 66.3138 56.117C66.3138 57.5401 70.1651 56.7071 70.1651 59.4145C70.1651 60.7682 69.1242 61.8095 67.2853 61.8095C66.2791 61.8095 65.2729 61.4277 64.5442 60.6988C64.4748 60.6293 64.4748 60.5252 64.5442 60.4211L65.2382 59.7269C65.3076 59.6574 65.4117 59.6574 65.5157 59.7269C65.9668 60.1434 66.5566 60.3864 67.1812 60.3864C67.9792 60.3864 68.5343 59.9698 68.5343 59.4145C68.5343 58.0261 64.683 58.8244 64.7177 56.117Z" fill="#FF3008"/>
<path d="M77.1392 54.2427V57.0889H73.8777V54.2774C73.8777 54.1733 73.8083 54.0691 73.7043 54.0691H72.4899C72.3858 54.0691 72.3164 54.1385 72.3164 54.2427V61.4277C72.3164 61.5318 72.3858 61.636 72.4899 61.636H73.7043C73.8083 61.636 73.8777 61.5665 73.8777 61.4624V58.5815H77.1392V61.4624C77.1392 61.5665 77.2086 61.6707 77.3127 61.6707C77.3127 61.6707 77.3127 61.6707 77.3474 61.6707H78.5617C78.6658 61.6707 78.7699 61.6012 78.7699 61.4971C78.7699 61.4971 78.7699 61.4971 78.7699 61.4624V54.2774C78.7699 54.1733 78.7005 54.0691 78.5964 54.0691C78.5964 54.0691 78.5964 54.0691 78.5617 54.0691H77.3474C77.2086 54.0344 77.1392 54.1385 77.1392 54.2427Z" fill="#FF3008"/>
<path d="M57.1892 32.9311C55.836 30.3625 53.1644 28.7658 50.2846 28.8005H28.3913C27.9749 28.8005 27.6279 29.1476 27.6279 29.5642C27.6279 29.7724 27.6973 29.946 27.8361 30.0848L32.6242 34.8748C33.0406 35.2914 33.6304 35.5343 34.2202 35.5343H49.6601C50.7704 35.5343 51.6725 36.4021 51.6725 37.5128C51.6725 38.6235 50.8051 39.526 49.6948 39.526H39.043C38.6267 39.526 38.2797 39.8731 38.2797 40.2896C38.2797 40.4979 38.3491 40.6714 38.4879 40.8103L43.276 45.6003C43.6923 46.0168 44.2822 46.2598 44.872 46.2598H49.6948C55.9748 46.2598 60.6935 39.5607 57.1892 32.9311Z" fill="#FF3008"/>
</svg>
