<svg width="90" height="90" viewBox="0 0 90 90" fill="none" xmlns="http://www.w3.org/2000/svg">
<circle cx="45" cy="45" r="45" fill="white"/>
<path fill-rule="evenodd" clip-rule="evenodd" d="M22.5 63.2787H68.0939V27H22.5V63.2787Z" fill="#FCFCFC"/>
<path fill-rule="evenodd" clip-rule="evenodd" d="M64.7972 62.7182H64.6324V61.5309H64.3027V61.3989H65.0939V61.5309H64.7643V62.7182H64.7972ZM65.5225 61.3L66.017 62.4213L66.5115 61.3L66.7753 62.7182H66.6105L66.4456 61.8277L66.017 62.7841L65.5885 61.8277L65.4236 62.7182H65.2588L65.5225 61.3Z" fill="#050505"/>
<path fill-rule="evenodd" clip-rule="evenodd" d="M66.5772 28.5495V53.4499L63.3794 52.2956C62.786 52.0317 62.6211 51.537 62.8189 50.8115L64.3684 44.842L59.1596 45.7324C58.5002 45.8644 58.0716 45.6335 57.8738 45.0728L56.9507 42.5663L52.7309 47.5134C52.0716 48.2719 51.1485 48.0741 51.3793 46.7878L53.3573 36.0691L50.2584 37.7841C49.7309 38.0809 49.1375 38.015 48.8408 37.4873L45.3133 30.7922L41.7858 37.5532C41.4891 38.048 40.8956 38.1139 40.3682 37.8501L37.2692 36.1351L39.2473 46.8538C39.478 48.14 38.555 48.3379 37.8956 47.5794L33.6758 42.6323L32.7527 45.1388C32.5549 45.6995 32.1263 45.9303 31.467 45.7984L26.2581 44.9079L27.8076 50.8774C28.0054 51.603 27.8406 52.1307 27.2471 52.3615L24.0493 53.5159V28.5495H66.5772Z" fill="#EE1122"/>
<path fill-rule="evenodd" clip-rule="evenodd" d="M25.4999 58.5292V60.3102H24.0493V54.9343H25.8296C26.7197 54.9343 27.8076 55.3301 27.8076 56.7483C27.8076 58.1334 26.9175 58.5622 25.9285 58.5622H25.4999V58.5292ZM25.4999 57.4409H25.6647C26.2252 57.4409 26.423 57.111 26.423 56.7483C26.423 56.3855 26.2252 56.0557 25.6647 56.0227H25.4999V57.4409ZM34.2033 54.9343H27.9724V60.3432H30.7747V59.1229H29.423V58.1334H30.6758V56.9791H29.423V56.0886H31.7637V60.3432H33.2142V56.0557H34.1703L34.2033 54.9343ZM52.0056 57.6717L53.0276 60.3102H54.4782V54.9343H53.0936V57.5728L52.0716 54.9343H50.621V60.3432H52.0056V57.6717ZM35.8516 57.9356V60.3102H34.4011V54.9343H36.1813C37.4011 54.9343 38.2912 55.495 38.1923 56.7812C38.1593 57.276 37.8297 57.7377 37.2363 57.9356L38.3242 60.3432H36.8407L35.8516 57.9356ZM35.8516 57.4409H36.0165C36.5439 57.4409 36.7417 57.0781 36.7417 56.6823C36.7417 56.2865 36.5439 55.9237 36.0165 55.9237H35.8516V57.4409Z" fill="#050505"/>
<path fill-rule="evenodd" clip-rule="evenodd" d="M43.1375 57.0126H42.3792C42.2144 55.7263 41.588 54.8029 40.3023 54.8029C38.8517 54.8029 38.1924 56.0561 38.1924 57.6392C38.1924 59.2223 38.8188 60.4755 40.3023 60.4755C41.621 60.4755 42.2803 59.4531 42.3792 58.0679H43.1045V57.0126H43.1375ZM40.3682 59.2223C39.7748 59.2223 39.7089 58.4307 39.7089 57.6062C39.7089 56.7817 39.7748 55.9902 40.3682 55.9902C40.9287 55.9902 41.0276 56.8147 41.0276 57.6062C40.9946 58.3977 40.9287 59.2223 40.3682 59.2223ZM58.9948 54.9348H60.6761C62.4234 54.9348 62.9179 56.0561 62.9179 57.6392C62.9179 58.2328 62.7531 59.3542 62.0608 59.9148C61.5003 60.3766 60.9399 60.3436 60.2476 60.3436H59.0278V54.9348H58.9948ZM60.4124 59.0574H60.6432C61.3025 59.0574 61.4344 58.5297 61.4344 57.6062C61.4344 56.6168 61.2695 56.1221 60.6432 56.1221H60.4124V59.0574ZM57.4453 60.3436H58.8629L57.5772 54.9348H55.8959L54.6101 60.3436H56.0277L56.1926 59.4531H57.2805L57.4453 60.3436ZM56.3574 58.4637L56.72 56.4189L57.0827 58.4637H56.3574ZM47.687 60.3436L47.8518 59.4531H48.9397L49.1046 60.3436H50.5222L49.2365 54.9348H47.5551L46.5661 59.1233H46.1705C45.1815 59.1233 44.9837 58.3977 44.9837 57.5732C44.9837 56.7487 45.1815 56.0891 45.8738 55.9902C46.1046 55.9572 46.4672 56.0231 46.665 56.1221V54.9678C46.4342 54.8688 46.1046 54.8358 45.8408 54.8358C44.8188 54.8358 43.5661 55.3965 43.5661 57.5732C43.5661 59.4201 44.5551 60.3436 45.8738 60.3436H47.687ZM48.0167 58.4637L48.3793 56.4189L48.7419 58.4637H48.0167ZM65.3575 60.3436H66.7751L65.4894 54.9348H63.808L62.5223 60.3436H63.9399L64.1047 59.4531H65.1927L65.3575 60.3436ZM64.3025 58.4637L64.6652 56.4189L65.0278 58.4637H64.3025Z" fill="#050505"/>
</svg>
