{
  "type": "json",
  "ddoc": "apps-index",
  "name": "user-apps",
  "index": {
    "partial_filter_selector": {
      "type": {
        "$in": [
          "steam.user.games",
          "steam.user.stats",
          "user.app"
        ]
      }
    },
    "fields": [
      "updatedAt",
      "meta.steamid"
    ]
  }
}
