[
  {
    "valid_regions": [
      "AT-03-01",
      "AT-03-02",
      "AT-03-06",
      "AT-03-04"
    ],
    "danger_main": [
      {
        "main_value": 2,
        "valid_elevation": null
      }
    ],
    "dangerpattern": [],
    "problem_list": [
      {
        "problem_type": "wet snow",
        "aspect": [
          "N",
          "NE",
          "E",
          "SE",
          "S",
          "SW",
          "W",
          "NW"
        ],
        "valid_elevation": null
      },
      {
        "problem_type": "gliding snow",
        "aspect": [
          "E",
          "SE",
          "S",
          "SW"
        ],
        "valid_elevation": null
      }
    ],
    "report_texts": null,
    "report_id": "RID697RGR1",
    "rep_date": "2021-03-25T17:18:32+00:00",
    "validity_begin": "2021-03-25T17:18:32+00:00",
    "validity_end": "2021-03-26T18:00:00+00:00"
  },
  {
    "valid_regions": [
      "AT-03-03",
      "AT-03-05"
    ],
    "danger_main": [
      {
        "main_value": 1,
        "valid_elevation": null
      }
    ],
    "dangerpattern": [],
    "problem_list": [
      {
        "problem_type": "wet snow",
        "aspect": [
          "N",
          "NE",
          "E",
          "SE",
          "S",
          "SW",
          "W",
          "NW"
        ],
        "valid_elevation": null
      }
    ],
    "report_texts": null,
    "report_id": "RID697RGR2",
    "rep_date": "2021-03-25T17:18:32+00:00",
    "validity_begin": "2021-03-25T17:18:32+00:00",
    "validity_end": "2021-03-26T18:00:00+00:00"
  }
]