[
  {
    "valid_regions": [
      "AT-06-02",
      "AT-06-01"
    ],
    "danger_main": [
      {
        "main_value": 3,
        "valid_elevation": null
      }
    ],
    "dangerpattern": [],
    "problem_list": [
      {
        "problem_type": "drifting snow",
        "aspect": [
          "NE",
          "E",
          "SE",
          "S"
        ],
        "valid_elevation": null
      },
      {
        "problem_type": "wet snow",
        "aspect": [
          "N",
          "NE",
          "E",
          "SE",
          "S",
          "SW",
          "W",
          "NW"
        ],
        "valid_elevation": null
      }
    ],
    "report_texts": null,
    "report_id": "RID280RGR1",
    "rep_date": "2021-01-27T17:00:00+00:00",
    "validity_begin": "2021-01-27T23:00:00+00:00",
    "validity_end": "2021-01-28T11:00:00+00:00"
  },
  {
    "valid_regions": [
      "AT-06-02",
      "AT-06-01"
    ],
    "danger_main": [
      {
        "main_value": 4,
        "valid_elevation": null
      }
    ],
    "dangerpattern": [],
    "problem_list": [
      {
        "problem_type": "drifting snow",
        "aspect": [
          "NE",
          "E",
          "SE",
          "S"
        ],
        "valid_elevation": null
      },
      {
        "problem_type": "wet snow",
        "aspect": [
          "N",
          "NE",
          "E",
          "SE",
          "S",
          "SW",
          "W",
          "NW"
        ],
        "valid_elevation": null
      }
    ],
    "report_texts": null,
    "report_id": "RID280RGR1_PM",
    "rep_date": "2021-01-27T17:00:00+00:00",
    "validity_begin": "2021-01-28T11:00:00+00:00",
    "validity_end": "2021-01-28T23:00:00+00:00",
    "predecessor_id": "RID280RGR1"
  },
  {
    "valid_regions": [
      "AT-06-04",
      "AT-06-05",
      "AT-06-06",
      "AT-06-03",
      "AT-06-10",
      "AT-06-11"
    ],
    "danger_main": [
      {
        "main_value": 3,
        "valid_elevation": null
      }
    ],
    "dangerpattern": [],
    "problem_list": [
      {
        "problem_type": "drifting snow",
        "aspect": [
          "NE",
          "E",
          "SE",
          "S"
        ],
        "valid_elevation": null
      },
      {
        "problem_type": "wet snow",
        "aspect": [
          "N",
          "NE",
          "E",
          "SE",
          "S",
          "SW",
          "W",
          "NW"
        ],
        "valid_elevation": null
      }
    ],
    "report_texts": null,
    "report_id": "RID280RGR2",
    "rep_date": "2021-01-27T17:00:00+00:00",
    "validity_begin": "2021-01-27T23:00:00+00:00",
    "validity_end": "2021-01-28T23:00:00+00:00"
  },
  {
    "valid_regions": [
      "AT-06-18",
      "AT-06-07",
      "AT-06-17",
      "AT-06-08",
      "AT-06-09"
    ],
    "danger_main": [
      {
        "main_value": 3,
        "valid_elevation": ">Treeline"
      },
      {
        "main_value": 2,
        "valid_elevation": "<Treeline"
      }
    ],
    "dangerpattern": [],
    "problem_list": [
      {
        "problem_type": "drifting snow",
        "aspect": [
          "NE",
          "E",
          "SE",
          "S"
        ],
        "valid_elevation": null
      },
      {
        "problem_type": "wet snow",
        "aspect": [
          "N",
          "NE",
          "E",
          "SE",
          "S",
          "SW",
          "W",
          "NW"
        ],
        "valid_elevation": null
      }
    ],
    "report_texts": null,
    "report_id": "RID280RGR3",
    "rep_date": "2021-01-27T17:00:00+00:00",
    "validity_begin": "2021-01-27T23:00:00+00:00",
    "validity_end": "2021-01-28T23:00:00+00:00"
  },
  {
    "valid_regions": [
      "AT-06-12",
      "AT-06-13",
      "AT-06-14",
      "AT-06-15",
      "AT-06-16"
    ],
    "danger_main": [
      {
        "main_value": 2,
        "valid_elevation": ">Treeline"
      },
      {
        "main_value": 1,
        "valid_elevation": "<Treeline"
      }
    ],
    "dangerpattern": [],
    "problem_list": [
      {
        "problem_type": "drifting snow",
        "aspect": [
          "NE",
          "E",
          "SE",
          "S"
        ],
        "valid_elevation": null
      },
      {
        "problem_type": "wet snow",
        "aspect": [
          "N",
          "NE",
          "E",
          "SE",
          "S",
          "SW",
          "W",
          "NW"
        ],
        "valid_elevation": null
      }
    ],
    "report_texts": null,
    "report_id": "RID280RGR4",
    "rep_date": "2021-01-27T17:00:00+00:00",
    "validity_begin": "2021-01-27T23:00:00+00:00",
    "validity_end": "2021-01-28T23:00:00+00:00"
  }
]