[
  {
    "valid_regions": [
      "AT-03-06",
      "AT-03-04",
      "AT-03-01"
    ],
    "danger_main": [
      {
        "main_value": 3,
        "valid_elevation": ">1600"
      },
      {
        "main_value": 2,
        "valid_elevation": "<1600"
      }
    ],
    "dangerpattern": [],
    "problem_list": [
      {
        "problem_type": "drifting snow",
        "aspect": [
          "N",
          "NE",
          "E",
          "SE",
          "S"
        ],
        "valid_elevation": null
      },
      {
        "problem_type": "gliding snow",
        "aspect": [
          "N",
          "NE",
          "E",
          "SE",
          "S",
          "SW",
          "W",
          "NW"
        ],
        "valid_elevation": null
      }
    ],
    "report_texts": null,
    "report_id": "RID298RGR1",
    "rep_date": "2021-01-29T17:00:00+00:00",
    "validity_begin": "2021-01-29T23:00:00+00:00",
    "validity_end": "2021-01-30T23:00:00+00:00"
  },
  {
    "valid_regions": [
      "AT-03-02",
      "AT-03-03"
    ],
    "danger_main": [
      {
        "main_value": 1,
        "valid_elevation": null
      }
    ],
    "dangerpattern": [],
    "problem_list": [
      {
        "problem_type": "gliding snow",
        "aspect": [
          "N",
          "NE",
          "E",
          "SE",
          "S",
          "SW",
          "W",
          "NW"
        ],
        "valid_elevation": null
      }
    ],
    "report_texts": null,
    "report_id": "RID298RGR2",
    "rep_date": "2021-01-29T17:00:00+00:00",
    "validity_begin": "2021-01-29T23:00:00+00:00",
    "validity_end": "2021-01-30T23:00:00+00:00"
  },
  {
    "valid_regions": [
      "AT-03-05"
    ],
    "danger_main": [
      {
        "main_value": 2,
        "valid_elevation": null
      },
      {
        "main_value": 1,
        "valid_elevation": null
      }
    ],
    "dangerpattern": [],
    "problem_list": [
      {
        "problem_type": "drifting snow",
        "aspect": [
          "N",
          "NE",
          "E",
          "SE",
          "S"
        ],
        "valid_elevation": null
      },
      {
        "problem_type": "gliding snow",
        "aspect": [
          "N",
          "NE",
          "E",
          "SE",
          "S",
          "SW",
          "W",
          "NW"
        ],
        "valid_elevation": null
      }
    ],
    "report_texts": null,
    "report_id": "RID298RGR3",
    "rep_date": "2021-01-29T17:00:00+00:00",
    "validity_begin": "2021-01-29T23:00:00+00:00",
    "validity_end": "2021-01-30T23:00:00+00:00"
  }
]