[
  {
    "valid_regions": [
      "AT-03-01",
      "AT-03-06",
      "AT-03-04",
      "AT-03-05"
    ],
    "danger_main": [
      {
        "main_value": 1,
        "valid_elevation": null
      }
    ],
    "dangerpattern": [],
    "problem_list": [
      {
        "problem_type": "drifting snow",
        "aspect": [
          "N",
          "NE",
          "E",
          "SE",
          "S"
        ],
        "valid_elevation": null
      }
    ],
    "report_texts": null,
    "report_id": "RID577RGR1",
    "rep_date": "2021-03-09T17:00:00+00:00",
    "validity_begin": "2021-03-09T23:00:00+00:00",
    "validity_end": "2021-03-10T23:00:00+00:00"
  }
]