Date,Daytime,Subregion,DangerRatingAbove,DangerRatingBelow,DangerRatingElevation
07.12.2012,AM,BYALL,3,2,treeline
07.12.2012,AM,BYAMM,3,2,treeline
07.12.2012,AM,BYWFK,3,2,treeline
07.12.2012,AM,BYBVA,2,1,treeline
07.12.2012,AM,BYCHG,2,1,treeline
07.12.2012,AM,BYBGD,2,1,treeline
08.12.2012,AM,BYALL,2,2,nan
08.12.2012,AM,BYAMM,2,1,treeline
08.12.2012,AM,BYWFK,2,1,treeline
08.12.2012,AM,BYBVA,2,1,treeline
08.12.2012,AM,BYCHG,2,1,treeline
08.12.2012,AM,BYBGD,2,1,treeline
09.12.2012,AM,BYALL,2,2,nan
09.12.2012,AM,BYAMM,2,1,treeline
09.12.2012,AM,BYWFK,2,1,treeline
09.12.2012,AM,BYBVA,2,1,treeline
09.12.2012,AM,BYCHG,2,1,treeline
09.12.2012,AM,BYBGD,2,1,treeline
10.12.2012,AM,BYALL,3,2,1800
10.12.2012,AM,BYAMM,3,2,1800
10.12.2012,AM,BYWFK,3,2,1800
10.12.2012,AM,BYBVA,3,2,1800
10.12.2012,AM,BYCHG,3,1,1800
10.12.2012,AM,BYBGD,3,1,1800
11.12.2012,AM,BYALL,4,3,1800
11.12.2012,AM,BYAMM,3,2,1800
11.12.2012,AM,BYWFK,3,2,1800
11.12.2012,AM,BYBVA,3,2,1800
11.12.2012,AM,BYCHG,3,2,1800
11.12.2012,AM,BYBGD,3,2,1800
12.12.2012,AM,BYALL,3,3,nan
12.12.2012,AM,BYAMM,3,2,1800
12.12.2012,AM,BYWFK,3,2,1800
12.12.2012,AM,BYBVA,3,2,1800
12.12.2012,AM,BYCHG,3,2,1800
12.12.2012,AM,BYBGD,3,2,1800
13.12.2012,AM,BYALL,3,3,nan
13.12.2012,AM,BYAMM,3,2,1800
13.12.2012,AM,BYWFK,3,2,1800
13.12.2012,AM,BYBVA,3,2,1800
13.12.2012,AM,BYCHG,3,2,1800
13.12.2012,AM,BYBGD,3,2,1800
14.12.2012,AM,BYALL,3,3,nan
14.12.2012,AM,BYAMM,3,2,1800
14.12.2012,AM,BYWFK,3,2,1800
14.12.2012,AM,BYBVA,3,2,1800
14.12.2012,AM,BYCHG,3,2,1800
14.12.2012,AM,BYBGD,3,2,1800
15.12.2012,AM,BYALL,3,3,nan
15.12.2012,AM,BYAMM,3,2,1800
15.12.2012,AM,BYWFK,3,2,1800
15.12.2012,AM,BYBVA,3,2,1800
15.12.2012,AM,BYCHG,3,2,1800
15.12.2012,AM,BYBGD,3,2,1800
16.12.2012,AM,BYALL,2,2,
16.12.2012,AM,BYAMM,2,2,
16.12.2012,AM,BYWFK,2,2,
16.12.2012,AM,BYBVA,2,2,
16.12.2012,AM,BYCHG,2,2,
16.12.2012,AM,BYBGD,2,2,
17.12.2012,AM,BYALL,2,2,
17.12.2012,AM,BYAMM,2,2,
17.12.2012,AM,BYWFK,2,2,
17.12.2012,AM,BYBVA,2,2,
17.12.2012,AM,BYCHG,2,2,
17.12.2012,AM,BYBGD,2,2,
18.12.2012,AM,BYALL,3,2,treeline
18.12.2012,AM,BYAMM,2,2,nan
18.12.2012,AM,BYWFK,2,1,treeline
18.12.2012,AM,BYBVA,2,1,treeline
18.12.2012,AM,BYCHG,2,1,treeline
18.12.2012,AM,BYBGD,2,1,treeline
19.12.2012,AM,BYALL,2,2,nan
19.12.2012,AM,BYAMM,2,2,nan
19.12.2012,AM,BYWFK,2,1,treeline
19.12.2012,AM,BYBVA,2,1,treeline
19.12.2012,AM,BYCHG,2,1,treeline
19.12.2012,AM,BYBGD,2,1,treeline
20.12.2012,AM,BYALL,2,2,nan
20.12.2012,AM,BYAMM,2,1,1800
20.12.2012,AM,BYWFK,2,1,1800
20.12.2012,AM,BYBVA,2,1,1800
20.12.2012,AM,BYCHG,2,1,1800
20.12.2012,AM,BYBGD,2,1,1800
21.12.2012,AM,BYALL,3,2,treeline
21.12.2012,AM,BYAMM,3,1,treeline
21.12.2012,AM,BYWFK,3,1,treeline
21.12.2012,AM,BYBVA,2,1,treeline
21.12.2012,AM,BYCHG,2,1,treeline
21.12.2012,AM,BYBGD,2,1,treeline
22.12.2012,AM,BYALL,3,2,treeline
22.12.2012,AM,BYAMM,3,1,treeline
22.12.2012,AM,BYWFK,3,1,treeline
22.12.2012,AM,BYBVA,3,1,treeline
22.12.2012,AM,BYCHG,3,1,treeline
22.12.2012,AM,BYBGD,3,1,treeline
23.12.2012,AM,BYALL,4,4,nan
23.12.2012,AM,BYAMM,4,3,2000
23.12.2012,AM,BYWFK,4,3,2000
23.12.2012,AM,BYBVA,3,3,nan
23.12.2012,AM,BYCHG,3,3,nan
23.12.2012,AM,BYBGD,4,3,2000
24.12.2012,AM,BYALL,3,3,
24.12.2012,AM,BYAMM,3,3,
24.12.2012,AM,BYWFK,3,3,
24.12.2012,AM,BYBVA,3,3,
24.12.2012,AM,BYCHG,3,3,
24.12.2012,AM,BYBGD,3,3,
25.12.2012,AM,BYALL,2,2,
25.12.2012,AM,BYAMM,2,2,
25.12.2012,AM,BYWFK,2,2,
25.12.2012,AM,BYBVA,2,2,
25.12.2012,AM,BYCHG,2,2,
25.12.2012,AM,BYBGD,2,2,
26.12.2012,AM,BYALL,2,2,
26.12.2012,AM,BYAMM,2,2,
26.12.2012,AM,BYWFK,2,2,
26.12.2012,AM,BYBVA,2,2,
26.12.2012,AM,BYCHG,2,2,
26.12.2012,AM,BYBGD,2,2,
27.12.2012,AM,BYALL,2,2,nan
27.12.2012,AM,BYAMM,2,1,Uncertain
27.12.2012,AM,BYWFK,2,1,Uncertain
27.12.2012,AM,BYBVA,2,1,Uncertain
27.12.2012,AM,BYCHG,2,1,Uncertain
27.12.2012,AM,BYBGD,2,1,Uncertain
27.12.2012,PM,BYALL,3,2,Uncertain
27.12.2012,PM,BYAMM,3,1,Uncertain
27.12.2012,PM,BYWFK,3,1,Uncertain
28.12.2012,AM,BYALL,3,2,Uncertain
28.12.2012,AM,BYAMM,3,2,Uncertain
28.12.2012,AM,BYWFK,3,2,Uncertain
28.12.2012,AM,BYBVA,3,2,Uncertain
28.12.2012,AM,BYCHG,3,2,Uncertain
28.12.2012,AM,BYBGD,3,2,Uncertain
29.12.2012,AM,BYALL,2,1,Uncertain
29.12.2012,AM,BYAMM,2,1,Uncertain
29.12.2012,AM,BYWFK,2,1,Uncertain
29.12.2012,AM,BYBVA,2,1,Uncertain
29.12.2012,AM,BYCHG,2,1,Uncertain
29.12.2012,AM,BYBGD,2,1,Uncertain
29.12.2012,PM,BYALL,2,2,nan
29.12.2012,PM,BYAMM,2,2,nan
29.12.2012,PM,BYWFK,2,2,nan
29.12.2012,PM,BYBVA,2,2,nan
29.12.2012,PM,BYCHG,2,2,nan
29.12.2012,PM,BYBGD,2,2,nan
30.12.2012,AM,BYALL,2,1,Uncertain
30.12.2012,AM,BYAMM,2,1,Uncertain
30.12.2012,AM,BYWFK,2,1,Uncertain
30.12.2012,AM,BYBVA,2,1,Uncertain
30.12.2012,AM,BYCHG,2,1,Uncertain
30.12.2012,AM,BYBGD,2,1,Uncertain
31.12.2012,AM,BYALL,2,1,1800
31.12.2012,AM,BYAMM,2,1,1800
31.12.2012,AM,BYWFK,2,1,1800
31.12.2012,AM,BYBVA,2,1,1800
31.12.2012,AM,BYCHG,2,1,1800
31.12.2012,AM,BYBGD,2,1,1800
31.12.2012,PM,BYALL,2,2,nan
01.01.2013,AM,BYALL,2,1,2000
01.01.2013,AM,BYAMM,2,1,2000
01.01.2013,AM,BYWFK,2,1,2000
01.01.2013,AM,BYBVA,2,1,2000
01.01.2013,AM,BYCHG,2,1,2000
01.01.2013,AM,BYBGD,2,1,2000
02.01.2013,AM,BYALL,2,1,2000
02.01.2013,AM,BYAMM,2,1,2000
02.01.2013,AM,BYWFK,2,1,2000
02.01.2013,AM,BYBVA,2,1,2000
02.01.2013,AM,BYCHG,2,1,2000
02.01.2013,AM,BYBGD,2,1,2000
03.01.2013,AM,BYALL,2,1,2000
03.01.2013,AM,BYAMM,2,1,2000
03.01.2013,AM,BYWFK,2,1,2000
03.01.2013,AM,BYBVA,1,1,nan
03.01.2013,AM,BYCHG,1,1,nan
03.01.2013,AM,BYBGD,1,1,nan
04.01.2013,AM,BYALL,2,1,Uncertain
04.01.2013,AM,BYAMM,2,1,Uncertain
04.01.2013,AM,BYWFK,2,1,Uncertain
04.01.2013,AM,BYBVA,2,1,Uncertain
04.01.2013,AM,BYCHG,2,1,Uncertain
04.01.2013,AM,BYBGD,3,1,Uncertain
04.01.2013,PM,BYALL,3,1,Uncertain
04.01.2013,PM,BYAMM,3,1,Uncertain
04.01.2013,PM,BYWFK,3,1,Uncertain
04.01.2013,PM,BYBVA,3,1,Uncertain
04.01.2013,PM,BYCHG,3,1,Uncertain
05.01.2013,AM,BYALL,3,2,Uncertain
05.01.2013,AM,BYAMM,3,1,Uncertain
05.01.2013,AM,BYWFK,3,1,Uncertain
05.01.2013,AM,BYBVA,3,1,Uncertain
05.01.2013,AM,BYCHG,3,1,Uncertain
05.01.2013,AM,BYBGD,3,2,Uncertain
05.01.2013,PM,BYBGD,4,2,Uncertain
06.01.2013,AM,BYALL,3,2,1800
06.01.2013,AM,BYAMM,3,2,1800
06.01.2013,AM,BYWFK,3,2,1800
06.01.2013,AM,BYBVA,3,2,1800
06.01.2013,AM,BYCHG,3,2,1800
06.01.2013,AM,BYBGD,3,2,1800
07.01.2013,AM,BYALL,3,2,1800
07.01.2013,AM,BYAMM,3,2,1800
07.01.2013,AM,BYWFK,3,2,1800
07.01.2013,AM,BYBVA,3,2,1800
07.01.2013,AM,BYCHG,3,2,1800
07.01.2013,AM,BYBGD,4,2,1800
08.01.2013,AM,BYALL,2,2,nan
08.01.2013,AM,BYAMM,2,2,nan
08.01.2013,AM,BYWFK,2,2,nan
08.01.2013,AM,BYBVA,2,2,nan
08.01.2013,AM,BYCHG,2,2,nan
08.01.2013,AM,BYBGD,3,2,1800
09.01.2013,AM,BYALL,2,2,nan
09.01.2013,AM,BYAMM,2,1,1800
09.01.2013,AM,BYWFK,2,1,1800
09.01.2013,AM,BYBVA,2,1,1800
09.01.2013,AM,BYCHG,2,2,nan
09.01.2013,AM,BYBGD,3,2,1800
10.01.2013,AM,BYALL,2,1,1800
10.01.2013,AM,BYAMM,2,1,1800
10.01.2013,AM,BYWFK,2,1,1800
10.01.2013,AM,BYBVA,2,1,1800
10.01.2013,AM,BYCHG,2,1,1800
10.01.2013,AM,BYBGD,3,1,1800
11.01.2013,AM,BYALL,3,1,treeline
11.01.2013,AM,BYAMM,2,1,treeline
11.01.2013,AM,BYWFK,2,1,treeline
11.01.2013,AM,BYBVA,2,1,treeline
11.01.2013,AM,BYCHG,2,1,treeline
11.01.2013,AM,BYBGD,3,1,treeline
11.01.2013,PM,BYAMM,3,1,treeline
11.01.2013,PM,BYWFK,3,1,treeline
12.01.2013,AM,BYALL,3,1,treeline
12.01.2013,AM,BYAMM,3,1,treeline
12.01.2013,AM,BYWFK,3,1,treeline
12.01.2013,AM,BYBVA,3,1,treeline
12.01.2013,AM,BYCHG,3,1,treeline
12.01.2013,AM,BYBGD,3,1,treeline
13.01.2013,AM,BYALL,3,1,treeline
13.01.2013,AM,BYAMM,3,1,treeline
13.01.2013,AM,BYWFK,3,1,treeline
13.01.2013,AM,BYBVA,3,1,treeline
13.01.2013,AM,BYCHG,3,1,treeline
13.01.2013,AM,BYBGD,3,1,treeline
14.01.2013,AM,BYALL,3,1,1800
14.01.2013,AM,BYAMM,3,1,1800
14.01.2013,AM,BYWFK,3,1,1800
14.01.2013,AM,BYBVA,3,1,1800
14.01.2013,AM,BYCHG,3,1,1800
14.01.2013,AM,BYBGD,3,1,1800
15.01.2013,AM,BYALL,2,1,1800
15.01.2013,AM,BYAMM,2,1,1800
15.01.2013,AM,BYWFK,2,1,1800
15.01.2013,AM,BYBVA,2,1,1800
15.01.2013,AM,BYCHG,2,1,1800
15.01.2013,AM,BYBGD,2,1,1800
16.01.2013,AM,BYALL,2,1,1800
16.01.2013,AM,BYAMM,2,1,1800
16.01.2013,AM,BYWFK,2,1,1800
16.01.2013,AM,BYBVA,2,1,1800
16.01.2013,AM,BYCHG,2,1,1800
16.01.2013,AM,BYBGD,2,1,1800
17.01.2013,AM,BYALL,2,2,
17.01.2013,AM,BYAMM,2,2,
17.01.2013,AM,BYWFK,2,2,
17.01.2013,AM,BYBVA,2,2,
17.01.2013,AM,BYCHG,2,2,
17.01.2013,AM,BYBGD,2,2,
17.01.2013,PM,BYALL,3,3,
17.01.2013,PM,BYAMM,3,3,
17.01.2013,PM,BYWFK,3,3,
17.01.2013,PM,BYBVA,3,3,
17.01.2013,PM,BYCHG,3,3,
17.01.2013,PM,BYBGD,3,3,
18.01.2013,AM,BYALL,3,3,
18.01.2013,AM,BYAMM,3,3,
18.01.2013,AM,BYWFK,3,3,
18.01.2013,AM,BYBVA,3,3,
18.01.2013,AM,BYCHG,3,3,
18.01.2013,AM,BYBGD,3,3,
19.01.2013,AM,BYALL,2,2,nan
19.01.2013,AM,BYAMM,2,2,nan
19.01.2013,AM,BYWFK,3,2,Uncertain
19.01.2013,AM,BYBVA,2,2,nan
19.01.2013,AM,BYCHG,2,2,nan
19.01.2013,AM,BYBGD,2,2,nan
19.01.2013,PM,BYALL,3,2,Uncertain
19.01.2013,PM,BYAMM,3,2,Uncertain
19.01.2013,PM,BYBVA,3,2,Uncertain
19.01.2013,PM,BYCHG,3,2,Uncertain
19.01.2013,PM,BYBGD,3,2,Uncertain
20.01.2013,AM,BYALL,3,2,1600
20.01.2013,AM,BYAMM,3,2,1600
20.01.2013,AM,BYWFK,3,2,1600
20.01.2013,AM,BYBVA,3,2,1600
20.01.2013,AM,BYCHG,3,2,1600
20.01.2013,AM,BYBGD,3,2,1600
20.01.2013,PM,BYALL,3,3,nan
20.01.2013,PM,BYAMM,3,3,nan
20.01.2013,PM,BYWFK,3,3,nan
20.01.2013,PM,BYBVA,3,3,nan
20.01.2013,PM,BYCHG,3,3,nan
20.01.2013,PM,BYBGD,3,3,nan
21.01.2013,AM,BYALL,2,2,nan
21.01.2013,AM,BYAMM,2,1,1800
21.01.2013,AM,BYWFK,2,1,1800
21.01.2013,AM,BYBVA,2,1,1800
21.01.2013,AM,BYCHG,2,1,1800
21.01.2013,AM,BYBGD,2,1,1800
22.01.2013,AM,BYALL,2,1,1800
22.01.2013,AM,BYAMM,2,1,1800
22.01.2013,AM,BYWFK,2,1,1800
22.01.2013,AM,BYBVA,2,1,1800
22.01.2013,AM,BYCHG,1,1,nan
22.01.2013,AM,BYBGD,2,1,1800
23.01.2013,AM,BYALL,2,1,1800
23.01.2013,AM,BYAMM,2,1,1800
23.01.2013,AM,BYWFK,2,1,1800
23.01.2013,AM,BYBVA,2,1,1800
23.01.2013,AM,BYCHG,1,1,nan
23.01.2013,AM,BYBGD,2,1,1800
24.01.2013,AM,BYALL,2,1,1800
24.01.2013,AM,BYAMM,2,1,1800
24.01.2013,AM,BYWFK,2,1,1800
24.01.2013,AM,BYBVA,1,1,nan
24.01.2013,AM,BYCHG,1,1,nan
24.01.2013,AM,BYBGD,2,1,1800
25.01.2013,AM,BYALL,2,1,2000
25.01.2013,AM,BYAMM,1,1,nan
25.01.2013,AM,BYWFK,2,1,2000
25.01.2013,AM,BYBVA,1,1,nan
25.01.2013,AM,BYCHG,1,1,nan
25.01.2013,AM,BYBGD,2,1,2000
26.01.2013,AM,BYALL,2,1,2000
26.01.2013,AM,BYAMM,1,1,nan
26.01.2013,AM,BYWFK,2,1,2000
26.01.2013,AM,BYBVA,1,1,nan
26.01.2013,AM,BYCHG,1,1,nan
26.01.2013,AM,BYBGD,2,1,2000
27.01.2013,AM,BYALL,2,1,Uncertain
27.01.2013,AM,BYAMM,2,1,Uncertain
27.01.2013,AM,BYWFK,2,1,Uncertain
27.01.2013,AM,BYBVA,2,1,Uncertain
27.01.2013,AM,BYCHG,2,1,Uncertain
27.01.2013,AM,BYBGD,2,1,Uncertain
28.01.2013,AM,BYALL,2,1,Uncertain
28.01.2013,AM,BYAMM,2,1,Uncertain
28.01.2013,AM,BYWFK,2,1,Uncertain
28.01.2013,AM,BYBVA,2,1,Uncertain
28.01.2013,AM,BYCHG,2,1,Uncertain
28.01.2013,AM,BYBGD,2,1,Uncertain
29.01.2013,AM,BYALL,3,1,Uncertain
29.01.2013,AM,BYAMM,3,1,Uncertain
29.01.2013,AM,BYWFK,3,1,Uncertain
29.01.2013,AM,BYBVA,3,1,Uncertain
29.01.2013,AM,BYCHG,3,1,Uncertain
29.01.2013,AM,BYBGD,3,1,Uncertain
29.01.2013,PM,BYALL,3,2,Uncertain
29.01.2013,PM,BYAMM,3,2,Uncertain
29.01.2013,PM,BYWFK,3,2,Uncertain
30.01.2013,AM,BYALL,3,3,
30.01.2013,AM,BYAMM,3,3,
30.01.2013,AM,BYWFK,3,3,
30.01.2013,AM,BYBVA,3,3,
30.01.2013,AM,BYCHG,3,3,
30.01.2013,AM,BYBGD,3,3,
31.01.2013,AM,BYALL,3,2,2000
31.01.2013,AM,BYAMM,3,2,2000
31.01.2013,AM,BYWFK,3,2,2000
31.01.2013,AM,BYBVA,3,2,2000
31.01.2013,AM,BYCHG,3,2,2000
31.01.2013,AM,BYBGD,3,2,2000
01.02.2013,AM,BYALL,3,2,1600
01.02.2013,AM,BYAMM,3,2,1600
01.02.2013,AM,BYWFK,3,2,1600
01.02.2013,AM,BYBVA,2,2,nan
01.02.2013,AM,BYCHG,2,2,nan
01.02.2013,AM,BYBGD,3,2,1600
01.02.2013,PM,BYBVA,3,2,1600
01.02.2013,PM,BYCHG,3,2,1600
02.02.2013,AM,BYALL,3,3,nan
02.02.2013,AM,BYAMM,3,2,2000
02.02.2013,AM,BYWFK,3,2,2000
02.02.2013,AM,BYBVA,3,2,2000
02.02.2013,AM,BYCHG,3,2,2000
02.02.2013,AM,BYBGD,3,2,2000
03.02.2013,AM,BYALL,4,3,1800
03.02.2013,AM,BYAMM,4,3,1800
03.02.2013,AM,BYWFK,4,3,1800
03.02.2013,AM,BYBVA,3,3,nan
03.02.2013,AM,BYCHG,3,3,nan
03.02.2013,AM,BYBGD,3,3,nan
04.02.2013,AM,BYALL,3,3,nan
04.02.2013,AM,BYAMM,3,2,treeline
04.02.2013,AM,BYWFK,3,2,treeline
04.02.2013,AM,BYBVA,3,2,treeline
04.02.2013,AM,BYCHG,3,2,treeline
04.02.2013,AM,BYBGD,3,2,treeline
05.02.2013,AM,BYALL,3,3,nan
05.02.2013,AM,BYAMM,3,2,treeline
05.02.2013,AM,BYWFK,3,2,treeline
05.02.2013,AM,BYBVA,3,2,treeline
05.02.2013,AM,BYCHG,3,2,treeline
05.02.2013,AM,BYBGD,3,2,treeline
06.02.2013,AM,BYALL,3,3,nan
06.02.2013,AM,BYAMM,3,2,treeline
06.02.2013,AM,BYWFK,3,2,treeline
06.02.2013,AM,BYBVA,3,2,treeline
06.02.2013,AM,BYCHG,3,2,treeline
06.02.2013,AM,BYBGD,3,2,treeline
07.02.2013,AM,BYALL,3,2,treeline
07.02.2013,AM,BYAMM,3,2,treeline
07.02.2013,AM,BYWFK,3,2,treeline
07.02.2013,AM,BYBVA,3,2,treeline
07.02.2013,AM,BYCHG,3,2,treeline
07.02.2013,AM,BYBGD,3,2,treeline
08.02.2013,AM,BYALL,4,3,treeline
08.02.2013,AM,BYAMM,3,3,nan
08.02.2013,AM,BYWFK,3,3,nan
08.02.2013,AM,BYBVA,3,3,nan
08.02.2013,AM,BYCHG,3,3,nan
08.02.2013,AM,BYBGD,3,3,nan
09.02.2013,AM,BYALL,4,3,treeline
09.02.2013,AM,BYAMM,3,3,nan
09.02.2013,AM,BYWFK,3,3,nan
09.02.2013,AM,BYBVA,3,3,nan
09.02.2013,AM,BYCHG,3,3,nan
09.02.2013,AM,BYBGD,3,3,nan
10.02.2013,AM,BYALL,4,3,1500
10.02.2013,AM,BYAMM,3,2,1500
10.02.2013,AM,BYWFK,3,2,1500
10.02.2013,AM,BYBVA,3,2,1500
10.02.2013,AM,BYCHG,3,2,1500
10.02.2013,AM,BYBGD,3,2,1500
11.02.2013,AM,BYALL,3,2,1800
11.02.2013,AM,BYAMM,3,2,1800
11.02.2013,AM,BYWFK,3,2,1800
11.02.2013,AM,BYBVA,3,2,1800
11.02.2013,AM,BYCHG,3,2,1800
11.02.2013,AM,BYBGD,3,2,1800
12.02.2013,AM,BYALL,3,2,2000
12.02.2013,AM,BYAMM,2,2,nan
12.02.2013,AM,BYWFK,3,2,2000
12.02.2013,AM,BYBVA,2,2,nan
12.02.2013,AM,BYCHG,2,2,nan
12.02.2013,AM,BYBGD,3,2,2000
13.02.2013,AM,BYALL,2,2,
13.02.2013,AM,BYAMM,2,2,
13.02.2013,AM,BYWFK,2,2,
13.02.2013,AM,BYBVA,2,2,
13.02.2013,AM,BYCHG,2,2,
13.02.2013,AM,BYBGD,2,2,
14.02.2013,AM,BYALL,2,2,nan
14.02.2013,AM,BYAMM,2,1,1800
14.02.2013,AM,BYWFK,2,1,1800
14.02.2013,AM,BYBVA,2,1,1800
14.02.2013,AM,BYCHG,2,1,1800
14.02.2013,AM,BYBGD,2,1,1800
14.02.2013,PM,BYAMM,2,2,nan
14.02.2013,PM,BYWFK,2,2,nan
14.02.2013,PM,BYBVA,2,2,nan
14.02.2013,PM,BYCHG,2,2,nan
14.02.2013,PM,BYBGD,2,2,nan
15.02.2013,AM,BYALL,2,2,nan
15.02.2013,AM,BYAMM,2,1,1800
15.02.2013,AM,BYWFK,2,1,1800
15.02.2013,AM,BYBVA,2,1,1800
15.02.2013,AM,BYCHG,2,1,1800
15.02.2013,AM,BYBGD,2,1,1800
16.02.2013,AM,BYALL,2,2,nan
16.02.2013,AM,BYAMM,2,1,1800
16.02.2013,AM,BYWFK,2,1,1800
16.02.2013,AM,BYBVA,2,1,1800
16.02.2013,AM,BYCHG,2,1,1800
16.02.2013,AM,BYBGD,2,1,1800
17.02.2013,AM,BYALL,2,2,nan
17.02.2013,AM,BYAMM,2,1,1800
17.02.2013,AM,BYWFK,2,1,1800
17.02.2013,AM,BYBVA,2,1,1800
17.02.2013,AM,BYCHG,2,1,1800
17.02.2013,AM,BYBGD,2,1,1800
18.02.2013,AM,BYALL,2,2,nan
18.02.2013,AM,BYAMM,2,1,2000
18.02.2013,AM,BYWFK,2,1,2000
18.02.2013,AM,BYBVA,1,1,nan
18.02.2013,AM,BYCHG,1,1,nan
18.02.2013,AM,BYBGD,2,1,2000
19.02.2013,AM,BYALL,2,2,nan
19.02.2013,AM,BYAMM,2,1,treeline
19.02.2013,AM,BYWFK,2,1,treeline
19.02.2013,AM,BYBVA,2,1,treeline
19.02.2013,AM,BYCHG,2,1,treeline
19.02.2013,AM,BYBGD,2,1,treeline
19.02.2013,PM,BYWFK,3,1,treeline
19.02.2013,PM,BYBVA,3,1,treeline
19.02.2013,PM,BYCHG,3,1,treeline
19.02.2013,PM,BYBGD,3,1,treeline
20.02.2013,AM,BYALL,2,2,nan
20.02.2013,AM,BYAMM,2,2,nan
20.02.2013,AM,BYWFK,3,2,1600
20.02.2013,AM,BYBVA,3,3,nan
20.02.2013,AM,BYCHG,3,3,nan
20.02.2013,AM,BYBGD,3,3,nan
21.02.2013,AM,BYALL,2,2,nan
21.02.2013,AM,BYAMM,2,2,nan
21.02.2013,AM,BYWFK,3,2,treeline
21.02.2013,AM,BYBVA,3,2,treeline
21.02.2013,AM,BYCHG,3,2,treeline
21.02.2013,AM,BYBGD,3,2,treeline
22.02.2013,AM,BYALL,2,1,treeline
22.02.2013,AM,BYAMM,2,1,treeline
22.02.2013,AM,BYWFK,2,1,treeline
22.02.2013,AM,BYBVA,2,1,treeline
22.02.2013,AM,BYCHG,3,1,treeline
22.02.2013,AM,BYBGD,3,1,treeline
23.02.2013,AM,BYALL,2,1,treeline
23.02.2013,AM,BYAMM,2,1,treeline
23.02.2013,AM,BYWFK,2,1,treeline
23.02.2013,AM,BYBVA,2,1,treeline
23.02.2013,AM,BYCHG,3,1,treeline
23.02.2013,AM,BYBGD,3,1,treeline
24.02.2013,AM,BYALL,2,1,treeline
24.02.2013,AM,BYAMM,2,1,treeline
24.02.2013,AM,BYWFK,3,1,treeline
24.02.2013,AM,BYBVA,2,1,treeline
24.02.2013,AM,BYCHG,2,1,treeline
24.02.2013,AM,BYBGD,3,1,treeline
25.02.2013,AM,BYALL,2,1,2000
25.02.2013,AM,BYAMM,2,1,2000
25.02.2013,AM,BYWFK,2,1,2000
25.02.2013,AM,BYBVA,1,1,nan
25.02.2013,AM,BYCHG,1,1,nan
25.02.2013,AM,BYBGD,2,1,2000
26.02.2013,AM,BYALL,2,1,2000
26.02.2013,AM,BYAMM,2,1,2000
26.02.2013,AM,BYWFK,2,1,2000
26.02.2013,AM,BYBVA,1,1,nan
26.02.2013,AM,BYCHG,1,1,nan
26.02.2013,AM,BYBGD,2,1,2000
27.02.2013,AM,BYALL,1,1,nan
27.02.2013,AM,BYAMM,1,1,nan
27.02.2013,AM,BYWFK,1,1,nan
27.02.2013,AM,BYBVA,1,1,nan
27.02.2013,AM,BYCHG,1,1,nan
27.02.2013,AM,BYBGD,2,1,2000
27.02.2013,PM,BYALL,1,2,2000
28.02.2013,AM,BYALL,1,1,nan
28.02.2013,AM,BYAMM,1,1,nan
28.02.2013,AM,BYWFK,1,1,nan
28.02.2013,AM,BYBVA,1,1,nan
28.02.2013,AM,BYCHG,1,1,nan
28.02.2013,AM,BYBGD,2,1,2000
28.02.2013,PM,BYALL,1,2,2000
28.02.2013,PM,BYAMM,1,2,2000
28.02.2013,PM,BYWFK,1,2,2000
28.02.2013,PM,BYBVA,1,2,2000
28.02.2013,PM,BYCHG,1,2,2000
28.02.2013,PM,BYBGD,2,2,nan
01.03.2013,AM,BYALL,1,1,nan
01.03.2013,AM,BYAMM,1,1,nan
01.03.2013,AM,BYWFK,1,1,nan
01.03.2013,AM,BYBVA,1,1,nan
01.03.2013,AM,BYCHG,1,1,nan
01.03.2013,AM,BYBGD,2,1,2000
01.03.2013,PM,BYALL,1,2,2000
01.03.2013,PM,BYAMM,1,2,2000
01.03.2013,PM,BYWFK,1,2,2000
01.03.2013,PM,BYBVA,1,2,2000
01.03.2013,PM,BYCHG,1,2,2000
01.03.2013,PM,BYBGD,2,2,nan
02.03.2013,AM,BYALL,1,1,nan
02.03.2013,AM,BYAMM,1,1,nan
02.03.2013,AM,BYWFK,1,1,nan
02.03.2013,AM,BYBVA,1,1,nan
02.03.2013,AM,BYCHG,1,1,nan
02.03.2013,AM,BYBGD,1,1,nan
02.03.2013,PM,BYALL,1,2,2000
02.03.2013,PM,BYAMM,1,2,2000
02.03.2013,PM,BYWFK,1,2,2000
02.03.2013,PM,BYBVA,1,2,2000
02.03.2013,PM,BYCHG,1,2,2000
02.03.2013,PM,BYBGD,1,2,2000
03.03.2013,AM,BYALL,1,1,nan
03.03.2013,AM,BYAMM,1,1,nan
03.03.2013,AM,BYWFK,1,1,nan
03.03.2013,AM,BYBVA,1,1,nan
03.03.2013,AM,BYCHG,1,1,nan
03.03.2013,AM,BYBGD,1,1,nan
03.03.2013,PM,BYALL,1,2,Uncertain
03.03.2013,PM,BYAMM,1,2,Uncertain
03.03.2013,PM,BYWFK,1,2,Uncertain
03.03.2013,PM,BYBVA,1,2,Uncertain
03.03.2013,PM,BYCHG,1,2,Uncertain
03.03.2013,PM,BYBGD,1,2,Uncertain
04.03.2013,AM,BYALL,1,1,nan
04.03.2013,AM,BYAMM,1,1,nan
04.03.2013,AM,BYWFK,1,1,nan
04.03.2013,AM,BYBVA,1,1,nan
04.03.2013,AM,BYCHG,1,1,nan
04.03.2013,AM,BYBGD,1,1,nan
04.03.2013,PM,BYALL,1,2,Uncertain
04.03.2013,PM,BYAMM,1,2,Uncertain
04.03.2013,PM,BYWFK,1,2,Uncertain
04.03.2013,PM,BYBVA,1,2,Uncertain
04.03.2013,PM,BYCHG,1,2,Uncertain
04.03.2013,PM,BYBGD,1,2,Uncertain
05.03.2013,AM,BYALL,1,1,nan
05.03.2013,AM,BYAMM,1,1,nan
05.03.2013,AM,BYWFK,1,1,nan
05.03.2013,AM,BYBVA,1,1,nan
05.03.2013,AM,BYCHG,1,1,nan
05.03.2013,AM,BYBGD,1,1,nan
05.03.2013,PM,BYALL,1,2,Uncertain
05.03.2013,PM,BYAMM,1,2,Uncertain
05.03.2013,PM,BYWFK,1,2,Uncertain
05.03.2013,PM,BYBVA,1,2,Uncertain
05.03.2013,PM,BYCHG,1,2,Uncertain
05.03.2013,PM,BYBGD,1,2,Uncertain
06.03.2013,AM,BYALL,2,2,
06.03.2013,AM,BYAMM,2,2,
06.03.2013,AM,BYWFK,2,2,
06.03.2013,AM,BYBVA,2,2,
06.03.2013,AM,BYCHG,2,2,
06.03.2013,AM,BYBGD,2,2,
07.03.2013,AM,BYALL,2,2,
07.03.2013,AM,BYAMM,2,2,
07.03.2013,AM,BYWFK,2,2,
07.03.2013,AM,BYBVA,2,2,
07.03.2013,AM,BYCHG,2,2,
07.03.2013,AM,BYBGD,2,2,
08.03.2013,AM,BYALL,2,2,
08.03.2013,AM,BYAMM,2,2,
08.03.2013,AM,BYWFK,2,2,
08.03.2013,AM,BYBVA,2,2,
08.03.2013,AM,BYCHG,2,2,
08.03.2013,AM,BYBGD,2,2,
09.03.2013,AM,BYALL,1,2,2000
09.03.2013,AM,BYAMM,1,2,2000
09.03.2013,AM,BYWFK,1,2,2000
09.03.2013,AM,BYBVA,1,2,2000
09.03.2013,AM,BYCHG,1,2,2000
09.03.2013,AM,BYBGD,2,2,nan
10.03.2013,AM,BYALL,1,2,2000
10.03.2013,AM,BYAMM,1,2,2000
10.03.2013,AM,BYWFK,1,2,2000
10.03.2013,AM,BYBVA,1,2,2000
10.03.2013,AM,BYCHG,1,2,2000
10.03.2013,AM,BYBGD,1,2,2000
11.03.2013,AM,BYALL,1,2,2000
11.03.2013,AM,BYAMM,1,2,2000
11.03.2013,AM,BYWFK,1,2,2000
11.03.2013,AM,BYBVA,1,2,2000
11.03.2013,AM,BYCHG,1,2,2000
11.03.2013,AM,BYBGD,1,2,2000
12.03.2013,AM,BYALL,1,2,2000
12.03.2013,AM,BYAMM,1,2,2000
12.03.2013,AM,BYWFK,2,2,nan
12.03.2013,AM,BYBVA,1,2,2000
12.03.2013,AM,BYCHG,1,2,2000
12.03.2013,AM,BYBGD,2,2,nan
13.03.2013,AM,BYALL,1,2,Uncertain
13.03.2013,AM,BYAMM,1,2,Uncertain
13.03.2013,AM,BYWFK,1,2,Uncertain
13.03.2013,AM,BYBVA,1,2,Uncertain
13.03.2013,AM,BYCHG,1,2,Uncertain
13.03.2013,AM,BYBGD,1,2,Uncertain
14.03.2013,AM,BYALL,1,1,
14.03.2013,AM,BYAMM,1,1,
14.03.2013,AM,BYWFK,1,1,
14.03.2013,AM,BYBVA,1,1,
14.03.2013,AM,BYCHG,1,1,
14.03.2013,AM,BYBGD,1,1,
15.03.2013,AM,BYALL,2,2,nan
15.03.2013,AM,BYAMM,2,2,nan
15.03.2013,AM,BYWFK,2,2,nan
15.03.2013,AM,BYBVA,2,2,nan
15.03.2013,AM,BYCHG,3,2,1800
15.03.2013,AM,BYBGD,3,2,1800
16.03.2013,AM,BYALL,2,2,nan
16.03.2013,AM,BYAMM,2,2,nan
16.03.2013,AM,BYWFK,3,2,1700
16.03.2013,AM,BYBVA,3,2,1700
16.03.2013,AM,BYCHG,3,2,1700
16.03.2013,AM,BYBGD,3,2,1700
17.03.2013,AM,BYALL,3,2,Uncertain
17.03.2013,AM,BYAMM,3,2,Uncertain
17.03.2013,AM,BYWFK,3,2,Uncertain
17.03.2013,AM,BYBVA,2,2,nan
17.03.2013,AM,BYCHG,2,2,nan
17.03.2013,AM,BYBGD,3,2,Uncertain
18.03.2013,AM,BYALL,3,2,1800
18.03.2013,AM,BYAMM,3,2,1800
18.03.2013,AM,BYWFK,3,2,1800
18.03.2013,AM,BYBVA,3,2,1800
18.03.2013,AM,BYCHG,3,2,1800
18.03.2013,AM,BYBGD,3,2,1800
19.03.2013,AM,BYALL,3,2,treeline
19.03.2013,AM,BYAMM,3,2,treeline
19.03.2013,AM,BYWFK,3,2,treeline
19.03.2013,AM,BYBVA,3,2,treeline
19.03.2013,AM,BYCHG,3,2,treeline
19.03.2013,AM,BYBGD,3,2,treeline
20.03.2013,AM,BYALL,3,1,treeline
20.03.2013,AM,BYAMM,3,1,treeline
20.03.2013,AM,BYWFK,3,1,treeline
20.03.2013,AM,BYBVA,3,1,treeline
20.03.2013,AM,BYCHG,3,1,treeline
20.03.2013,AM,BYBGD,3,1,treeline
21.03.2013,AM,BYALL,3,1,treeline
21.03.2013,AM,BYAMM,3,1,treeline
21.03.2013,AM,BYWFK,3,1,treeline
21.03.2013,AM,BYBVA,3,1,treeline
21.03.2013,AM,BYCHG,3,1,treeline
21.03.2013,AM,BYBGD,3,1,treeline
22.03.2013,AM,BYALL,2,2,
22.03.2013,AM,BYAMM,2,2,
22.03.2013,AM,BYWFK,2,2,
22.03.2013,AM,BYBVA,2,2,
22.03.2013,AM,BYCHG,2,2,
22.03.2013,AM,BYBGD,2,2,
23.03.2013,AM,BYALL,2,2,
23.03.2013,AM,BYAMM,2,2,
23.03.2013,AM,BYWFK,2,2,
23.03.2013,AM,BYBVA,2,2,
23.03.2013,AM,BYCHG,2,2,
23.03.2013,AM,BYBGD,2,2,
24.03.2013,AM,BYALL,2,1,treeline
24.03.2013,AM,BYAMM,2,1,treeline
24.03.2013,AM,BYWFK,2,1,treeline
24.03.2013,AM,BYBVA,2,1,treeline
24.03.2013,AM,BYCHG,2,1,treeline
24.03.2013,AM,BYBGD,2,1,treeline
25.03.2013,AM,BYALL,1,1,
25.03.2013,AM,BYAMM,1,1,
25.03.2013,AM,BYWFK,1,1,
25.03.2013,AM,BYBVA,1,1,
25.03.2013,AM,BYCHG,1,1,
25.03.2013,AM,BYBGD,1,1,
26.03.2013,AM,BYALL,1,1,
26.03.2013,AM,BYAMM,1,1,
26.03.2013,AM,BYWFK,1,1,
26.03.2013,AM,BYBVA,1,1,
26.03.2013,AM,BYCHG,1,1,
26.03.2013,AM,BYBGD,1,1,
27.03.2013,AM,BYALL,1,1,
27.03.2013,AM,BYAMM,1,1,
27.03.2013,AM,BYWFK,1,1,
27.03.2013,AM,BYBVA,1,1,
27.03.2013,AM,BYCHG,1,1,
27.03.2013,AM,BYBGD,1,1,
28.03.2013,AM,BYALL,2,1,Uncertain
28.03.2013,AM,BYAMM,2,1,Uncertain
28.03.2013,AM,BYWFK,2,1,Uncertain
28.03.2013,AM,BYBVA,2,1,Uncertain
28.03.2013,AM,BYCHG,2,1,Uncertain
28.03.2013,AM,BYBGD,2,1,Uncertain
29.03.2013,AM,BYALL,2,1,1800
29.03.2013,AM,BYAMM,2,1,1800
29.03.2013,AM,BYWFK,2,1,1800
29.03.2013,AM,BYBVA,2,1,1800
29.03.2013,AM,BYCHG,2,1,1800
29.03.2013,AM,BYBGD,2,1,1800
30.03.2013,AM,BYALL,2,1,1800
30.03.2013,AM,BYAMM,2,1,1800
30.03.2013,AM,BYWFK,2,1,1800
30.03.2013,AM,BYBVA,2,1,1800
30.03.2013,AM,BYCHG,2,1,1800
30.03.2013,AM,BYBGD,2,1,1800
31.03.2013,AM,BYALL,2,1,1800
31.03.2013,AM,BYAMM,2,1,1800
31.03.2013,AM,BYWFK,2,1,1800
31.03.2013,AM,BYBVA,2,1,1800
31.03.2013,AM,BYCHG,2,1,1800
31.03.2013,AM,BYBGD,3,1,1800
01.04.2013,AM,BYALL,2,1,1800
01.04.2013,AM,BYAMM,2,1,1800
01.04.2013,AM,BYWFK,2,1,1800
01.04.2013,AM,BYBVA,2,1,1800
01.04.2013,AM,BYCHG,2,1,1800
01.04.2013,AM,BYBGD,3,1,1800
02.04.2013,AM,BYALL,2,2,nan
02.04.2013,AM,BYAMM,2,2,nan
02.04.2013,AM,BYWFK,3,2,Uncertain
02.04.2013,AM,BYBVA,3,2,Uncertain
02.04.2013,AM,BYCHG,3,2,Uncertain
02.04.2013,AM,BYBGD,3,2,Uncertain
03.04.2013,AM,BYALL,2,1,1800
03.04.2013,AM,BYAMM,2,1,1800
03.04.2013,AM,BYWFK,2,1,1800
03.04.2013,AM,BYBVA,2,1,1800
03.04.2013,AM,BYCHG,2,1,1800
03.04.2013,AM,BYBGD,3,1,1800
04.04.2013,AM,BYALL,2,1,2000
04.04.2013,AM,BYAMM,2,1,2000
04.04.2013,AM,BYWFK,2,1,2000
04.04.2013,AM,BYBVA,2,1,2000
04.04.2013,AM,BYCHG,2,1,2000
04.04.2013,AM,BYBGD,2,1,2000
04.04.2013,PM,BYALL,2,2,nan
04.04.2013,PM,BYAMM,2,2,nan
04.04.2013,PM,BYWFK,2,2,nan
04.04.2013,PM,BYBVA,2,2,nan
04.04.2013,PM,BYCHG,2,2,nan
04.04.2013,PM,BYBGD,2,2,nan
05.04.2013,AM,BYALL,1,2,2200
05.04.2013,AM,BYAMM,1,2,2200
05.04.2013,AM,BYWFK,1,2,2200
05.04.2013,AM,BYBVA,1,2,2200
05.04.2013,AM,BYCHG,1,2,2200
05.04.2013,AM,BYBGD,1,2,2200
06.04.2013,AM,BYALL,1,2,2200
06.04.2013,AM,BYAMM,1,1,nan
06.04.2013,AM,BYWFK,1,1,nan
06.04.2013,AM,BYBVA,1,1,nan
06.04.2013,AM,BYCHG,1,1,nan
06.04.2013,AM,BYBGD,1,1,nan
06.04.2013,PM,BYAMM,1,2,2200
06.04.2013,PM,BYWFK,1,2,2200
06.04.2013,PM,BYBVA,1,2,2200
06.04.2013,PM,BYCHG,1,2,2200
06.04.2013,PM,BYBGD,1,2,2200
07.04.2013,AM,BYALL,1,1,
07.04.2013,AM,BYAMM,1,1,
07.04.2013,AM,BYWFK,1,1,
07.04.2013,AM,BYBVA,1,1,
07.04.2013,AM,BYCHG,1,1,
07.04.2013,AM,BYBGD,1,1,
08.04.2013,AM,BYALL,1,1,nan
08.04.2013,AM,BYAMM,1,1,nan
08.04.2013,AM,BYWFK,1,1,nan
08.04.2013,AM,BYBVA,1,1,nan
08.04.2013,AM,BYCHG,1,1,nan
08.04.2013,AM,BYBGD,1,1,nan
08.04.2013,PM,BYALL,1,2,2200
08.04.2013,PM,BYAMM,1,2,2200
09.04.2013,AM,BYALL,1,1,nan
09.04.2013,AM,BYAMM,1,1,nan
09.04.2013,AM,BYWFK,1,1,nan
09.04.2013,AM,BYBVA,1,1,nan
09.04.2013,AM,BYCHG,1,1,nan
09.04.2013,AM,BYBGD,1,1,nan
09.04.2013,PM,BYALL,1,2,2000
09.04.2013,PM,BYAMM,1,2,2000
09.04.2013,PM,BYWFK,1,2,2000
09.04.2013,PM,BYBVA,1,2,2000
09.04.2013,PM,BYCHG,1,2,2000
09.04.2013,PM,BYBGD,1,2,2000
10.04.2013,AM,BYALL,1,1,nan
10.04.2013,AM,BYAMM,1,1,nan
10.04.2013,AM,BYWFK,1,1,nan
10.04.2013,AM,BYBVA,1,1,nan
10.04.2013,AM,BYCHG,1,1,nan
10.04.2013,AM,BYBGD,1,1,nan
10.04.2013,PM,BYALL,1,2,2000
10.04.2013,PM,BYAMM,1,2,2000
10.04.2013,PM,BYWFK,1,2,2000
10.04.2013,PM,BYBVA,1,2,2000
10.04.2013,PM,BYCHG,1,2,2000
10.04.2013,PM,BYBGD,1,2,2000
11.04.2013,AM,BYALL,2,2,nan
11.04.2013,AM,BYAMM,2,2,nan
11.04.2013,AM,BYWFK,2,2,nan
11.04.2013,AM,BYBVA,2,2,nan
11.04.2013,AM,BYCHG,2,2,nan
11.04.2013,AM,BYBGD,2,2,nan
11.04.2013,PM,BYALL,3,2,2000
11.04.2013,PM,BYAMM,3,2,2000
12.04.2013,AM,BYALL,2,2,
12.04.2013,AM,BYAMM,2,2,
12.04.2013,AM,BYWFK,2,2,
12.04.2013,AM,BYBVA,2,2,
12.04.2013,AM,BYCHG,2,2,
12.04.2013,AM,BYBGD,2,2,
13.04.2013,AM,BYALL,2,2,
13.04.2013,AM,BYAMM,2,2,
13.04.2013,AM,BYWFK,2,2,
13.04.2013,AM,BYBVA,2,2,
13.04.2013,AM,BYCHG,2,2,
13.04.2013,AM,BYBGD,2,2,
14.04.2013,AM,BYALL,2,3,2200
14.04.2013,AM,BYAMM,2,3,2200
14.04.2013,AM,BYWFK,2,3,2200
14.04.2013,AM,BYBVA,2,3,2200
14.04.2013,AM,BYCHG,2,3,2200
14.04.2013,AM,BYBGD,2,3,2200
15.04.2013,AM,BYALL,3,3,
15.04.2013,AM,BYAMM,3,3,
15.04.2013,AM,BYWFK,3,3,
15.04.2013,AM,BYBVA,3,3,
15.04.2013,AM,BYCHG,3,3,
15.04.2013,AM,BYBGD,3,3,
16.04.2013,AM,BYALL,3,3,
16.04.2013,AM,BYAMM,3,3,
16.04.2013,AM,BYWFK,3,3,
16.04.2013,AM,BYBVA,3,3,
16.04.2013,AM,BYCHG,3,3,
16.04.2013,AM,BYBGD,3,3,
17.04.2013,AM,BYALL,3,3,
17.04.2013,AM,BYAMM,3,3,
17.04.2013,AM,BYWFK,3,3,
17.04.2013,AM,BYBVA,3,3,
17.04.2013,AM,BYCHG,3,3,
17.04.2013,AM,BYBGD,3,3,
18.04.2013,AM,BYALL,2,2,
18.04.2013,AM,BYAMM,2,2,
18.04.2013,AM,BYWFK,2,2,
18.04.2013,AM,BYBVA,2,2,
18.04.2013,AM,BYCHG,2,2,
18.04.2013,AM,BYBGD,2,2,
18.04.2013,PM,BYALL,3,3,
18.04.2013,PM,BYAMM,3,3,
18.04.2013,PM,BYWFK,3,3,
18.04.2013,PM,BYBVA,3,3,
18.04.2013,PM,BYCHG,3,3,
18.04.2013,PM,BYBGD,3,3,
19.04.2013,AM,BYALL,2,3,2000
19.04.2013,AM,BYAMM,2,3,2000
19.04.2013,AM,BYWFK,2,3,2000
19.04.2013,AM,BYBVA,2,3,2000
19.04.2013,AM,BYCHG,2,3,2000
19.04.2013,AM,BYBGD,2,3,2000
19.04.2013,PM,BYALL,3,3,nan
19.04.2013,PM,BYAMM,3,3,nan
19.04.2013,PM,BYWFK,3,3,nan
19.04.2013,PM,BYBVA,3,3,nan
19.04.2013,PM,BYCHG,3,3,nan
19.04.2013,PM,BYBGD,3,3,nan
20.04.2013,AM,BYALL,3,3,
20.04.2013,AM,BYAMM,3,3,
20.04.2013,AM,BYWFK,3,3,
20.04.2013,AM,BYBVA,3,3,
20.04.2013,AM,BYCHG,3,3,
20.04.2013,AM,BYBGD,3,3,
21.04.2013,AM,BYALL,2,2,
21.04.2013,AM,BYAMM,2,2,
21.04.2013,AM,BYWFK,2,2,
21.04.2013,AM,BYBVA,2,2,
21.04.2013,AM,BYCHG,2,2,
21.04.2013,AM,BYBGD,2,2,
22.04.2013,AM,BYALL,2,2,
22.04.2013,AM,BYAMM,2,2,
22.04.2013,AM,BYWFK,2,2,
22.04.2013,AM,BYBVA,2,2,
22.04.2013,AM,BYCHG,2,2,
22.04.2013,AM,BYBGD,2,2,
23.04.2013,AM,BYALL,2,2,
23.04.2013,AM,BYAMM,2,2,
23.04.2013,AM,BYWFK,2,2,
23.04.2013,AM,BYBVA,2,2,
23.04.2013,AM,BYCHG,2,2,
23.04.2013,AM,BYBGD,2,2,
24.04.2013,AM,BYALL,3,3,
24.04.2013,AM,BYAMM,3,3,
24.04.2013,AM,BYWFK,3,3,
24.04.2013,AM,BYBVA,3,3,
24.04.2013,AM,BYCHG,3,3,
24.04.2013,AM,BYBGD,3,3,
25.04.2013,AM,BYALL,2,2,
25.04.2013,AM,BYAMM,2,2,
25.04.2013,AM,BYWFK,2,2,
25.04.2013,AM,BYBVA,2,2,
25.04.2013,AM,BYCHG,2,2,
25.04.2013,AM,BYBGD,2,2,
26.04.2013,AM,BYALL,2,2,
26.04.2013,AM,BYAMM,2,2,
26.04.2013,AM,BYWFK,2,2,
26.04.2013,AM,BYBVA,2,2,
26.04.2013,AM,BYCHG,2,2,
26.04.2013,AM,BYBGD,2,2,
27.04.2013,AM,BYALL,2,2,
27.04.2013,AM,BYAMM,2,2,
27.04.2013,AM,BYWFK,2,2,
27.04.2013,AM,BYBVA,2,2,
27.04.2013,AM,BYCHG,2,2,
27.04.2013,AM,BYBGD,2,2,
28.04.2013,AM,BYALL,2,2,
28.04.2013,AM,BYAMM,2,2,
28.04.2013,AM,BYWFK,2,2,
28.04.2013,AM,BYBVA,2,2,
28.04.2013,AM,BYCHG,2,2,
28.04.2013,AM,BYBGD,2,2,
29.04.2013,AM,BYALL,2,2,
29.04.2013,AM,BYAMM,2,2,
29.04.2013,AM,BYWFK,2,2,
29.04.2013,AM,BYBVA,2,2,
29.04.2013,AM,BYCHG,2,2,
29.04.2013,AM,BYBGD,2,2,
30.04.2013,AM,BYALL,2,2,
30.04.2013,AM,BYAMM,2,2,
30.04.2013,AM,BYWFK,2,2,
30.04.2013,AM,BYBVA,2,2,
30.04.2013,AM,BYCHG,2,2,
30.04.2013,AM,BYBGD,2,2,
01.05.2013,AM,BYALL,2,2,
01.05.2013,AM,BYAMM,2,2,
01.05.2013,AM,BYWFK,2,2,
01.05.2013,AM,BYBVA,2,2,
01.05.2013,AM,BYCHG,2,2,
01.05.2013,AM,BYBGD,2,2,
