[
  {
    "valid_regions": [
      "AT-05-07",
      "AT-05-06"
    ],
    "danger_main": [
      {
        "main_value": 3,
        "valid_elevation": ">2000"
      },
      {
        "main_value": 2,
        "valid_elevation": "<2000"
      }
    ],
    "dangerpattern": [],
    "problem_list": [
      {
        "problem_type": "new snow",
        "aspect": [
          "N",
          "NE",
          "E",
          "SE",
          "S",
          "SW",
          "W",
          "NW"
        ],
        "valid_elevation": null
      },
      {
        "problem_type": "old snow",
        "aspect": [
          "N",
          "NE",
          "E",
          "NW"
        ],
        "valid_elevation": null
      }
    ],
    "report_texts": null,
    "report_id": "RID414RGR1",
    "rep_date": "2021-02-15T17:00:00+00:00",
    "validity_begin": "2021-02-15T23:00:00+00:00",
    "validity_end": "2021-02-16T23:00:00+00:00"
  },
  {
    "valid_regions": [
      "AT-05-05",
      "AT-05-04"
    ],
    "danger_main": [
      {
        "main_value": 3,
        "valid_elevation": ">2000"
      },
      {
        "main_value": 2,
        "valid_elevation": "<2000"
      }
    ],
    "dangerpattern": [],
    "problem_list": [
      {
        "problem_type": "drifting snow",
        "aspect": [
          "N",
          "NE",
          "E",
          "SE",
          "S",
          "SW",
          "W",
          "NW"
        ],
        "valid_elevation": null
      },
      {
        "problem_type": "old snow",
        "aspect": [
          "N",
          "NE",
          "NW"
        ],
        "valid_elevation": null
      }
    ],
    "report_texts": null,
    "report_id": "RID414RGR2",
    "rep_date": "2021-02-15T17:00:00+00:00",
    "validity_begin": "2021-02-15T23:00:00+00:00",
    "validity_end": "2021-02-16T23:00:00+00:00"
  },
  {
    "valid_regions": [
      "AT-05-11",
      "AT-05-15",
      "AT-05-14",
      "AT-05-10",
      "AT-05-09",
      "AT-05-13",
      "AT-05-17",
      "AT-05-18",
      "AT-05-21",
      "AT-05-20",
      "AT-05-16",
      "AT-05-12",
      "AT-05-08"
    ],
    "danger_main": [
      {
        "main_value": 2,
        "valid_elevation": ">1800"
      },
      {
        "main_value": 1,
        "valid_elevation": "<1800"
      }
    ],
    "dangerpattern": [],
    "problem_list": [
      {
        "problem_type": "drifting snow",
        "aspect": [
          "NE",
          "E",
          "SE",
          "S",
          "SW"
        ],
        "valid_elevation": null
      },
      {
        "problem_type": "old snow",
        "aspect": [
          "N",
          "NE",
          "NW"
        ],
        "valid_elevation": null
      }
    ],
    "report_texts": null,
    "report_id": "RID414RGR3",
    "rep_date": "2021-02-15T17:00:00+00:00",
    "validity_begin": "2021-02-15T23:00:00+00:00",
    "validity_end": "2021-02-16T23:00:00+00:00"
  },
  {
    "valid_regions": [
      "AT-05-19"
    ],
    "danger_main": [
      {
        "main_value": 2,
        "valid_elevation": ">1500"
      },
      {
        "main_value": 1,
        "valid_elevation": "<1500"
      }
    ],
    "dangerpattern": [],
    "problem_list": [
      {
        "problem_type": "drifting snow",
        "aspect": [
          "NE",
          "E",
          "SE",
          "S"
        ],
        "valid_elevation": null
      },
      {
        "problem_type": "old snow",
        "aspect": [
          "N",
          "NE",
          "NW"
        ],
        "valid_elevation": null
      }
    ],
    "report_texts": null,
    "report_id": "RID414RGR4",
    "rep_date": "2021-02-15T17:00:00+00:00",
    "validity_begin": "2021-02-15T23:00:00+00:00",
    "validity_end": "2021-02-16T23:00:00+00:00"
  },
  {
    "valid_regions": [
      "AT-05-03",
      "AT-05-01",
      "AT-05-02"
    ],
    "danger_main": [
      {
        "main_value": 3,
        "valid_elevation": ">2000"
      },
      {
        "main_value": 2,
        "valid_elevation": "<2000"
      }
    ],
    "dangerpattern": [],
    "problem_list": [
      {
        "problem_type": "drifting snow",
        "aspect": [
          "NE",
          "E",
          "SE",
          "S",
          "SW"
        ],
        "valid_elevation": null
      },
      {
        "problem_type": "old snow",
        "aspect": [
          "N",
          "NE",
          "E",
          "NW"
        ],
        "valid_elevation": null
      }
    ],
    "report_texts": null,
    "report_id": "RID414RGR5",
    "rep_date": "2021-02-15T17:00:00+00:00",
    "validity_begin": "2021-02-15T23:00:00+00:00",
    "validity_end": "2021-02-16T23:00:00+00:00"
  }
]