[
  {
    "valid_regions": [
      "AT-03-01",
      "AT-03-02",
      "AT-03-03",
      "AT-03-06",
      "AT-03-04",
      "AT-03-05"
    ],
    "danger_main": [
      {
        "main_value": 1,
        "valid_elevation": null
      }
    ],
    "dangerpattern": [],
    "problem_list": [
      {
        "problem_type": "drifting snow",
        "aspect": [
          "N",
          "NE",
          "E",
          "NW"
        ],
        "valid_elevation": null
      }
    ],
    "report_texts": null,
    "report_id": "RID122RGR1",
    "rep_date": "2020-12-31T17:00:00+00:00",
    "validity_begin": "2020-12-31T23:00:00+00:00",
    "validity_end": "2021-01-01T23:00:00+00:00"
  }
]