[
  {
    "valid_regions": [
      "AT-04-01",
      "AT-04-02",
      "AT-04-05",
      "AT-04-03",
      "AT-04-06",
      "AT-04-07",
      "AT-04-04",
      "AT-04-08"
    ],
    "danger_main": [
      {
        "main_value": 3,
        "valid_elevation": ">1400"
      },
      {
        "main_value": 2,
        "valid_elevation": "<1400"
      }
    ],
    "dangerpattern": [],
    "problem_list": [
      {
        "problem_type": "drifting snow",
        "aspect": [
          "N",
          "NE",
          "E",
          "SE",
          "S",
          "SW",
          "W",
          "NW"
        ],
        "valid_elevation": null
      },
      {
        "problem_type": "old snow",
        "aspect": [
          "N",
          "NE",
          "NW"
        ],
        "valid_elevation": null
      }
    ],
    "report_texts": null,
    "report_id": "RID200RGR1",
    "rep_date": "2021-01-16T13:24:42+00:00",
    "validity_begin": "2021-01-16T13:24:42+00:00",
    "validity_end": "2021-01-17T08:00:00+00:00"
  },
  {
    "valid_regions": [
      "AT-04-09"
    ],
    "danger_main": [
      {
        "main_value": 2,
        "valid_elevation": ">1200"
      },
      {
        "main_value": 1,
        "valid_elevation": "<1200"
      }
    ],
    "dangerpattern": [],
    "problem_list": [
      {
        "problem_type": "drifting snow",
        "aspect": [
          "NE",
          "E",
          "SE",
          "S"
        ],
        "valid_elevation": null
      }
    ],
    "report_texts": null,
    "report_id": "RID200RGR2",
    "rep_date": "2021-01-16T13:24:42+00:00",
    "validity_begin": "2021-01-16T13:24:42+00:00",
    "validity_end": "2021-01-17T08:00:00+00:00"
  }
]