Date,Daytime,Region,Subregion,DangerRatingBelow,DangerRatingAbove,DangerRatingElevation,AvalancheProblem1,AvalancheProblem1ElevationAbove,AvalancheProblem1ElevationBelow,AvalancheProblem1AspectN,AvalancheProblem1AspectNE,AvalancheProblem1AspectE,AvalancheProblem1AspectSE,AvalancheProblem1AspectS,AvalancheProblem1AspectSW,AvalancheProblem1AspectW,AvalancheProblem1AspectNW,AvalancheProblem2,AvalancheProblem2ElevationAbove,AvalancheProblem2ElevationBelow,AvalancheProblem2AspectN,AvalancheProblem2AspectNE,AvalancheProblem2AspectE,AvalancheProblem2AspectSE,AvalancheProblem2AspectS,AvalancheProblem2AspectSW,AvalancheProblem2AspectW,AvalancheProblem2AspectNW
2020-12-08,AM,AT-08,1,2,2,NaN,wind_drifted_snow,treeline,NaN,1,1,1,0,0,0,1,1,gliding_snow,NaN,2500,0,0,1,1,1,1,1,0
2020-12-08,AM,AT-08,2,2,2,NaN,wind_drifted_snow,treeline,NaN,1,1,1,0,0,0,1,1,gliding_snow,NaN,2500,0,0,1,1,1,1,1,0
2020-12-08,AM,AT-08,3,2,3,2000,wind_drifted_snow,treeline,NaN,1,1,1,0,0,0,1,1,gliding_snow,NaN,2500,0,0,1,1,1,1,1,0
2020-12-08,AM,AT-08,4,2,3,2000,wind_drifted_snow,treeline,NaN,1,1,1,0,0,0,1,1,gliding_snow,NaN,2500,0,0,1,1,1,1,1,0
2020-12-08,AM,AT-08,5,2,3,1800,wind_drifted_snow,treeline,NaN,1,1,1,0,0,0,1,1,gliding_snow,NaN,2500,0,0,1,1,1,1,1,0
2020-12-08,AM,AT-08,6,2,3,1800,wind_drifted_snow,treeline,NaN,1,1,1,0,0,0,1,1,gliding_snow,NaN,2500,0,0,1,1,1,1,1,0
2020-12-09,AM,AT-08,1,2,2,NaN,wind_drifted_snow,2000,NaN,1,1,1,0,0,0,1,1,gliding_snow,NaN,2500,0,0,1,1,1,1,1,0
2020-12-09,AM,AT-08,2,2,2,NaN,wind_drifted_snow,2000,NaN,1,1,1,0,0,0,1,1,gliding_snow,NaN,2500,0,0,1,1,1,1,1,0
2020-12-09,AM,AT-08,3,2,3,2000,wind_drifted_snow,2000,NaN,1,1,1,0,0,0,1,1,gliding_snow,NaN,2500,0,0,1,1,1,1,1,0
2020-12-09,AM,AT-08,4,2,3,2000,wind_drifted_snow,2000,NaN,1,1,1,0,0,0,1,1,gliding_snow,NaN,2500,0,0,1,1,1,1,1,0
2020-12-09,AM,AT-08,5,2,3,2000,wind_drifted_snow,2000,NaN,1,1,1,0,0,0,1,1,gliding_snow,NaN,2500,0,0,1,1,1,1,1,0
2020-12-09,AM,AT-08,6,2,3,2000,wind_drifted_snow,2000,NaN,1,1,1,0,0,0,1,1,gliding_snow,NaN,2500,0,0,1,1,1,1,1,0
2020-12-10,AM,AT-08,1,2,2,NaN,wind_drifted_snow,2200,NaN,1,1,1,0,0,0,1,1,persistent_weak_layer,2000,NaN,1,1,0,0,0,0,0,1
2020-12-10,AM,AT-08,2,2,2,NaN,wind_drifted_snow,2200,NaN,1,1,1,0,0,0,1,1,persistent_weak_layer,2000,NaN,1,1,0,0,0,0,0,1
2020-12-10,AM,AT-08,3,2,3,2000,wind_drifted_snow,2200,NaN,1,1,1,0,0,0,1,1,persistent_weak_layer,2000,NaN,1,1,0,0,0,0,0,1
2020-12-10,AM,AT-08,4,2,3,2200,wind_drifted_snow,2200,NaN,1,1,1,0,0,0,1,1,persistent_weak_layer,2000,NaN,1,1,0,0,0,0,0,1
2020-12-10,AM,AT-08,5,2,3,2200,wind_drifted_snow,2200,NaN,1,1,1,0,0,0,1,1,persistent_weak_layer,2000,NaN,1,1,0,0,0,0,0,1
2020-12-10,AM,AT-08,6,2,3,2200,wind_drifted_snow,2200,NaN,1,1,1,0,0,0,1,1,persistent_weak_layer,2000,NaN,1,1,0,0,0,0,0,1
2020-12-11,AM,AT-08,1,2,2,NaN,wind_drifted_snow,2000,NaN,1,1,1,0,0,0,1,1,persistent_weak_layer,2000,NaN,1,1,0,0,0,0,0,1
2020-12-11,AM,AT-08,2,2,3,2000,wind_drifted_snow,2000,NaN,1,1,1,0,0,0,1,1,persistent_weak_layer,2000,NaN,1,1,0,0,0,0,0,1
2020-12-11,AM,AT-08,3,2,3,2000,wind_drifted_snow,2000,NaN,1,1,1,0,0,0,1,1,persistent_weak_layer,2000,NaN,1,1,0,0,0,0,0,1
2020-12-11,AM,AT-08,4,2,3,2000,wind_drifted_snow,2000,NaN,1,1,1,0,0,0,1,1,persistent_weak_layer,2000,NaN,1,1,0,0,0,0,0,1
2020-12-11,AM,AT-08,5,2,3,2000,wind_drifted_snow,2000,NaN,1,1,1,0,0,0,1,1,persistent_weak_layer,2000,NaN,1,1,0,0,0,0,0,1
2020-12-11,AM,AT-08,6,2,3,2000,wind_drifted_snow,2000,NaN,1,1,1,0,0,0,1,1,persistent_weak_layer,2000,NaN,1,1,0,0,0,0,0,1
2020-12-12,AM,AT-08,1,2,2,NaN,wind_drifted_snow,1800,NaN,1,1,1,0,0,0,1,1,persistent_weak_layer,2200,NaN,1,1,0,0,0,0,0,1
2020-12-12,AM,AT-08,2,2,3,2000,wind_drifted_snow,1800,NaN,1,1,1,0,0,0,1,1,persistent_weak_layer,2200,NaN,1,1,0,0,0,0,0,1
2020-12-12,AM,AT-08,3,2,3,2000,wind_drifted_snow,1800,NaN,1,1,1,0,0,0,1,1,persistent_weak_layer,2200,NaN,1,1,0,0,0,0,0,1
2020-12-12,AM,AT-08,4,2,3,2200,wind_drifted_snow,1800,NaN,1,1,1,0,0,0,1,1,persistent_weak_layer,2200,NaN,1,1,0,0,0,0,0,1
2020-12-12,AM,AT-08,5,2,3,2200,wind_drifted_snow,1800,NaN,1,1,1,0,0,0,1,1,persistent_weak_layer,2200,NaN,1,1,0,0,0,0,0,1
2020-12-12,AM,AT-08,6,2,3,2200,wind_drifted_snow,1800,NaN,1,1,1,0,0,0,1,1,persistent_weak_layer,2200,NaN,1,1,0,0,0,0,0,1
2020-12-13,AM,AT-08,1,2,2,NaN,wind_drifted_snow,1600,NaN,1,1,1,1,0,0,1,1,persistent_weak_layer,2200,NaN,1,1,0,0,0,0,0,1
2020-12-13,AM,AT-08,2,2,3,1800,wind_drifted_snow,1600,NaN,1,1,1,1,0,0,1,1,persistent_weak_layer,2200,NaN,1,1,0,0,0,0,0,1
2020-12-13,AM,AT-08,3,2,3,1800,wind_drifted_snow,1600,NaN,1,1,1,1,0,0,1,1,persistent_weak_layer,2200,NaN,1,1,0,0,0,0,0,1
2020-12-13,AM,AT-08,4,2,3,2000,wind_drifted_snow,1600,NaN,1,1,1,1,0,0,1,1,persistent_weak_layer,2200,NaN,1,1,0,0,0,0,0,1
2020-12-13,AM,AT-08,5,2,3,2200,wind_drifted_snow,1600,NaN,1,1,1,1,0,0,1,1,persistent_weak_layer,2200,NaN,1,1,0,0,0,0,0,1
2020-12-13,AM,AT-08,6,2,3,2200,wind_drifted_snow,1600,NaN,1,1,1,1,0,0,1,1,persistent_weak_layer,2200,NaN,1,1,0,0,0,0,0,1
2020-12-14,AM,AT-08,1,2,2,NaN,wind_drifted_snow,1800,NaN,1,1,1,1,0,0,1,1,persistent_weak_layer,2000,NaN,1,1,0,0,0,0,0,1
2020-12-14,AM,AT-08,2,2,3,2000,wind_drifted_snow,1800,NaN,1,1,1,1,0,0,1,1,persistent_weak_layer,2000,NaN,1,1,0,0,0,0,0,1
2020-12-14,AM,AT-08,3,2,3,2000,wind_drifted_snow,1800,NaN,1,1,1,1,0,0,1,1,persistent_weak_layer,2000,NaN,1,1,0,0,0,0,0,1
2020-12-14,AM,AT-08,4,2,3,2000,wind_drifted_snow,1800,NaN,1,1,1,1,0,0,1,1,persistent_weak_layer,2000,NaN,1,1,0,0,0,0,0,1
2020-12-14,AM,AT-08,5,2,3,2200,wind_drifted_snow,1800,NaN,1,1,1,1,0,0,1,1,persistent_weak_layer,2000,NaN,1,1,0,0,0,0,0,1
2020-12-14,AM,AT-08,6,2,3,2200,wind_drifted_snow,1800,NaN,1,1,1,1,0,0,1,1,persistent_weak_layer,2000,NaN,1,1,0,0,0,0,0,1
2020-12-15,AM,AT-08,1,2,2,NaN,wind_drifted_snow,2000,NaN,1,1,1,1,0,0,1,1,persistent_weak_layer,2000,NaN,1,1,0,0,0,0,0,1
2020-12-15,AM,AT-08,2,2,3,2000,wind_drifted_snow,2000,NaN,1,1,1,1,0,0,1,1,persistent_weak_layer,2000,NaN,1,1,0,0,0,0,0,1
2020-12-15,AM,AT-08,3,2,3,2000,wind_drifted_snow,2000,NaN,1,1,1,1,0,0,1,1,persistent_weak_layer,2000,NaN,1,1,0,0,0,0,0,1
2020-12-15,AM,AT-08,4,2,3,2000,wind_drifted_snow,2000,NaN,1,1,1,1,0,0,1,1,persistent_weak_layer,2000,NaN,1,1,0,0,0,0,0,1
2020-12-15,AM,AT-08,5,2,3,2200,wind_drifted_snow,2000,NaN,1,1,1,1,0,0,1,1,persistent_weak_layer,2000,NaN,1,1,0,0,0,0,0,1
2020-12-15,AM,AT-08,6,2,3,2200,wind_drifted_snow,2000,NaN,1,1,1,1,0,0,1,1,persistent_weak_layer,2000,NaN,1,1,0,0,0,0,0,1
2020-12-16,AM,AT-08,1,2,2,NaN,persistent_weak_layer,2200,NaN,1,1,0,0,0,0,0,1,wind_drifted_snow,2200,NaN,1,1,1,0,0,0,1,1
2020-12-16,AM,AT-08,2,2,3,2200,persistent_weak_layer,2200,NaN,1,1,0,0,0,0,0,1,wind_drifted_snow,2200,NaN,1,1,1,0,0,0,1,1
2020-12-16,AM,AT-08,3,2,3,2200,persistent_weak_layer,2200,NaN,1,1,0,0,0,0,0,1,wind_drifted_snow,2200,NaN,1,1,1,0,0,0,1,1
2020-12-16,AM,AT-08,4,2,3,2200,persistent_weak_layer,2200,NaN,1,1,0,0,0,0,0,1,wind_drifted_snow,2200,NaN,1,1,1,0,0,0,1,1
2020-12-16,AM,AT-08,5,2,3,2200,persistent_weak_layer,2200,NaN,1,1,0,0,0,0,0,1,wind_drifted_snow,2200,NaN,1,1,1,0,0,0,1,1
2020-12-16,AM,AT-08,6,2,3,2200,persistent_weak_layer,2200,NaN,1,1,0,0,0,0,0,1,wind_drifted_snow,2200,NaN,1,1,1,0,0,0,1,1
2020-12-17,AM,AT-08,1,2,2,NaN,persistent_weak_layer,2200,NaN,1,1,0,0,0,0,0,1,wind_drifted_snow,2200,NaN,1,1,1,0,0,0,1,1
2020-12-17,AM,AT-08,2,2,3,2200,persistent_weak_layer,2200,NaN,1,1,0,0,0,0,0,1,wind_drifted_snow,2200,NaN,1,1,1,0,0,0,1,1
2020-12-17,AM,AT-08,3,2,3,2200,persistent_weak_layer,2200,NaN,1,1,0,0,0,0,0,1,wind_drifted_snow,2200,NaN,1,1,1,0,0,0,1,1
2020-12-17,AM,AT-08,4,2,3,2200,persistent_weak_layer,2200,NaN,1,1,0,0,0,0,0,1,wind_drifted_snow,2200,NaN,1,1,1,0,0,0,1,1
2020-12-17,AM,AT-08,5,2,3,2200,persistent_weak_layer,2200,NaN,1,1,0,0,0,0,0,1,wind_drifted_snow,2200,NaN,1,1,1,0,0,0,1,1
2020-12-17,AM,AT-08,6,2,3,2200,persistent_weak_layer,2200,NaN,1,1,0,0,0,0,0,1,wind_drifted_snow,2200,NaN,1,1,1,0,0,0,1,1
2020-12-18,AM,AT-08,1,2,2,NaN,persistent_weak_layer,2000,NaN,1,1,1,0,0,0,1,1,wind_drifted_snow,2400,NaN,1,1,0,0,0,0,0,1
2020-12-18,AM,AT-08,2,2,2,NaN,persistent_weak_layer,2000,NaN,1,1,1,0,0,0,1,1,wind_drifted_snow,2400,NaN,1,1,0,0,0,0,0,1
2020-12-18,AM,AT-08,3,2,2,NaN,persistent_weak_layer,2000,NaN,1,1,1,0,0,0,1,1,wind_drifted_snow,2400,NaN,1,1,0,0,0,0,0,1
2020-12-18,AM,AT-08,4,2,2,NaN,persistent_weak_layer,2000,NaN,1,1,1,0,0,0,1,1,wind_drifted_snow,2400,NaN,1,1,0,0,0,0,0,1
2020-12-18,AM,AT-08,5,2,2,NaN,persistent_weak_layer,2000,NaN,1,1,1,0,0,0,1,1,wind_drifted_snow,2400,NaN,1,1,0,0,0,0,0,1
2020-12-18,AM,AT-08,6,2,2,NaN,persistent_weak_layer,2000,NaN,1,1,1,0,0,0,1,1,wind_drifted_snow,2400,NaN,1,1,0,0,0,0,0,1
2020-12-19,AM,AT-08,1,2,2,NaN,persistent_weak_layer,2000,NaN,1,1,1,0,0,0,1,1,wind_drifted_snow,2400,NaN,1,1,0,0,0,0,0,1
2020-12-19,AM,AT-08,2,2,2,NaN,persistent_weak_layer,2000,NaN,1,1,1,0,0,0,1,1,wind_drifted_snow,2400,NaN,1,1,0,0,0,0,0,1
2020-12-19,AM,AT-08,3,2,2,NaN,persistent_weak_layer,2000,NaN,1,1,1,0,0,0,1,1,wind_drifted_snow,2400,NaN,1,1,0,0,0,0,0,1
2020-12-19,AM,AT-08,4,2,2,NaN,persistent_weak_layer,2000,NaN,1,1,1,0,0,0,1,1,wind_drifted_snow,2400,NaN,1,1,0,0,0,0,0,1
2020-12-19,AM,AT-08,5,2,2,NaN,persistent_weak_layer,2000,NaN,1,1,1,0,0,0,1,1,wind_drifted_snow,2400,NaN,1,1,0,0,0,0,0,1
2020-12-19,AM,AT-08,6,2,2,NaN,persistent_weak_layer,2000,NaN,1,1,1,0,0,0,1,1,wind_drifted_snow,2400,NaN,1,1,0,0,0,0,0,1
2020-12-20,AM,AT-08,1,2,2,NaN,persistent_weak_layer,2200,NaN,1,1,1,0,0,0,1,1,wind_drifted_snow,2400,NaN,1,1,0,0,0,0,0,1
2020-12-20,AM,AT-08,2,2,2,NaN,persistent_weak_layer,2200,NaN,1,1,1,0,0,0,1,1,wind_drifted_snow,2400,NaN,1,1,0,0,0,0,0,1
2020-12-20,AM,AT-08,3,2,2,NaN,persistent_weak_layer,2200,NaN,1,1,1,0,0,0,1,1,wind_drifted_snow,2400,NaN,1,1,0,0,0,0,0,1
2020-12-20,AM,AT-08,4,2,2,NaN,persistent_weak_layer,2200,NaN,1,1,1,0,0,0,1,1,wind_drifted_snow,2400,NaN,1,1,0,0,0,0,0,1
2020-12-20,AM,AT-08,5,2,2,NaN,persistent_weak_layer,2200,NaN,1,1,1,0,0,0,1,1,wind_drifted_snow,2400,NaN,1,1,0,0,0,0,0,1
2020-12-20,AM,AT-08,6,2,2,NaN,persistent_weak_layer,2200,NaN,1,1,1,0,0,0,1,1,wind_drifted_snow,2400,NaN,1,1,0,0,0,0,0,1
2020-12-21,AM,AT-08,1,1,2,treeline,persistent_weak_layer,2200,NaN,1,1,1,0,0,0,1,1,NaN,NaN,NaN,NaN,NaN,NaN,NaN,NaN,NaN,NaN,NaN
2020-12-21,AM,AT-08,2,1,2,treeline,persistent_weak_layer,2200,NaN,1,1,1,0,0,0,1,1,NaN,NaN,NaN,NaN,NaN,NaN,NaN,NaN,NaN,NaN,NaN
2020-12-21,AM,AT-08,3,1,2,treeline,persistent_weak_layer,2200,NaN,1,1,1,0,0,0,1,1,NaN,NaN,NaN,NaN,NaN,NaN,NaN,NaN,NaN,NaN,NaN
2020-12-21,AM,AT-08,4,1,2,treeline,persistent_weak_layer,2200,NaN,1,1,1,0,0,0,1,1,NaN,NaN,NaN,NaN,NaN,NaN,NaN,NaN,NaN,NaN,NaN
2020-12-21,AM,AT-08,5,1,2,treeline,persistent_weak_layer,2200,NaN,1,1,1,0,0,0,1,1,NaN,NaN,NaN,NaN,NaN,NaN,NaN,NaN,NaN,NaN,NaN
2020-12-21,AM,AT-08,6,1,2,treeline,persistent_weak_layer,2200,NaN,1,1,1,0,0,0,1,1,NaN,NaN,NaN,NaN,NaN,NaN,NaN,NaN,NaN,NaN,NaN
2020-12-22,AM,AT-08,1,2,2,NaN,persistent_weak_layer,2200,NaN,1,1,1,0,0,0,1,1,wind_drifted_snow,2200,NaN,1,1,1,0,0,0,0,1
2020-12-22,AM,AT-08,2,2,2,NaN,persistent_weak_layer,2200,NaN,1,1,1,0,0,0,1,1,wind_drifted_snow,2200,NaN,1,1,1,0,0,0,0,1
2020-12-22,AM,AT-08,3,2,2,NaN,persistent_weak_layer,2200,NaN,1,1,1,0,0,0,1,1,wind_drifted_snow,2200,NaN,1,1,1,0,0,0,0,1
2020-12-22,AM,AT-08,4,2,2,NaN,persistent_weak_layer,2200,NaN,1,1,1,0,0,0,1,1,wind_drifted_snow,2200,NaN,1,1,1,0,0,0,0,1
2020-12-22,AM,AT-08,5,2,2,NaN,persistent_weak_layer,2200,NaN,1,1,1,0,0,0,1,1,wind_drifted_snow,2200,NaN,1,1,1,0,0,0,0,1
2020-12-22,AM,AT-08,6,2,2,NaN,persistent_weak_layer,2200,NaN,1,1,1,0,0,0,1,1,wind_drifted_snow,2200,NaN,1,1,1,0,0,0,0,1
2020-12-23,AM,AT-08,1,1,2,treeline,persistent_weak_layer,2200,NaN,1,1,1,0,0,0,1,1,wind_drifted_snow,2200,NaN,1,1,1,0,0,0,0,1
2020-12-23,AM,AT-08,2,1,2,treeline,persistent_weak_layer,2200,NaN,1,1,1,0,0,0,1,1,wind_drifted_snow,2200,NaN,1,1,1,0,0,0,0,1
2020-12-23,AM,AT-08,3,1,2,treeline,persistent_weak_layer,2200,NaN,1,1,1,0,0,0,1,1,wind_drifted_snow,2200,NaN,1,1,1,0,0,0,0,1
2020-12-23,AM,AT-08,4,1,2,treeline,persistent_weak_layer,2200,NaN,1,1,1,0,0,0,1,1,wind_drifted_snow,2200,NaN,1,1,1,0,0,0,0,1
2020-12-23,AM,AT-08,5,1,2,treeline,persistent_weak_layer,2200,NaN,1,1,1,0,0,0,1,1,wind_drifted_snow,2200,NaN,1,1,1,0,0,0,0,1
2020-12-23,AM,AT-08,6,1,2,treeline,persistent_weak_layer,2200,NaN,1,1,1,0,0,0,1,1,wind_drifted_snow,2200,NaN,1,1,1,0,0,0,0,1
2020-12-24,AM,AT-08,1,1,2,1800,wind_drifted_snow,2000,NaN,1,1,1,0,0,0,1,1,persistent_weak_layer,2200,NaN,1,1,1,0,0,0,1,1
2020-12-24,AM,AT-08,2,1,2,1800,wind_drifted_snow,2000,NaN,1,1,1,0,0,0,1,1,persistent_weak_layer,2200,NaN,1,1,1,0,0,0,1,1
2020-12-24,AM,AT-08,3,1,2,1800,wind_drifted_snow,2000,NaN,1,1,1,0,0,0,1,1,persistent_weak_layer,2200,NaN,1,1,1,0,0,0,1,1
2020-12-24,AM,AT-08,4,1,2,1800,wind_drifted_snow,2000,NaN,1,1,1,0,0,0,1,1,persistent_weak_layer,2200,NaN,1,1,1,0,0,0,1,1
2020-12-24,AM,AT-08,5,1,2,1800,wind_drifted_snow,2000,NaN,1,1,1,0,0,0,1,1,persistent_weak_layer,2200,NaN,1,1,1,0,0,0,1,1
2020-12-24,AM,AT-08,6,1,2,1800,wind_drifted_snow,2000,NaN,1,1,1,0,0,0,1,1,persistent_weak_layer,2200,NaN,1,1,1,0,0,0,1,1
2020-12-25,AM,AT-08,1,2,3,2000,wind_drifted_snow,1800,NaN,1,1,1,1,1,1,1,1,persistent_weak_layer,2200,NaN,1,1,1,0,0,0,1,1
2020-12-25,AM,AT-08,2,2,3,2000,wind_drifted_snow,1800,NaN,1,1,1,1,1,1,1,1,persistent_weak_layer,2200,NaN,1,1,1,0,0,0,1,1
2020-12-25,AM,AT-08,3,2,3,2000,wind_drifted_snow,1800,NaN,1,1,1,1,1,1,1,1,persistent_weak_layer,2200,NaN,1,1,1,0,0,0,1,1
2020-12-25,AM,AT-08,4,2,3,2000,wind_drifted_snow,1800,NaN,1,1,1,1,1,1,1,1,persistent_weak_layer,2200,NaN,1,1,1,0,0,0,1,1
2020-12-25,AM,AT-08,5,2,3,2000,wind_drifted_snow,1800,NaN,1,1,1,1,1,1,1,1,persistent_weak_layer,2200,NaN,1,1,1,0,0,0,1,1
2020-12-25,AM,AT-08,6,2,3,2000,wind_drifted_snow,1800,NaN,1,1,1,1,1,1,1,1,persistent_weak_layer,2200,NaN,1,1,1,0,0,0,1,1
2020-12-26,AM,AT-08,1,2,3,1800,wind_drifted_snow,treeline,NaN,1,1,1,1,1,1,1,1,persistent_weak_layer,2200,NaN,1,1,1,0,0,0,1,1
2020-12-26,AM,AT-08,2,2,3,1800,wind_drifted_snow,treeline,NaN,1,1,1,1,1,1,1,1,persistent_weak_layer,2200,NaN,1,1,1,0,0,0,1,1
2020-12-26,AM,AT-08,3,2,3,1800,wind_drifted_snow,treeline,NaN,1,1,1,1,1,1,1,1,persistent_weak_layer,2200,NaN,1,1,1,0,0,0,1,1
2020-12-26,AM,AT-08,4,2,3,1800,wind_drifted_snow,treeline,NaN,1,1,1,1,1,1,1,1,persistent_weak_layer,2200,NaN,1,1,1,0,0,0,1,1
2020-12-26,AM,AT-08,5,2,3,1800,wind_drifted_snow,treeline,NaN,1,1,1,1,1,1,1,1,persistent_weak_layer,2200,NaN,1,1,1,0,0,0,1,1
2020-12-26,AM,AT-08,6,2,3,1800,wind_drifted_snow,treeline,NaN,1,1,1,1,1,1,1,1,persistent_weak_layer,2200,NaN,1,1,1,0,0,0,1,1
2020-12-27,AM,AT-08,1,2,3,1800,wind_drifted_snow,treeline,NaN,1,1,1,0,0,0,1,1,persistent_weak_layer,2200,NaN,1,1,1,0,0,0,1,1
2020-12-27,AM,AT-08,2,2,3,1800,wind_drifted_snow,treeline,NaN,1,1,1,0,0,0,1,1,persistent_weak_layer,2200,NaN,1,1,1,0,0,0,1,1
2020-12-27,AM,AT-08,3,2,3,1800,wind_drifted_snow,treeline,NaN,1,1,1,0,0,0,1,1,persistent_weak_layer,2200,NaN,1,1,1,0,0,0,1,1
2020-12-27,AM,AT-08,4,2,3,1800,wind_drifted_snow,treeline,NaN,1,1,1,0,0,0,1,1,persistent_weak_layer,2200,NaN,1,1,1,0,0,0,1,1
2020-12-27,AM,AT-08,5,2,3,2000,wind_drifted_snow,treeline,NaN,1,1,1,0,0,0,1,1,persistent_weak_layer,2200,NaN,1,1,1,0,0,0,1,1
2020-12-27,AM,AT-08,6,2,3,2000,wind_drifted_snow,treeline,NaN,1,1,1,0,0,0,1,1,persistent_weak_layer,2200,NaN,1,1,1,0,0,0,1,1
2020-12-28,AM,AT-08,1,2,3,treeline,wind_drifted_snow,treeline,NaN,1,1,1,1,1,1,1,1,persistent_weak_layer,2200,NaN,1,1,1,0,0,0,1,1
2020-12-28,AM,AT-08,2,2,3,treeline,wind_drifted_snow,treeline,NaN,1,1,1,1,1,1,1,1,persistent_weak_layer,2200,NaN,1,1,1,0,0,0,1,1
2020-12-28,AM,AT-08,3,2,3,treeline,wind_drifted_snow,treeline,NaN,1,1,1,1,1,1,1,1,persistent_weak_layer,2200,NaN,1,1,1,0,0,0,1,1
2020-12-28,AM,AT-08,4,2,3,treeline,wind_drifted_snow,treeline,NaN,1,1,1,1,1,1,1,1,persistent_weak_layer,2200,NaN,1,1,1,0,0,0,1,1
2020-12-28,AM,AT-08,5,2,3,treeline,wind_drifted_snow,treeline,NaN,1,1,1,1,1,1,1,1,persistent_weak_layer,2200,NaN,1,1,1,0,0,0,1,1
2020-12-28,AM,AT-08,6,2,3,treeline,wind_drifted_snow,treeline,NaN,1,1,1,1,1,1,1,1,persistent_weak_layer,2200,NaN,1,1,1,0,0,0,1,1
2020-12-29,AM,AT-08,1,2,3,treeline,wind_drifted_snow,treeline,NaN,1,1,1,1,1,1,1,1,persistent_weak_layer,2200,NaN,1,1,1,0,0,0,1,1
2020-12-29,AM,AT-08,2,2,3,treeline,wind_drifted_snow,treeline,NaN,1,1,1,1,1,1,1,1,persistent_weak_layer,2200,NaN,1,1,1,0,0,0,1,1
2020-12-29,AM,AT-08,3,2,3,treeline,wind_drifted_snow,treeline,NaN,1,1,1,1,1,1,1,1,persistent_weak_layer,2200,NaN,1,1,1,0,0,0,1,1
2020-12-29,AM,AT-08,4,2,3,treeline,wind_drifted_snow,treeline,NaN,1,1,1,1,1,1,1,1,persistent_weak_layer,2200,NaN,1,1,1,0,0,0,1,1
2020-12-29,AM,AT-08,5,2,3,treeline,wind_drifted_snow,treeline,NaN,1,1,1,1,1,1,1,1,persistent_weak_layer,2200,NaN,1,1,1,0,0,0,1,1
2020-12-29,AM,AT-08,6,2,3,treeline,wind_drifted_snow,treeline,NaN,1,1,1,1,1,1,1,1,persistent_weak_layer,2200,NaN,1,1,1,0,0,0,1,1
2020-12-30,AM,AT-08,1,2,3,1800,wind_drifted_snow,1800,NaN,1,1,1,1,0,0,1,1,persistent_weak_layer,2200,NaN,1,1,1,0,0,0,1,1
2020-12-30,AM,AT-08,2,2,3,1800,wind_drifted_snow,1800,NaN,1,1,1,1,0,0,1,1,persistent_weak_layer,2200,NaN,1,1,1,0,0,0,1,1
2020-12-30,AM,AT-08,3,2,3,1800,wind_drifted_snow,1800,NaN,1,1,1,1,0,0,1,1,persistent_weak_layer,2200,NaN,1,1,1,0,0,0,1,1
2020-12-30,AM,AT-08,4,2,3,1800,wind_drifted_snow,1800,NaN,1,1,1,1,0,0,1,1,persistent_weak_layer,2200,NaN,1,1,1,0,0,0,1,1
2020-12-30,AM,AT-08,5,2,3,1800,wind_drifted_snow,1800,NaN,1,1,1,1,0,0,1,1,persistent_weak_layer,2200,NaN,1,1,1,0,0,0,1,1
2020-12-30,AM,AT-08,6,2,3,1800,wind_drifted_snow,1800,NaN,1,1,1,1,0,0,1,1,persistent_weak_layer,2200,NaN,1,1,1,0,0,0,1,1
2020-12-31,AM,AT-08,1,1,3,2000,wind_drifted_snow,2000,NaN,1,1,1,0,0,0,1,1,persistent_weak_layer,2200,NaN,1,1,1,0,0,0,1,1
2020-12-31,AM,AT-08,2,2,3,2000,wind_drifted_snow,2000,NaN,1,1,1,0,0,0,1,1,persistent_weak_layer,2200,NaN,1,1,1,0,0,0,1,1
2020-12-31,AM,AT-08,3,2,3,2000,wind_drifted_snow,2000,NaN,1,1,1,0,0,0,1,1,persistent_weak_layer,2200,NaN,1,1,1,0,0,0,1,1
2020-12-31,AM,AT-08,4,2,3,2000,wind_drifted_snow,2000,NaN,1,1,1,0,0,0,1,1,persistent_weak_layer,2200,NaN,1,1,1,0,0,0,1,1
2020-12-31,AM,AT-08,5,2,3,2000,wind_drifted_snow,2000,NaN,1,1,1,0,0,0,1,1,persistent_weak_layer,2200,NaN,1,1,1,0,0,0,1,1
2020-12-31,AM,AT-08,6,2,3,2000,wind_drifted_snow,2000,NaN,1,1,1,0,0,0,1,1,persistent_weak_layer,2200,NaN,1,1,1,0,0,0,1,1
2021-01-01,AM,AT-08,1,1,2,1800,wind_drifted_snow,1800,NaN,1,1,1,1,0,0,1,1,persistent_weak_layer,2200,NaN,1,1,1,0,0,0,1,1
2021-01-01,AM,AT-08,2,1,2,1800,wind_drifted_snow,1800,NaN,1,1,1,1,0,0,1,1,persistent_weak_layer,2200,NaN,1,1,1,0,0,0,1,1
2021-01-01,AM,AT-08,3,2,3,2200,wind_drifted_snow,1800,NaN,1,1,1,1,0,0,1,1,persistent_weak_layer,2200,NaN,1,1,1,0,0,0,1,1
2021-01-01,AM,AT-08,4,2,3,2200,wind_drifted_snow,1800,NaN,1,1,1,1,0,0,1,1,persistent_weak_layer,2200,NaN,1,1,1,0,0,0,1,1
2021-01-01,AM,AT-08,5,2,3,2200,wind_drifted_snow,1800,NaN,1,1,1,1,0,0,1,1,persistent_weak_layer,2200,NaN,1,1,1,0,0,0,1,1
2021-01-01,AM,AT-08,6,2,3,2200,wind_drifted_snow,1800,NaN,1,1,1,1,0,0,1,1,persistent_weak_layer,2200,NaN,1,1,1,0,0,0,1,1
2021-01-02,AM,AT-08,1,1,2,1800,wind_drifted_snow,1800,NaN,1,1,1,0,0,0,1,1,persistent_weak_layer,2200,NaN,1,1,1,0,0,0,1,1
2021-01-02,AM,AT-08,2,1,2,1800,wind_drifted_snow,1800,NaN,1,1,1,0,0,0,1,1,persistent_weak_layer,2200,NaN,1,1,1,0,0,0,1,1
2021-01-02,AM,AT-08,3,1,2,2000,wind_drifted_snow,1800,NaN,1,1,1,0,0,0,1,1,persistent_weak_layer,2200,NaN,1,1,1,0,0,0,1,1
2021-01-02,AM,AT-08,4,1,2,2000,wind_drifted_snow,1800,NaN,1,1,1,0,0,0,1,1,persistent_weak_layer,2200,NaN,1,1,1,0,0,0,1,1
2021-01-02,AM,AT-08,5,1,2,2000,wind_drifted_snow,1800,NaN,1,1,1,0,0,0,1,1,persistent_weak_layer,2200,NaN,1,1,1,0,0,0,1,1
2021-01-02,AM,AT-08,6,1,2,2000,wind_drifted_snow,1800,NaN,1,1,1,0,0,0,1,1,persistent_weak_layer,2200,NaN,1,1,1,0,0,0,1,1
2021-01-03,AM,AT-08,1,1,2,2000,wind_drifted_snow,1800,NaN,1,1,1,0,0,0,1,1,persistent_weak_layer,2200,NaN,1,1,1,0,0,0,1,1
2021-01-03,AM,AT-08,2,1,2,2000,wind_drifted_snow,1800,NaN,1,1,1,0,0,0,1,1,persistent_weak_layer,2200,NaN,1,1,1,0,0,0,1,1
2021-01-03,AM,AT-08,3,1,2,2000,wind_drifted_snow,1800,NaN,1,1,1,0,0,0,1,1,persistent_weak_layer,2200,NaN,1,1,1,0,0,0,1,1
2021-01-03,AM,AT-08,4,1,2,2000,wind_drifted_snow,1800,NaN,1,1,1,0,0,0,1,1,persistent_weak_layer,2200,NaN,1,1,1,0,0,0,1,1
2021-01-03,AM,AT-08,5,1,2,2000,wind_drifted_snow,1800,NaN,1,1,1,0,0,0,1,1,persistent_weak_layer,2200,NaN,1,1,1,0,0,0,1,1
2021-01-03,AM,AT-08,6,1,2,2000,wind_drifted_snow,1800,NaN,1,1,1,0,0,0,1,1,persistent_weak_layer,2200,NaN,1,1,1,0,0,0,1,1
2021-01-04,AM,AT-08,1,1,2,2000,wind_drifted_snow,2000,NaN,1,1,1,0,0,0,1,1,persistent_weak_layer,2200,NaN,1,1,1,0,0,0,1,1
2021-01-04,AM,AT-08,2,1,2,2000,wind_drifted_snow,2000,NaN,1,1,1,0,0,0,1,1,persistent_weak_layer,2200,NaN,1,1,1,0,0,0,1,1
2021-01-04,AM,AT-08,3,1,2,2000,wind_drifted_snow,2000,NaN,1,1,1,0,0,0,1,1,persistent_weak_layer,2200,NaN,1,1,1,0,0,0,1,1
2021-01-04,AM,AT-08,4,1,2,2000,wind_drifted_snow,2000,NaN,1,1,1,0,0,0,1,1,persistent_weak_layer,2200,NaN,1,1,1,0,0,0,1,1
2021-01-04,AM,AT-08,5,1,2,2000,wind_drifted_snow,2000,NaN,1,1,1,0,0,0,1,1,persistent_weak_layer,2200,NaN,1,1,1,0,0,0,1,1
2021-01-04,AM,AT-08,6,1,2,2000,wind_drifted_snow,2000,NaN,1,1,1,0,0,0,1,1,persistent_weak_layer,2200,NaN,1,1,1,0,0,0,1,1
2021-01-05,AM,AT-08,1,1,1,NaN,wind_drifted_snow,2200,NaN,1,1,1,0,0,0,1,1,persistent_weak_layer,2200,NaN,1,1,1,0,0,0,1,1
2021-01-05,AM,AT-08,2,1,2,2200,wind_drifted_snow,2200,NaN,1,1,1,0,0,0,1,1,persistent_weak_layer,2200,NaN,1,1,1,0,0,0,1,1
2021-01-05,AM,AT-08,3,1,2,2200,wind_drifted_snow,2200,NaN,1,1,1,0,0,0,1,1,persistent_weak_layer,2200,NaN,1,1,1,0,0,0,1,1
2021-01-05,AM,AT-08,4,1,2,2200,wind_drifted_snow,2200,NaN,1,1,1,0,0,0,1,1,persistent_weak_layer,2200,NaN,1,1,1,0,0,0,1,1
2021-01-05,AM,AT-08,5,1,2,2200,wind_drifted_snow,2200,NaN,1,1,1,0,0,0,1,1,persistent_weak_layer,2200,NaN,1,1,1,0,0,0,1,1
2021-01-05,AM,AT-08,6,1,2,2200,wind_drifted_snow,2200,NaN,1,1,1,0,0,0,1,1,persistent_weak_layer,2200,NaN,1,1,1,0,0,0,1,1
2021-01-06,AM,AT-08,1,1,1,NaN,wind_drifted_snow,2200,NaN,1,1,1,0,0,0,0,1,persistent_weak_layer,2200,NaN,1,1,0,0,0,0,0,1
2021-01-06,AM,AT-08,2,1,2,2200,wind_drifted_snow,2200,NaN,1,1,1,0,0,0,0,1,persistent_weak_layer,2200,NaN,1,1,0,0,0,0,0,1
2021-01-06,AM,AT-08,3,1,2,2200,wind_drifted_snow,2200,NaN,1,1,1,0,0,0,0,1,persistent_weak_layer,2200,NaN,1,1,0,0,0,0,0,1
2021-01-06,AM,AT-08,4,1,2,2200,wind_drifted_snow,2200,NaN,1,1,1,0,0,0,0,1,persistent_weak_layer,2200,NaN,1,1,0,0,0,0,0,1
2021-01-06,AM,AT-08,5,1,2,2200,wind_drifted_snow,2200,NaN,1,1,1,0,0,0,0,1,persistent_weak_layer,2200,NaN,1,1,0,0,0,0,0,1
2021-01-06,AM,AT-08,6,1,2,2200,wind_drifted_snow,2200,NaN,1,1,1,0,0,0,0,1,persistent_weak_layer,2200,NaN,1,1,0,0,0,0,0,1
2021-01-07,AM,AT-08,1,1,1,NaN,wind_drifted_snow,2200,NaN,1,1,1,0,0,0,0,1,persistent_weak_layer,2200,NaN,1,1,0,0,0,0,0,1
2021-01-07,AM,AT-08,2,1,2,2200,wind_drifted_snow,2200,NaN,1,1,1,0,0,0,0,1,persistent_weak_layer,2200,NaN,1,1,0,0,0,0,0,1
2021-01-07,AM,AT-08,3,1,2,2200,wind_drifted_snow,2200,NaN,1,1,1,0,0,0,0,1,persistent_weak_layer,2200,NaN,1,1,0,0,0,0,0,1
2021-01-07,AM,AT-08,4,1,2,2200,wind_drifted_snow,2200,NaN,1,1,1,0,0,0,0,1,persistent_weak_layer,2200,NaN,1,1,0,0,0,0,0,1
2021-01-07,AM,AT-08,5,1,2,2200,wind_drifted_snow,2200,NaN,1,1,1,0,0,0,0,1,persistent_weak_layer,2200,NaN,1,1,0,0,0,0,0,1
2021-01-07,AM,AT-08,6,1,2,2200,wind_drifted_snow,2200,NaN,1,1,1,0,0,0,0,1,persistent_weak_layer,2200,NaN,1,1,0,0,0,0,0,1
2021-01-08,AM,AT-08,1,1,1,NaN,persistent_weak_layer,2200,NaN,1,1,0,0,0,0,0,1,wind_drifted_snow,2200,NaN,1,1,1,0,0,0,1,1
2021-01-08,AM,AT-08,2,1,2,2200,persistent_weak_layer,2200,NaN,1,1,0,0,0,0,0,1,wind_drifted_snow,2200,NaN,1,1,1,0,0,0,1,1
2021-01-08,AM,AT-08,3,1,2,2200,persistent_weak_layer,2200,NaN,1,1,0,0,0,0,0,1,wind_drifted_snow,2200,NaN,1,1,1,0,0,0,1,1
2021-01-08,AM,AT-08,4,1,2,2200,persistent_weak_layer,2200,NaN,1,1,0,0,0,0,0,1,wind_drifted_snow,2200,NaN,1,1,1,0,0,0,1,1
2021-01-08,AM,AT-08,5,1,2,2200,persistent_weak_layer,2200,NaN,1,1,0,0,0,0,0,1,wind_drifted_snow,2200,NaN,1,1,1,0,0,0,1,1
2021-01-08,AM,AT-08,6,1,2,2200,persistent_weak_layer,2200,NaN,1,1,0,0,0,0,0,1,wind_drifted_snow,2200,NaN,1,1,1,0,0,0,1,1
2021-01-09,AM,AT-08,1,1,1,NaN,persistent_weak_layer,2200,NaN,1,1,0,0,0,0,0,1,wind_drifted_snow,2200,NaN,1,0,0,0,0,1,1,1
2021-01-09,AM,AT-08,2,1,1,NaN,persistent_weak_layer,2200,NaN,1,1,0,0,0,0,0,1,wind_drifted_snow,2200,NaN,1,0,0,0,0,1,1,1
2021-01-09,AM,AT-08,3,1,1,NaN,persistent_weak_layer,2200,NaN,1,1,0,0,0,0,0,1,wind_drifted_snow,2200,NaN,1,0,0,0,0,1,1,1
2021-01-09,AM,AT-08,4,1,1,NaN,persistent_weak_layer,2200,NaN,1,1,0,0,0,0,0,1,wind_drifted_snow,2200,NaN,1,0,0,0,0,1,1,1
2021-01-09,AM,AT-08,5,1,1,NaN,persistent_weak_layer,2200,NaN,1,1,0,0,0,0,0,1,wind_drifted_snow,2200,NaN,1,0,0,0,0,1,1,1
2021-01-09,AM,AT-08,6,1,1,NaN,persistent_weak_layer,2200,NaN,1,1,0,0,0,0,0,1,wind_drifted_snow,2200,NaN,1,0,0,0,0,1,1,1
2021-01-10,AM,AT-08,1,1,1,NaN,persistent_weak_layer,2200,NaN,1,1,0,0,0,0,0,1,wind_drifted_snow,2200,NaN,1,0,0,0,0,1,1,1
2021-01-10,AM,AT-08,2,1,1,NaN,persistent_weak_layer,2200,NaN,1,1,0,0,0,0,0,1,wind_drifted_snow,2200,NaN,1,0,0,0,0,1,1,1
2021-01-10,AM,AT-08,3,1,1,NaN,persistent_weak_layer,2200,NaN,1,1,0,0,0,0,0,1,wind_drifted_snow,2200,NaN,1,0,0,0,0,1,1,1
2021-01-10,AM,AT-08,4,1,1,NaN,persistent_weak_layer,2200,NaN,1,1,0,0,0,0,0,1,wind_drifted_snow,2200,NaN,1,0,0,0,0,1,1,1
2021-01-10,AM,AT-08,5,1,1,NaN,persistent_weak_layer,2200,NaN,1,1,0,0,0,0,0,1,wind_drifted_snow,2200,NaN,1,0,0,0,0,1,1,1
2021-01-10,AM,AT-08,6,1,1,NaN,persistent_weak_layer,2200,NaN,1,1,0,0,0,0,0,1,wind_drifted_snow,2200,NaN,1,0,0,0,0,1,1,1
2021-01-11,AM,AT-08,1,1,1,NaN,wind_drifted_snow,2200,NaN,1,0,0,0,1,1,1,1,persistent_weak_layer,2200,NaN,1,1,0,0,0,0,0,1
2021-01-11,AM,AT-08,2,1,1,NaN,wind_drifted_snow,2200,NaN,1,0,0,0,1,1,1,1,persistent_weak_layer,2200,NaN,1,1,0,0,0,0,0,1
2021-01-11,AM,AT-08,3,1,2,2200,wind_drifted_snow,2200,NaN,1,0,0,0,1,1,1,1,persistent_weak_layer,2200,NaN,1,1,0,0,0,0,0,1
2021-01-11,AM,AT-08,4,1,2,2200,wind_drifted_snow,2200,NaN,1,0,0,0,1,1,1,1,persistent_weak_layer,2200,NaN,1,1,0,0,0,0,0,1
2021-01-11,AM,AT-08,5,1,2,2200,wind_drifted_snow,2200,NaN,1,0,0,0,1,1,1,1,persistent_weak_layer,2200,NaN,1,1,0,0,0,0,0,1
2021-01-11,AM,AT-08,6,1,2,2200,wind_drifted_snow,2200,NaN,1,0,0,0,1,1,1,1,persistent_weak_layer,2200,NaN,1,1,0,0,0,0,0,1
2021-01-12,AM,AT-08,1,1,2,treeline,wind_drifted_snow,2000,NaN,1,1,1,1,1,1,1,1,NaN,NaN,NaN,NaN,NaN,NaN,NaN,NaN,NaN,NaN,NaN
2021-01-12,AM,AT-08,2,1,2,treeline,wind_drifted_snow,2000,NaN,1,1,1,1,1,1,1,1,NaN,NaN,NaN,NaN,NaN,NaN,NaN,NaN,NaN,NaN,NaN
2021-01-12,AM,AT-08,3,1,2,treeline,wind_drifted_snow,2000,NaN,1,1,1,1,1,1,1,1,NaN,NaN,NaN,NaN,NaN,NaN,NaN,NaN,NaN,NaN,NaN
2021-01-12,AM,AT-08,4,1,2,treeline,wind_drifted_snow,2000,NaN,1,1,1,1,1,1,1,1,NaN,NaN,NaN,NaN,NaN,NaN,NaN,NaN,NaN,NaN,NaN
2021-01-12,AM,AT-08,5,1,2,1800,wind_drifted_snow,2000,NaN,1,1,1,1,1,1,1,1,NaN,NaN,NaN,NaN,NaN,NaN,NaN,NaN,NaN,NaN,NaN
2021-01-12,AM,AT-08,6,1,2,1800,wind_drifted_snow,2000,NaN,1,1,1,1,1,1,1,1,NaN,NaN,NaN,NaN,NaN,NaN,NaN,NaN,NaN,NaN,NaN
2021-01-13,AM,AT-08,1,3,3,NaN,new_snow,1200,NaN,1,1,1,1,1,1,1,1,wind_drifted_snow,treeline,NaN,1,1,1,1,1,0,0,1
2021-01-13,AM,AT-08,2,3,3,NaN,new_snow,1200,NaN,1,1,1,1,1,1,1,1,wind_drifted_snow,treeline,NaN,1,1,1,1,1,0,0,1
2021-01-13,AM,AT-08,3,3,3,NaN,new_snow,1200,NaN,1,1,1,1,1,1,1,1,wind_drifted_snow,treeline,NaN,1,1,1,1,1,0,0,1
2021-01-13,AM,AT-08,4,2,3,treeline,new_snow,1200,NaN,1,1,1,1,1,1,1,1,wind_drifted_snow,treeline,NaN,1,1,1,1,1,0,0,1
2021-01-13,AM,AT-08,5,2,3,treeline,new_snow,1200,NaN,1,1,1,1,1,1,1,1,wind_drifted_snow,treeline,NaN,1,1,1,1,1,0,0,1
2021-01-13,AM,AT-08,6,2,3,treeline,new_snow,1200,NaN,1,1,1,1,1,1,1,1,wind_drifted_snow,treeline,NaN,1,1,1,1,1,0,0,1
2021-01-14,AM,AT-08,1,3,4,treeline,new_snow,1200,NaN,1,1,1,1,1,1,1,1,wind_drifted_snow,treeline,NaN,1,1,1,1,1,0,0,1
2021-01-14,AM,AT-08,2,3,4,treeline,new_snow,1200,NaN,1,1,1,1,1,1,1,1,wind_drifted_snow,treeline,NaN,1,1,1,1,1,0,0,1
2021-01-14,AM,AT-08,3,3,4,treeline,new_snow,1200,NaN,1,1,1,1,1,1,1,1,wind_drifted_snow,treeline,NaN,1,1,1,1,1,0,0,1
2021-01-14,AM,AT-08,4,3,4,treeline,new_snow,1200,NaN,1,1,1,1,1,1,1,1,wind_drifted_snow,treeline,NaN,1,1,1,1,1,0,0,1
2021-01-14,AM,AT-08,5,3,4,treeline,new_snow,1200,NaN,1,1,1,1,1,1,1,1,wind_drifted_snow,treeline,NaN,1,1,1,1,1,0,0,1
2021-01-14,AM,AT-08,6,3,4,treeline,new_snow,1200,NaN,1,1,1,1,1,1,1,1,wind_drifted_snow,treeline,NaN,1,1,1,1,1,0,0,1
2021-01-15,AM,AT-08,1,4,4,NaN,new_snow,NaN,NaN,1,1,1,1,1,1,1,1,wind_drifted_snow,treeline,NaN,1,1,1,1,1,1,0,1
2021-01-15,AM,AT-08,2,4,4,NaN,new_snow,NaN,NaN,1,1,1,1,1,1,1,1,wind_drifted_snow,treeline,NaN,1,1,1,1,1,1,0,1
2021-01-15,AM,AT-08,3,4,4,NaN,new_snow,NaN,NaN,1,1,1,1,1,1,1,1,wind_drifted_snow,treeline,NaN,1,1,1,1,1,1,0,1
2021-01-15,AM,AT-08,4,4,4,NaN,new_snow,NaN,NaN,1,1,1,1,1,1,1,1,wind_drifted_snow,treeline,NaN,1,1,1,1,1,1,0,1
2021-01-15,AM,AT-08,5,4,4,NaN,new_snow,NaN,NaN,1,1,1,1,1,1,1,1,wind_drifted_snow,treeline,NaN,1,1,1,1,1,1,0,1
2021-01-15,AM,AT-08,6,4,4,NaN,new_snow,NaN,NaN,1,1,1,1,1,1,1,1,wind_drifted_snow,treeline,NaN,1,1,1,1,1,1,0,1
2021-01-16,AM,AT-08,1,3,4,1600,new_snow,NaN,NaN,1,1,1,1,1,1,1,1,wind_drifted_snow,treeline,NaN,1,1,1,1,1,1,0,1
2021-01-16,AM,AT-08,2,3,4,1600,new_snow,NaN,NaN,1,1,1,1,1,1,1,1,wind_drifted_snow,treeline,NaN,1,1,1,1,1,1,0,1
2021-01-16,AM,AT-08,3,3,4,1600,new_snow,NaN,NaN,1,1,1,1,1,1,1,1,wind_drifted_snow,treeline,NaN,1,1,1,1,1,1,0,1
2021-01-16,AM,AT-08,4,3,4,1600,new_snow,NaN,NaN,1,1,1,1,1,1,1,1,wind_drifted_snow,treeline,NaN,1,1,1,1,1,1,0,1
2021-01-16,AM,AT-08,5,3,4,1600,new_snow,NaN,NaN,1,1,1,1,1,1,1,1,wind_drifted_snow,treeline,NaN,1,1,1,1,1,1,0,1
2021-01-16,AM,AT-08,6,3,4,1600,new_snow,NaN,NaN,1,1,1,1,1,1,1,1,wind_drifted_snow,treeline,NaN,1,1,1,1,1,1,0,1
2021-01-17,AM,AT-08,1,3,4,2000,wind_drifted_snow,treeline,NaN,1,1,1,1,1,0,0,1,weak_persistent_layer,NaN,NaN,1,1,1,1,1,1,1,1
2021-01-17,AM,AT-08,2,3,4,2000,wind_drifted_snow,treeline,NaN,1,1,1,1,1,0,0,1,weak_persistent_layer,NaN,NaN,1,1,1,1,1,1,1,1
2021-01-17,AM,AT-08,3,3,4,2000,wind_drifted_snow,treeline,NaN,1,1,1,1,1,0,0,1,weak_persistent_layer,NaN,NaN,1,1,1,1,1,1,1,1
2021-01-17,AM,AT-08,4,3,4,2000,wind_drifted_snow,treeline,NaN,1,1,1,1,1,0,0,1,weak_persistent_layer,NaN,NaN,1,1,1,1,1,1,1,1
2021-01-17,AM,AT-08,5,3,4,2000,wind_drifted_snow,treeline,NaN,1,1,1,1,1,0,0,1,weak_persistent_layer,NaN,NaN,1,1,1,1,1,1,1,1
2021-01-17,AM,AT-08,6,3,4,2000,wind_drifted_snow,treeline,NaN,1,1,1,1,1,0,0,1,weak_persistent_layer,NaN,NaN,1,1,1,1,1,1,1,1
2021-01-18,AM,AT-08,1,3,4,1600,new_snow,NaN,NaN,1,1,1,1,1,1,1,1,wind_drifted_snow,treeline,NaN,1,1,1,1,1,0,0,1
2021-01-18,AM,AT-08,2,3,4,1400,new_snow,NaN,NaN,1,1,1,1,1,1,1,1,wind_drifted_snow,treeline,NaN,1,1,1,1,1,0,0,1
2021-01-18,AM,AT-08,3,3,4,1600,new_snow,NaN,NaN,1,1,1,1,1,1,1,1,wind_drifted_snow,treeline,NaN,1,1,1,1,1,0,0,1
2021-01-18,AM,AT-08,4,3,4,treeline,new_snow,NaN,NaN,1,1,1,1,1,1,1,1,wind_drifted_snow,treeline,NaN,1,1,1,1,1,0,0,1
2021-01-18,AM,AT-08,5,3,4,treeline,new_snow,NaN,NaN,1,1,1,1,1,1,1,1,wind_drifted_snow,treeline,NaN,1,1,1,1,1,0,0,1
2021-01-18,AM,AT-08,6,3,4,treeline,new_snow,NaN,NaN,1,1,1,1,1,1,1,1,wind_drifted_snow,treeline,NaN,1,1,1,1,1,0,0,1
2021-01-19,AM,AT-08,1,3,3,NaN,new_snow,NaN,NaN,1,1,1,1,1,1,1,1,wind_drifted_snow,treeline,NaN,1,1,1,1,0,0,0,1
2021-01-19,AM,AT-08,2,3,3,NaN,new_snow,NaN,NaN,1,1,1,1,1,1,1,1,wind_drifted_snow,treeline,NaN,1,1,1,1,0,0,0,1
2021-01-19,AM,AT-08,3,3,3,NaN,new_snow,NaN,NaN,1,1,1,1,1,1,1,1,wind_drifted_snow,treeline,NaN,1,1,1,1,0,0,0,1
2021-01-19,AM,AT-08,4,3,3,NaN,new_snow,NaN,NaN,1,1,1,1,1,1,1,1,wind_drifted_snow,treeline,NaN,1,1,1,1,0,0,0,1
2021-01-19,AM,AT-08,5,3,3,NaN,new_snow,NaN,NaN,1,1,1,1,1,1,1,1,wind_drifted_snow,treeline,NaN,1,1,1,1,0,0,0,1
2021-01-19,AM,AT-08,6,3,3,NaN,new_snow,NaN,NaN,1,1,1,1,1,1,1,1,wind_drifted_snow,treeline,NaN,1,1,1,1,0,0,0,1
2021-01-20,AM,AT-08,1,2,3,1500,wind_drifted_snow,treeline,NaN,1,1,1,0,0,0,1,1,weak_persistent_layer,NaN,NaN,1,1,1,1,1,1,1,1
2021-01-20,AM,AT-08,2,2,3,1500,wind_drifted_snow,treeline,NaN,1,1,1,0,0,0,1,1,weak_persistent_layer,NaN,NaN,1,1,1,1,1,1,1,1
2021-01-20,AM,AT-08,3,2,3,1500,wind_drifted_snow,treeline,NaN,1,1,1,0,0,0,1,1,weak_persistent_layer,NaN,NaN,1,1,1,1,1,1,1,1
2021-01-20,AM,AT-08,4,2,3,treeline,wind_drifted_snow,treeline,NaN,1,1,1,0,0,0,1,1,weak_persistent_layer,NaN,NaN,1,1,1,1,1,1,1,1
2021-01-20,AM,AT-08,5,2,3,treeline,wind_drifted_snow,treeline,NaN,1,1,1,0,0,0,1,1,weak_persistent_layer,NaN,NaN,1,1,1,1,1,1,1,1
2021-01-20,AM,AT-08,6,2,3,treeline,wind_drifted_snow,treeline,NaN,1,1,1,0,0,0,1,1,weak_persistent_layer,NaN,NaN,1,1,1,1,1,1,1,1
2021-01-21,AM,AT-08,1,2,3,treeline,wind_drifted_snow,treeline,NaN,1,1,1,1,0,0,1,1,gliding_snow,NaN,1800,1,1,1,1,1,1,1,1
2021-01-21,AM,AT-08,2,2,3,treeline,wind_drifted_snow,treeline,NaN,1,1,1,1,0,0,1,1,gliding_snow,NaN,1800,1,1,1,1,1,1,1,1
2021-01-21,AM,AT-08,3,2,3,treeline,wind_drifted_snow,treeline,NaN,1,1,1,1,0,0,1,1,gliding_snow,NaN,1800,1,1,1,1,1,1,1,1
2021-01-21,AM,AT-08,4,2,3,1800,wind_drifted_snow,treeline,NaN,1,1,1,1,0,0,1,1,gliding_snow,NaN,1800,1,1,1,1,1,1,1,1
2021-01-21,AM,AT-08,5,2,3,1800,wind_drifted_snow,treeline,NaN,1,1,1,1,0,0,1,1,gliding_snow,NaN,1800,1,1,1,1,1,1,1,1
2021-01-21,AM,AT-08,6,2,3,1800,wind_drifted_snow,treeline,NaN,1,1,1,1,0,0,1,1,gliding_snow,NaN,1800,1,1,1,1,1,1,1,1
2021-01-22,AM,AT-08,1,2,3,1800,wind_drifted_snow,1800,NaN,1,1,1,0,0,0,1,1,gliding_snow,NaN,1800,1,1,1,1,1,1,1,1
2021-01-22,AM,AT-08,2,2,3,1800,wind_drifted_snow,1800,NaN,1,1,1,0,0,0,1,1,gliding_snow,NaN,1800,1,1,1,1,1,1,1,1
2021-01-22,AM,AT-08,3,2,3,1800,wind_drifted_snow,1800,NaN,1,1,1,0,0,0,1,1,gliding_snow,NaN,1800,1,1,1,1,1,1,1,1
2021-01-22,AM,AT-08,4,2,3,2000,wind_drifted_snow,1800,NaN,1,1,1,0,0,0,1,1,gliding_snow,NaN,1800,1,1,1,1,1,1,1,1
2021-01-22,AM,AT-08,5,2,3,1800,wind_drifted_snow,1800,NaN,1,1,1,0,0,0,1,1,gliding_snow,NaN,1800,1,1,1,1,1,1,1,1
2021-01-22,AM,AT-08,6,2,3,2000,wind_drifted_snow,1800,NaN,1,1,1,0,0,0,1,1,gliding_snow,NaN,1800,1,1,1,1,1,1,1,1
2021-01-23,AM,AT-08,1,2,3,1800,wind_drifted_snow,1800,NaN,1,1,1,1,0,0,1,1,weak_persistent_layer,2000,NaN,1,1,1,0,0,0,1,1
2021-01-23,AM,AT-08,2,2,3,1800,wind_drifted_snow,1800,NaN,1,1,1,1,0,0,1,1,weak_persistent_layer,2000,NaN,1,1,1,0,0,0,1,1
2021-01-23,AM,AT-08,3,2,3,1800,wind_drifted_snow,1800,NaN,1,1,1,1,0,0,1,1,weak_persistent_layer,2000,NaN,1,1,1,0,0,0,1,1
2021-01-23,AM,AT-08,4,2,3,1800,wind_drifted_snow,1800,NaN,1,1,1,1,0,0,1,1,weak_persistent_layer,2000,NaN,1,1,1,0,0,0,1,1
2021-01-23,AM,AT-08,5,2,3,1800,wind_drifted_snow,1800,NaN,1,1,1,1,0,0,1,1,weak_persistent_layer,2000,NaN,1,1,1,0,0,0,1,1
2021-01-23,AM,AT-08,6,2,3,1800,wind_drifted_snow,1800,NaN,1,1,1,1,0,0,1,1,weak_persistent_layer,2000,NaN,1,1,1,0,0,0,1,1
2021-01-24,AM,AT-08,1,2,2,NaN,wind_drifted_snow,treeline,NaN,1,1,1,1,0,0,0,1,weak_persistent_layer,2000,NaN,1,1,1,0,0,0,1,1
2021-01-24,AM,AT-08,2,2,2,NaN,wind_drifted_snow,treeline,NaN,1,1,1,1,0,0,0,1,weak_persistent_layer,2000,NaN,1,1,1,0,0,0,1,1
2021-01-24,AM,AT-08,3,2,3,2000,wind_drifted_snow,treeline,NaN,1,1,1,1,0,0,0,1,weak_persistent_layer,2000,NaN,1,1,1,0,0,0,1,1
2021-01-24,AM,AT-08,4,2,3,2000,wind_drifted_snow,treeline,NaN,1,1,1,1,0,0,0,1,weak_persistent_layer,2000,NaN,1,1,1,0,0,0,1,1
2021-01-24,AM,AT-08,5,2,3,2000,wind_drifted_snow,treeline,NaN,1,1,1,1,0,0,0,1,weak_persistent_layer,2000,NaN,1,1,1,0,0,0,1,1
2021-01-24,AM,AT-08,6,2,3,2000,wind_drifted_snow,treeline,NaN,1,1,1,1,0,0,0,1,weak_persistent_layer,2000,NaN,1,1,1,0,0,0,1,1
