[
  {
    "valid_regions": [
      "AT-05-03",
      "AT-05-02",
      "AT-05-01"
    ],
    "danger_main": [
      {
        "main_value": 3,
        "valid_elevation": ">1600"
      },
      {
        "main_value": 2,
        "valid_elevation": "<1600"
      }
    ],
    "dangerpattern": [],
    "problem_list": [
      {
        "problem_type": "drifting snow",
        "aspect": [
          "N",
          "NE",
          "E",
          "SE",
          "NW"
        ],
        "valid_elevation": null
      },
      {
        "problem_type": "new snow",
        "aspect": [
          "N",
          "NE",
          "E",
          "SE",
          "S",
          "SW",
          "W",
          "NW"
        ],
        "valid_elevation": null
      }
    ],
    "report_texts": null,
    "report_id": "RID105RGR1",
    "rep_date": "2020-12-27T17:00:00+00:00",
    "validity_begin": "2020-12-27T23:00:00+00:00",
    "validity_end": "2020-12-28T23:00:00+00:00"
  },
  {
    "valid_regions": [
      "AT-05-11",
      "AT-05-07",
      "AT-05-10",
      "AT-05-06",
      "AT-05-09",
      "AT-05-05",
      "AT-05-08",
      "AT-05-04"
    ],
    "danger_main": [
      {
        "main_value": 3,
        "valid_elevation": ">1400"
      },
      {
        "main_value": 2,
        "valid_elevation": "<1400"
      }
    ],
    "dangerpattern": [],
    "problem_list": [
      {
        "problem_type": "drifting snow",
        "aspect": [
          "N",
          "NE",
          "E",
          "SE",
          "S",
          "SW",
          "W",
          "NW"
        ],
        "valid_elevation": null
      }
    ],
    "report_texts": null,
    "report_id": "RID105RGR2",
    "rep_date": "2020-12-27T17:00:00+00:00",
    "validity_begin": "2020-12-27T23:00:00+00:00",
    "validity_end": "2020-12-28T23:00:00+00:00"
  },
  {
    "valid_regions": [
      "AT-05-14",
      "AT-05-15",
      "AT-05-13",
      "AT-05-12",
      "AT-05-18"
    ],
    "danger_main": [
      {
        "main_value": 2,
        "valid_elevation": ">1600"
      },
      {
        "main_value": 1,
        "valid_elevation": "<1600"
      }
    ],
    "dangerpattern": [],
    "problem_list": [
      {
        "problem_type": "drifting snow",
        "aspect": [
          "N",
          "NE",
          "E",
          "NW"
        ],
        "valid_elevation": null
      }
    ],
    "report_texts": null,
    "report_id": "RID105RGR3",
    "rep_date": "2020-12-27T17:00:00+00:00",
    "validity_begin": "2020-12-27T23:00:00+00:00",
    "validity_end": "2020-12-28T23:00:00+00:00"
  },
  {
    "valid_regions": [
      "AT-05-17",
      "AT-05-16"
    ],
    "danger_main": [
      {
        "main_value": 3,
        "valid_elevation": ">1700"
      },
      {
        "main_value": 1,
        "valid_elevation": "<1700"
      }
    ],
    "dangerpattern": [],
    "problem_list": [
      {
        "problem_type": "drifting snow",
        "aspect": [
          "N",
          "NE",
          "NW"
        ],
        "valid_elevation": null
      }
    ],
    "report_texts": null,
    "report_id": "RID105RGR4",
    "rep_date": "2020-12-27T17:00:00+00:00",
    "validity_begin": "2020-12-27T23:00:00+00:00",
    "validity_end": "2020-12-28T23:00:00+00:00"
  },
  {
    "valid_regions": [
      "AT-05-21",
      "AT-05-19",
      "AT-05-20"
    ],
    "danger_main": [
      {
        "main_value": 1,
        "valid_elevation": null
      }
    ],
    "dangerpattern": [],
    "problem_list": [
      {
        "problem_type": "drifting snow",
        "aspect": [
          "N",
          "NE",
          "E",
          "NW"
        ],
        "valid_elevation": null
      }
    ],
    "report_texts": null,
    "report_id": "RID105RGR5",
    "rep_date": "2020-12-27T17:00:00+00:00",
    "validity_begin": "2020-12-27T23:00:00+00:00",
    "validity_end": "2020-12-28T23:00:00+00:00"
  }
]