[
  {
    "valid_regions": [
      "AT-05-15",
      "AT-05-11",
      "AT-05-07",
      "AT-05-14",
      "AT-05-06",
      "AT-05-10"
    ],
    "danger_main": [
      {
        "main_value": 3,
        "valid_elevation": null
      }
    ],
    "dangerpattern": [],
    "problem_list": [
      {
        "problem_type": "drifting snow",
        "aspect": [
          "N",
          "NE",
          "E",
          "SE",
          "S",
          "SW"
        ],
        "valid_elevation": null
      }
    ],
    "report_texts": null,
    "report_id": "RID217RGR1",
    "rep_date": "2021-01-18T17:00:00+00:00",
    "validity_begin": "2021-01-18T23:00:00+00:00",
    "validity_end": "2021-01-19T23:00:00+00:00"
  },
  {
    "valid_regions": [
      "AT-05-21",
      "AT-05-17",
      "AT-05-18",
      "AT-05-09",
      "AT-05-05",
      "AT-05-20",
      "AT-05-19",
      "AT-05-16",
      "AT-05-13",
      "AT-05-12",
      "AT-05-04",
      "AT-05-08"
    ],
    "danger_main": [
      {
        "main_value": 3,
        "valid_elevation": ">1500"
      },
      {
        "main_value": 2,
        "valid_elevation": "<1500"
      }
    ],
    "dangerpattern": [],
    "problem_list": [
      {
        "problem_type": "drifting snow",
        "aspect": [
          "N",
          "NE",
          "E",
          "SE",
          "S"
        ],
        "valid_elevation": null
      }
    ],
    "report_texts": null,
    "report_id": "RID217RGR2",
    "rep_date": "2021-01-18T17:00:00+00:00",
    "validity_begin": "2021-01-18T23:00:00+00:00",
    "validity_end": "2021-01-19T23:00:00+00:00"
  },
  {
    "valid_regions": [
      "AT-05-03",
      "AT-05-02",
      "AT-05-01"
    ],
    "danger_main": [
      {
        "main_value": 3,
        "valid_elevation": ">Treeline"
      },
      {
        "main_value": 2,
        "valid_elevation": "<Treeline"
      }
    ],
    "dangerpattern": [],
    "problem_list": [
      {
        "problem_type": "drifting snow",
        "aspect": [
          "NE",
          "E",
          "SE",
          "S"
        ],
        "valid_elevation": null
      }
    ],
    "report_texts": null,
    "report_id": "RID217RGR3",
    "rep_date": "2021-01-18T17:00:00+00:00",
    "validity_begin": "2021-01-18T23:00:00+00:00",
    "validity_end": "2021-01-19T23:00:00+00:00"
  }
]