[
  {
    "valid_regions": [
      "AT-06-18",
      "AT-06-04"
    ],
    "danger_main": [
      {
        "main_value": 3,
        "valid_elevation": ">1900"
      },
      {
        "main_value": 1,
        "valid_elevation": "<1900"
      }
    ],
    "dangerpattern": [],
    "problem_list": [
      {
        "problem_type": "drifting snow",
        "aspect": [
          "N",
          "NE",
          "E",
          "SE",
          "NW"
        ],
        "valid_elevation": null
      }
    ],
    "report_texts": null,
    "report_id": "RID127RGR1",
    "rep_date": "2021-01-01T17:00:00+00:00",
    "validity_begin": "2021-01-01T23:00:00+00:00",
    "validity_end": "2021-01-02T23:00:00+00:00"
  },
  {
    "valid_regions": [
      "AT-06-01",
      "AT-06-02"
    ],
    "danger_main": [
      {
        "main_value": 3,
        "valid_elevation": ">2000"
      },
      {
        "main_value": 1,
        "valid_elevation": "<2000"
      }
    ],
    "dangerpattern": [],
    "problem_list": [
      {
        "problem_type": "drifting snow",
        "aspect": [
          "N",
          "NE",
          "E",
          "SE",
          "NW"
        ],
        "valid_elevation": null
      }
    ],
    "report_texts": null,
    "report_id": "RID127RGR2",
    "rep_date": "2021-01-01T17:00:00+00:00",
    "validity_begin": "2021-01-01T23:00:00+00:00",
    "validity_end": "2021-01-02T23:00:00+00:00"
  },
  {
    "valid_regions": [
      "AT-06-03",
      "AT-06-10",
      "AT-06-09",
      "AT-06-06",
      "AT-06-05",
      "AT-06-07",
      "AT-06-08"
    ],
    "danger_main": [
      {
        "main_value": 2,
        "valid_elevation": ">1700"
      },
      {
        "main_value": 1,
        "valid_elevation": "<1700"
      }
    ],
    "dangerpattern": [],
    "problem_list": [
      {
        "problem_type": "drifting snow",
        "aspect": [
          "N",
          "NE",
          "E",
          "SE",
          "NW"
        ],
        "valid_elevation": null
      }
    ],
    "report_texts": null,
    "report_id": "RID127RGR3",
    "rep_date": "2021-01-01T17:00:00+00:00",
    "validity_begin": "2021-01-01T23:00:00+00:00",
    "validity_end": "2021-01-02T23:00:00+00:00"
  },
  {
    "valid_regions": [
      "AT-06-15",
      "AT-06-16",
      "AT-06-13",
      "AT-06-17"
    ],
    "danger_main": [
      {
        "main_value": 2,
        "valid_elevation": ">1700"
      },
      {
        "main_value": 1,
        "valid_elevation": "<1700"
      }
    ],
    "dangerpattern": [],
    "problem_list": [
      {
        "problem_type": "drifting snow",
        "aspect": [
          "N",
          "NE",
          "E",
          "SE"
        ],
        "valid_elevation": null
      }
    ],
    "report_texts": null,
    "report_id": "RID127RGR4",
    "rep_date": "2021-01-01T17:00:00+00:00",
    "validity_begin": "2021-01-01T23:00:00+00:00",
    "validity_end": "2021-01-02T23:00:00+00:00"
  },
  {
    "valid_regions": [
      "AT-06-11",
      "AT-06-12",
      "AT-06-14"
    ],
    "danger_main": [
      {
        "main_value": 1,
        "valid_elevation": null
      }
    ],
    "dangerpattern": [],
    "problem_list": [
      {
        "problem_type": "drifting snow",
        "aspect": [
          "N",
          "NE",
          "NW"
        ],
        "valid_elevation": null
      }
    ],
    "report_texts": null,
    "report_id": "RID127RGR5",
    "rep_date": "2021-01-01T17:00:00+00:00",
    "validity_begin": "2021-01-01T23:00:00+00:00",
    "validity_end": "2021-01-02T23:00:00+00:00"
  }
]