[
  {
    "valid_regions": [
      "AT-02-02",
      "AT-02-01",
      "AT-02-03",
      "AT-02-09",
      "AT-02-04",
      "AT-02-12",
      "AT-02-10",
      "AT-02-11",
      "AT-02-14",
      "AT-02-15",
      "AT-02-13",
      "AT-02-16",
      "AT-02-17",
      "AT-02-18",
      "AT-02-19"
    ],
    "danger_main": [
      {
        "main_value": 1,
        "valid_elevation": null
      }
    ],
    "dangerpattern": [],
    "problem_list": [
      {
        "problem_type": "gliding snow",
        "aspect": [
          "E",
          "SE",
          "S",
          "SW",
          "W"
        ],
        "valid_elevation": null
      }
    ],
    "report_texts": null,
    "report_id": "RID513RGR1",
    "rep_date": "2021-02-28T17:00:00+00:00",
    "validity_begin": "2021-02-28T23:00:00+00:00",
    "validity_end": "2021-03-01T23:00:00+00:00"
  },
  {
    "valid_regions": [
      "AT-02-06",
      "AT-02-07",
      "AT-02-08",
      "AT-02-05"
    ],
    "danger_main": [
      {
        "main_value": 1,
        "valid_elevation": null
      }
    ],
    "dangerpattern": [],
    "problem_list": [
      {
        "problem_type": "favourable situation",
        "aspect": [],
        "valid_elevation": null
      }
    ],
    "report_texts": null,
    "report_id": "RID513RGR2",
    "rep_date": "2021-02-28T17:00:00+00:00",
    "validity_begin": "2021-02-28T23:00:00+00:00",
    "validity_end": "2021-03-01T23:00:00+00:00"
  }
]