[
  {
    "valid_regions": [
      "AT-03-01",
      "AT-03-06",
      "AT-03-04"
    ],
    "danger_main": [
      {
        "main_value": 3,
        "valid_elevation": ">1500"
      },
      {
        "main_value": 2,
        "valid_elevation": "<1500"
      }
    ],
    "dangerpattern": [],
    "problem_list": [
      {
        "problem_type": "drifting snow",
        "aspect": [
          "N",
          "NE",
          "E",
          "SE",
          "S",
          "NW"
        ],
        "valid_elevation": null
      }
    ],
    "report_texts": null,
    "report_id": "RID645RGR1",
    "rep_date": "2021-03-18T17:00:00+00:00",
    "validity_begin": "2021-03-18T23:00:00+00:00",
    "validity_end": "2021-03-19T23:00:00+00:00"
  },
  {
    "valid_regions": [
      "AT-03-02",
      "AT-03-03"
    ],
    "danger_main": [
      {
        "main_value": 2,
        "valid_elevation": null
      }
    ],
    "dangerpattern": [],
    "problem_list": [
      {
        "problem_type": "drifting snow",
        "aspect": [
          "N",
          "NE",
          "E",
          "SE",
          "S"
        ],
        "valid_elevation": null
      }
    ],
    "report_texts": null,
    "report_id": "RID645RGR2",
    "rep_date": "2021-03-18T17:00:00+00:00",
    "validity_begin": "2021-03-18T23:00:00+00:00",
    "validity_end": "2021-03-19T23:00:00+00:00"
  },
  {
    "valid_regions": [
      "AT-03-05"
    ],
    "danger_main": [
      {
        "main_value": 2,
        "valid_elevation": ">Treeline"
      },
      {
        "main_value": 1,
        "valid_elevation": "<Treeline"
      }
    ],
    "dangerpattern": [],
    "problem_list": [
      {
        "problem_type": "drifting snow",
        "aspect": [
          "N",
          "NE",
          "E",
          "SE",
          "S"
        ],
        "valid_elevation": null
      }
    ],
    "report_texts": null,
    "report_id": "RID645RGR3",
    "rep_date": "2021-03-18T17:00:00+00:00",
    "validity_begin": "2021-03-18T23:00:00+00:00",
    "validity_end": "2021-03-19T23:00:00+00:00"
  }
]