[
  {
    "valid_regions": [
      "AT-05-15",
      "AT-05-11",
      "AT-05-10",
      "AT-05-07",
      "AT-05-06",
      "AT-05-05",
      "AT-05-09"
    ],
    "danger_main": [
      {
        "main_value": 3,
        "valid_elevation": ">2000"
      },
      {
        "main_value": 2,
        "valid_elevation": "<2000"
      }
    ],
    "dangerpattern": [],
    "problem_list": [
      {
        "problem_type": "drifting snow",
        "aspect": [
          "NE",
          "E",
          "SE",
          "S",
          "SW"
        ],
        "valid_elevation": null
      }
    ],
    "report_texts": null,
    "report_id": "RID95RGR1",
    "rep_date": "2020-12-25T17:00:00+00:00",
    "validity_begin": "2020-12-25T23:00:00+00:00",
    "validity_end": "2020-12-26T23:00:00+00:00"
  },
  {
    "valid_regions": [
      "AT-05-13",
      "AT-05-14",
      "AT-05-12",
      "AT-05-08",
      "AT-05-04",
      "AT-05-18"
    ],
    "danger_main": [
      {
        "main_value": 2,
        "valid_elevation": ">Treeline"
      },
      {
        "main_value": 1,
        "valid_elevation": "<Treeline"
      }
    ],
    "dangerpattern": [],
    "problem_list": [
      {
        "problem_type": "drifting snow",
        "aspect": [
          "NE",
          "E",
          "SE",
          "S",
          "SW"
        ],
        "valid_elevation": null
      }
    ],
    "report_texts": null,
    "report_id": "RID95RGR2",
    "rep_date": "2020-12-25T17:00:00+00:00",
    "validity_begin": "2020-12-25T23:00:00+00:00",
    "validity_end": "2020-12-26T23:00:00+00:00"
  },
  {
    "valid_regions": [
      "AT-05-16",
      "AT-05-17"
    ],
    "danger_main": [
      {
        "main_value": 3,
        "valid_elevation": ">1800"
      },
      {
        "main_value": 1,
        "valid_elevation": "<1800"
      }
    ],
    "dangerpattern": [],
    "problem_list": [
      {
        "problem_type": "drifting snow",
        "aspect": [
          "NE",
          "E",
          "SE",
          "S",
          "SW"
        ],
        "valid_elevation": null
      }
    ],
    "report_texts": null,
    "report_id": "RID95RGR3",
    "rep_date": "2020-12-25T17:00:00+00:00",
    "validity_begin": "2020-12-25T23:00:00+00:00",
    "validity_end": "2020-12-26T23:00:00+00:00"
  },
  {
    "valid_regions": [
      "AT-05-01",
      "AT-05-03",
      "AT-05-02"
    ],
    "danger_main": [
      {
        "main_value": 2,
        "valid_elevation": ">Treeline"
      },
      {
        "main_value": 1,
        "valid_elevation": "<Treeline"
      }
    ],
    "dangerpattern": [],
    "problem_list": [
      {
        "problem_type": "drifting snow",
        "aspect": [
          "E",
          "SE",
          "S",
          "SW"
        ],
        "valid_elevation": null
      }
    ],
    "report_texts": null,
    "report_id": "RID95RGR4",
    "rep_date": "2020-12-25T17:00:00+00:00",
    "validity_begin": "2020-12-25T23:00:00+00:00",
    "validity_end": "2020-12-26T23:00:00+00:00"
  },
  {
    "valid_regions": [
      "AT-05-19",
      "AT-05-20",
      "AT-05-21"
    ],
    "danger_main": [
      {
        "main_value": 1,
        "valid_elevation": null
      }
    ],
    "dangerpattern": [],
    "problem_list": [
      {
        "problem_type": "favourable situation",
        "aspect": [],
        "valid_elevation": null
      }
    ],
    "report_texts": null,
    "report_id": "RID95RGR5",
    "rep_date": "2020-12-25T17:00:00+00:00",
    "validity_begin": "2020-12-25T23:00:00+00:00",
    "validity_end": "2020-12-26T23:00:00+00:00"
  }
]