Datum,DangerRatingAbove,DangerRatingBelow,DangerRatingElevation,Daytime,SubregionCode
2017-12-01,2,1,1600.0,AM,AT-08-01
2017-12-01,1,1,,PM,AT-08-01
2017-12-01,3,2,2000.0,AM,AT-08-02
2017-12-01,1,1,,PM,AT-08-02
2017-12-01,2,1,1800.0,AM,AT-08-03
2017-12-01,1,1,,PM,AT-08-03
2017-12-01,2,1,1800.0,AM,AT-08-04
2017-12-01,1,1,,PM,AT-08-04
2017-12-01,2,1,1800.0,AM,AT-08-05
2017-12-01,1,1,,PM,AT-08-05
2017-12-01,2,1,1800.0,AM,AT-08-06
2017-12-01,1,1,,PM,AT-08-06
2017-12-02,2,1,1800.0,AM,AT-08-01
2017-12-02,1,1,,PM,AT-08-01
2017-12-02,2,1,1800.0,AM,AT-08-02
2017-12-02,1,1,,PM,AT-08-02
2017-12-02,2,1,1800.0,AM,AT-08-03
2017-12-02,1,1,,PM,AT-08-03
2017-12-02,2,1,1800.0,AM,AT-08-04
2017-12-02,1,1,,PM,AT-08-04
2017-12-02,2,1,1800.0,AM,AT-08-05
2017-12-02,1,1,,PM,AT-08-05
2017-12-02,2,1,1800.0,AM,AT-08-06
2017-12-02,1,1,,PM,AT-08-06
2017-12-03,2,1,1800.0,AM,AT-08-01
2017-12-03,1,1,,PM,AT-08-01
2017-12-03,2,1,1800.0,AM,AT-08-02
2017-12-03,1,1,,PM,AT-08-02
2017-12-03,2,1,1800.0,AM,AT-08-03
2017-12-03,1,1,,PM,AT-08-03
2017-12-03,2,1,1800.0,AM,AT-08-04
2017-12-03,1,1,,PM,AT-08-04
2017-12-03,2,1,2000.0,AM,AT-08-05
2017-12-03,1,1,,PM,AT-08-05
2017-12-03,2,1,2000.0,AM,AT-08-06
2017-12-03,1,1,,PM,AT-08-06
2017-12-04,2,1,1600.0,AM,AT-08-01
2017-12-04,1,1,,PM,AT-08-01
2017-12-04,2,1,1600.0,AM,AT-08-02
2017-12-04,1,1,,PM,AT-08-02
2017-12-04,2,1,1600.0,AM,AT-08-03
2017-12-04,1,1,,PM,AT-08-03
2017-12-04,2,1,1800.0,AM,AT-08-04
2017-12-04,1,1,,PM,AT-08-04
2017-12-04,2,1,1800.0,AM,AT-08-05
2017-12-04,1,1,,PM,AT-08-05
2017-12-04,2,1,1800.0,AM,AT-08-06
2017-12-04,1,1,,PM,AT-08-06
2017-12-05,2,1,1600.0,AM,AT-08-01
2017-12-05,1,1,,PM,AT-08-01
2017-12-05,3,2,1800.0,AM,AT-08-02
2017-12-05,1,1,,PM,AT-08-02
2017-12-05,2,1,1800.0,AM,AT-08-03
2017-12-05,1,1,,PM,AT-08-03
2017-12-05,2,1,1800.0,AM,AT-08-04
2017-12-05,1,1,,PM,AT-08-04
2017-12-05,2,1,1800.0,AM,AT-08-05
2017-12-05,1,1,,PM,AT-08-05
2017-12-05,2,1,1800.0,AM,AT-08-06
2017-12-05,1,1,,PM,AT-08-06
2017-12-06,2,2,,AM,AT-08-01
2017-12-06,1,1,,PM,AT-08-01
2017-12-06,3,2,1800.0,AM,AT-08-02
2017-12-06,1,1,,PM,AT-08-02
2017-12-06,2,2,,AM,AT-08-03
2017-12-06,1,1,,PM,AT-08-03
2017-12-06,2,1,1800.0,AM,AT-08-04
2017-12-06,1,1,,PM,AT-08-04
2017-12-06,2,1,1800.0,AM,AT-08-05
2017-12-06,1,1,,PM,AT-08-05
2017-12-06,2,1,1800.0,AM,AT-08-06
2017-12-06,1,1,,PM,AT-08-06
2017-12-07,2,2,,AM,AT-08-01
2017-12-07,1,1,,PM,AT-08-01
2017-12-07,2,2,,AM,AT-08-02
2017-12-07,1,1,,PM,AT-08-02
2017-12-07,2,2,,AM,AT-08-03
2017-12-07,1,1,,PM,AT-08-03
2017-12-07,2,2,,AM,AT-08-04
2017-12-07,1,1,,PM,AT-08-04
2017-12-07,2,2,,AM,AT-08-05
2017-12-07,1,1,,PM,AT-08-05
2017-12-07,2,2,,AM,AT-08-06
2017-12-07,1,1,,PM,AT-08-06
2017-12-08,2,2,,AM,AT-08-01
2017-12-08,3,2,1800.0,PM,AT-08-01
2017-12-08,2,2,,AM,AT-08-02
2017-12-08,3,2,1800.0,PM,AT-08-02
2017-12-08,2,2,,AM,AT-08-03
2017-12-08,3,2,1800.0,PM,AT-08-03
2017-12-08,2,2,,AM,AT-08-04
2017-12-08,2,2,,PM,AT-08-04
2017-12-08,2,2,,AM,AT-08-05
2017-12-08,2,2,,PM,AT-08-05
2017-12-08,2,2,,AM,AT-08-06
2017-12-08,2,2,,PM,AT-08-06
2017-12-09,3,2,1600.0,AM,AT-08-01
2017-12-09,3,2,1800.0,PM,AT-08-01
2017-12-09,3,2,1600.0,AM,AT-08-02
2017-12-09,3,2,1800.0,PM,AT-08-02
2017-12-09,3,2,1600.0,AM,AT-08-03
2017-12-09,3,2,1800.0,PM,AT-08-03
2017-12-09,3,2,1800.0,AM,AT-08-04
2017-12-09,2,2,,PM,AT-08-04
2017-12-09,3,2,1800.0,AM,AT-08-05
2017-12-09,2,2,,PM,AT-08-05
2017-12-09,3,2,1800.0,AM,AT-08-06
2017-12-09,2,2,,PM,AT-08-06
2017-12-10,3,2,1600.0,AM,AT-08-01
2017-12-10,3,2,1800.0,PM,AT-08-01
2017-12-10,3,2,1600.0,AM,AT-08-02
2017-12-10,3,2,1800.0,PM,AT-08-02
2017-12-10,3,2,1600.0,AM,AT-08-03
2017-12-10,3,2,1800.0,PM,AT-08-03
2017-12-10,3,2,1800.0,AM,AT-08-04
2017-12-10,2,2,,PM,AT-08-04
2017-12-10,3,2,1800.0,AM,AT-08-05
2017-12-10,2,2,,PM,AT-08-05
2017-12-10,3,2,1800.0,AM,AT-08-06
2017-12-10,2,2,,PM,AT-08-06
2017-12-11,3,3,,AM,AT-08-01
2017-12-11,3,2,1800.0,PM,AT-08-01
2017-12-11,3,3,,AM,AT-08-02
2017-12-11,3,2,1800.0,PM,AT-08-02
2017-12-11,4,3,2200.0,AM,AT-08-03
2017-12-11,3,2,1800.0,PM,AT-08-03
2017-12-11,4,3,2200.0,AM,AT-08-04
2017-12-11,2,2,,PM,AT-08-04
2017-12-11,4,3,2200.0,AM,AT-08-05
2017-12-11,2,2,,PM,AT-08-05
2017-12-11,4,3,2200.0,AM,AT-08-06
2017-12-11,2,2,,PM,AT-08-06
2017-12-12,3,2,1800.0,AM,AT-08-01
2017-12-12,1,1,,PM,AT-08-01
2017-12-12,3,2,1800.0,AM,AT-08-02
2017-12-12,1,1,,PM,AT-08-02
2017-12-12,3,2,1800.0,AM,AT-08-03
2017-12-12,1,1,,PM,AT-08-03
2017-12-12,3,2,1800.0,AM,AT-08-04
2017-12-12,1,1,,PM,AT-08-04
2017-12-12,3,2,1600.0,AM,AT-08-05
2017-12-12,1,1,,PM,AT-08-05
2017-12-12,3,2,1600.0,AM,AT-08-06
2017-12-12,1,1,,PM,AT-08-06
2017-12-13,3,2,1800.0,AM,AT-08-01
2017-12-13,1,1,,PM,AT-08-01
2017-12-13,3,2,1800.0,AM,AT-08-02
2017-12-13,1,1,,PM,AT-08-02
2017-12-13,3,2,1800.0,AM,AT-08-03
2017-12-13,1,1,,PM,AT-08-03
2017-12-13,3,2,2000.0,AM,AT-08-04
2017-12-13,1,1,,PM,AT-08-04
2017-12-13,3,2,2000.0,AM,AT-08-05
2017-12-13,1,1,,PM,AT-08-05
2017-12-13,3,2,2000.0,AM,AT-08-06
2017-12-13,1,1,,PM,AT-08-06
2017-12-14,3,2,1600.0,AM,AT-08-01
2017-12-14,1,1,,PM,AT-08-01
2017-12-14,3,2,1600.0,AM,AT-08-02
2017-12-14,1,1,,PM,AT-08-02
2017-12-14,3,2,1600.0,AM,AT-08-03
2017-12-14,1,1,,PM,AT-08-03
2017-12-14,3,2,1600.0,AM,AT-08-04
2017-12-14,1,1,,PM,AT-08-04
2017-12-14,3,2,1600.0,AM,AT-08-05
2017-12-14,1,1,,PM,AT-08-05
2017-12-14,3,2,1600.0,AM,AT-08-06
2017-12-14,1,1,,PM,AT-08-06
2017-12-15,3,3,,AM,AT-08-01
2017-12-15,1,1,,PM,AT-08-01
2017-12-15,3,3,,AM,AT-08-02
2017-12-15,1,1,,PM,AT-08-02
2017-12-15,3,3,,AM,AT-08-03
2017-12-15,1,1,,PM,AT-08-03
2017-12-15,3,3,,AM,AT-08-04
2017-12-15,1,1,,PM,AT-08-04
2017-12-15,3,2,1600.0,AM,AT-08-05
2017-12-15,1,1,,PM,AT-08-05
2017-12-15,3,2,1600.0,AM,AT-08-06
2017-12-15,1,1,,PM,AT-08-06
2017-12-16,3,2,1800.0,AM,AT-08-01
2017-12-16,1,1,,PM,AT-08-01
2017-12-16,3,2,1800.0,AM,AT-08-02
2017-12-16,1,1,,PM,AT-08-02
2017-12-16,3,2,1800.0,AM,AT-08-03
2017-12-16,1,1,,PM,AT-08-03
2017-12-16,3,2,1800.0,AM,AT-08-04
2017-12-16,1,1,,PM,AT-08-04
2017-12-16,3,2,1800.0,AM,AT-08-05
2017-12-16,1,1,,PM,AT-08-05
2017-12-16,3,2,1800.0,AM,AT-08-06
2017-12-16,1,1,,PM,AT-08-06
2017-12-17,3,2,1600.0,AM,AT-08-01
2017-12-17,1,1,,PM,AT-08-01
2017-12-17,3,2,1600.0,AM,AT-08-02
2017-12-17,1,1,,PM,AT-08-02
2017-12-17,3,2,1600.0,AM,AT-08-03
2017-12-17,1,1,,PM,AT-08-03
2017-12-17,3,2,1600.0,AM,AT-08-04
2017-12-17,1,1,,PM,AT-08-04
2017-12-17,3,2,1800.0,AM,AT-08-05
2017-12-17,1,1,,PM,AT-08-05
2017-12-17,3,2,1800.0,AM,AT-08-06
2017-12-17,1,1,,PM,AT-08-06
2017-12-18,3,2,1800.0,AM,AT-08-01
2017-12-18,1,1,,PM,AT-08-01
2017-12-18,3,2,1800.0,AM,AT-08-02
2017-12-18,1,1,,PM,AT-08-02
2017-12-18,3,2,1800.0,AM,AT-08-03
2017-12-18,1,1,,PM,AT-08-03
2017-12-18,3,2,1800.0,AM,AT-08-04
2017-12-18,1,1,,PM,AT-08-04
2017-12-18,3,2,2000.0,AM,AT-08-05
2017-12-18,1,1,,PM,AT-08-05
2017-12-18,3,2,2000.0,AM,AT-08-06
2017-12-18,1,1,,PM,AT-08-06
2017-12-19,3,2,2000.0,AM,AT-08-01
2017-12-19,1,1,,PM,AT-08-01
2017-12-19,3,2,2000.0,AM,AT-08-02
2017-12-19,1,1,,PM,AT-08-02
2017-12-19,3,2,2000.0,AM,AT-08-03
2017-12-19,1,1,,PM,AT-08-03
2017-12-19,3,2,2000.0,AM,AT-08-04
2017-12-19,1,1,,PM,AT-08-04
2017-12-19,3,2,2000.0,AM,AT-08-05
2017-12-19,1,1,,PM,AT-08-05
2017-12-19,3,2,2000.0,AM,AT-08-06
2017-12-19,1,1,,PM,AT-08-06
2017-12-20,2,2,,AM,AT-08-01
2017-12-20,1,1,,PM,AT-08-01
2017-12-20,2,2,,AM,AT-08-02
2017-12-20,1,1,,PM,AT-08-02
2017-12-20,2,2,,AM,AT-08-03
2017-12-20,1,1,,PM,AT-08-03
2017-12-20,2,2,,AM,AT-08-04
2017-12-20,1,1,,PM,AT-08-04
2017-12-20,3,2,2200.0,AM,AT-08-05
2017-12-20,1,1,,PM,AT-08-05
2017-12-20,3,2,2200.0,AM,AT-08-06
2017-12-20,1,1,,PM,AT-08-06
2017-12-21,2,2,,AM,AT-08-01
2017-12-21,1,1,,PM,AT-08-01
2017-12-21,2,2,,AM,AT-08-02
2017-12-21,1,1,,PM,AT-08-02
2017-12-21,2,2,,AM,AT-08-03
2017-12-21,1,1,,PM,AT-08-03
2017-12-21,2,2,,AM,AT-08-04
2017-12-21,1,1,,PM,AT-08-04
2017-12-21,2,2,,AM,AT-08-05
2017-12-21,1,1,,PM,AT-08-05
2017-12-21,2,2,,AM,AT-08-06
2017-12-21,1,1,,PM,AT-08-06
2017-12-22,2,3,1800.0,AM,AT-08-01
2017-12-22,1,1,,PM,AT-08-01
2017-12-22,2,3,1800.0,AM,AT-08-02
2017-12-22,1,1,,PM,AT-08-02
2017-12-22,2,3,1800.0,AM,AT-08-03
2017-12-22,1,1,,PM,AT-08-03
2017-12-22,2,3,1800.0,AM,AT-08-04
2017-12-22,1,1,,PM,AT-08-04
2017-12-22,2,3,1800.0,AM,AT-08-05
2017-12-22,1,1,,PM,AT-08-05
2017-12-22,2,3,1800.0,AM,AT-08-06
2017-12-22,1,1,,PM,AT-08-06
2017-12-23,2,3,1800.0,AM,AT-08-01
2017-12-23,1,1,,PM,AT-08-01
2017-12-23,2,3,1800.0,AM,AT-08-02
2017-12-23,1,1,,PM,AT-08-02
2017-12-23,2,3,1800.0,AM,AT-08-03
2017-12-23,1,1,,PM,AT-08-03
2017-12-23,2,3,1800.0,AM,AT-08-04
2017-12-23,1,1,,PM,AT-08-04
2017-12-23,2,3,1800.0,AM,AT-08-05
2017-12-23,1,1,,PM,AT-08-05
2017-12-23,2,3,1800.0,AM,AT-08-06
2017-12-23,1,1,,PM,AT-08-06
2017-12-24,2,2,,AM,AT-08-01
2017-12-24,1,1,,PM,AT-08-01
2017-12-24,2,2,,AM,AT-08-02
2017-12-24,1,1,,PM,AT-08-02
2017-12-24,2,2,,AM,AT-08-03
2017-12-24,1,1,,PM,AT-08-03
2017-12-24,2,2,,AM,AT-08-04
2017-12-24,1,1,,PM,AT-08-04
2017-12-24,2,2,,AM,AT-08-05
2017-12-24,1,1,,PM,AT-08-05
2017-12-24,2,2,,AM,AT-08-06
2017-12-24,1,1,,PM,AT-08-06
2017-12-25,2,2,,AM,AT-08-01
2017-12-25,1,1,,PM,AT-08-01
2017-12-25,2,2,,AM,AT-08-02
2017-12-25,1,1,,PM,AT-08-02
2017-12-25,2,2,,AM,AT-08-03
2017-12-25,1,1,,PM,AT-08-03
2017-12-25,2,2,,AM,AT-08-04
2017-12-25,1,1,,PM,AT-08-04
2017-12-25,2,2,,AM,AT-08-05
2017-12-25,1,1,,PM,AT-08-05
2017-12-25,2,2,,AM,AT-08-06
2017-12-25,1,1,,PM,AT-08-06
2017-12-26,2,2,,AM,AT-08-01
2017-12-26,1,1,,PM,AT-08-01
2017-12-26,2,2,,AM,AT-08-02
2017-12-26,1,1,,PM,AT-08-02
2017-12-26,2,2,,AM,AT-08-03
2017-12-26,1,1,,PM,AT-08-03
2017-12-26,2,2,,AM,AT-08-04
2017-12-26,1,1,,PM,AT-08-04
2017-12-26,2,2,,AM,AT-08-05
2017-12-26,1,1,,PM,AT-08-05
2017-12-26,2,2,,AM,AT-08-06
2017-12-26,1,1,,PM,AT-08-06
2017-12-27,2,2,,AM,AT-08-01
2017-12-27,1,1,,PM,AT-08-01
2017-12-27,2,2,,AM,AT-08-02
2017-12-27,1,1,,PM,AT-08-02
2017-12-27,2,2,,AM,AT-08-03
2017-12-27,1,1,,PM,AT-08-03
2017-12-27,2,2,,AM,AT-08-04
2017-12-27,1,1,,PM,AT-08-04
2017-12-27,2,2,,AM,AT-08-05
2017-12-27,1,1,,PM,AT-08-05
2017-12-27,2,2,,AM,AT-08-06
2017-12-27,1,1,,PM,AT-08-06
2017-12-28,3,2,1800.0,AM,AT-08-01
2017-12-28,1,1,,PM,AT-08-01
2017-12-28,3,2,1800.0,AM,AT-08-02
2017-12-28,1,1,,PM,AT-08-02
2017-12-28,3,2,1800.0,AM,AT-08-03
2017-12-28,1,1,,PM,AT-08-03
2017-12-28,3,2,1800.0,AM,AT-08-04
2017-12-28,1,1,,PM,AT-08-04
2017-12-28,3,2,1800.0,AM,AT-08-05
2017-12-28,1,1,,PM,AT-08-05
2017-12-28,3,2,1800.0,AM,AT-08-06
2017-12-28,1,1,,PM,AT-08-06
2017-12-29,3,3,,AM,AT-08-01
2017-12-29,1,1,,PM,AT-08-01
2017-12-29,3,3,,AM,AT-08-02
2017-12-29,1,1,,PM,AT-08-02
2017-12-29,3,3,,AM,AT-08-03
2017-12-29,1,1,,PM,AT-08-03
2017-12-29,3,2,1600.0,AM,AT-08-04
2017-12-29,1,1,,PM,AT-08-04
2017-12-29,3,2,1600.0,AM,AT-08-05
2017-12-29,1,1,,PM,AT-08-05
2017-12-29,3,2,1600.0,AM,AT-08-06
2017-12-29,1,1,,PM,AT-08-06
2017-12-30,3,2,1800.0,AM,AT-08-01
2017-12-30,1,1,,PM,AT-08-01
2017-12-30,3,2,1800.0,AM,AT-08-02
2017-12-30,1,1,,PM,AT-08-02
2017-12-30,3,2,1800.0,AM,AT-08-03
2017-12-30,1,1,,PM,AT-08-03
2017-12-30,3,2,1800.0,AM,AT-08-04
2017-12-30,1,1,,PM,AT-08-04
2017-12-30,3,2,1800.0,AM,AT-08-05
2017-12-30,1,1,,PM,AT-08-05
2017-12-30,3,2,1800.0,AM,AT-08-06
2017-12-30,1,1,,PM,AT-08-06
2017-12-31,3,3,,AM,AT-08-01
2017-12-31,1,1,,PM,AT-08-01
2017-12-31,3,3,,AM,AT-08-02
2017-12-31,1,1,,PM,AT-08-02
2017-12-31,3,3,,AM,AT-08-03
2017-12-31,1,1,,PM,AT-08-03
2017-12-31,3,3,,AM,AT-08-04
2017-12-31,1,1,,PM,AT-08-04
2017-12-31,3,3,,AM,AT-08-05
2017-12-31,1,1,,PM,AT-08-05
2017-12-31,3,3,,AM,AT-08-06
2017-12-31,1,1,,PM,AT-08-06
2018-01-01,3,2,2000.0,AM,AT-08-01
2018-01-01,1,1,,PM,AT-08-01
2018-01-01,3,2,2000.0,AM,AT-08-02
2018-01-01,1,1,,PM,AT-08-02
2018-01-01,3,2,2000.0,AM,AT-08-03
2018-01-01,1,1,,PM,AT-08-03
2018-01-01,3,2,2000.0,AM,AT-08-04
2018-01-01,1,1,,PM,AT-08-04
2018-01-01,3,2,2000.0,AM,AT-08-05
2018-01-01,1,1,,PM,AT-08-05
2018-01-01,3,2,2000.0,AM,AT-08-06
2018-01-01,1,1,,PM,AT-08-06
2018-01-02,2,2,,AM,AT-08-01
2018-01-02,1,1,,PM,AT-08-01
2018-01-02,3,2,2200.0,AM,AT-08-02
2018-01-02,1,1,,PM,AT-08-02
2018-01-02,3,2,2200.0,AM,AT-08-03
2018-01-02,1,1,,PM,AT-08-03
2018-01-02,3,2,2200.0,AM,AT-08-04
2018-01-02,1,1,,PM,AT-08-04
2018-01-02,3,2,2200.0,AM,AT-08-05
2018-01-02,1,1,,PM,AT-08-05
2018-01-02,3,2,2200.0,AM,AT-08-06
2018-01-02,1,1,,PM,AT-08-06
2018-01-03,3,2,2000.0,AM,AT-08-01
2018-01-03,1,1,,PM,AT-08-01
2018-01-03,3,2,2000.0,AM,AT-08-02
2018-01-03,1,1,,PM,AT-08-02
2018-01-03,3,2,1800.0,AM,AT-08-03
2018-01-03,1,1,,PM,AT-08-03
2018-01-03,3,2,1800.0,AM,AT-08-04
2018-01-03,1,1,,PM,AT-08-04
2018-01-03,3,2,2000.0,AM,AT-08-05
2018-01-03,1,1,,PM,AT-08-05
2018-01-03,3,2,1800.0,AM,AT-08-06
2018-01-03,1,1,,PM,AT-08-06
2018-01-04,3,3,,AM,AT-08-01
2018-01-04,4,3,2000.0,PM,AT-08-01
2018-01-04,3,3,,AM,AT-08-02
2018-01-04,4,3,2000.0,PM,AT-08-02
2018-01-04,3,3,,AM,AT-08-03
2018-01-04,4,3,2000.0,PM,AT-08-03
2018-01-04,3,3,,AM,AT-08-04
2018-01-04,4,3,2000.0,PM,AT-08-04
2018-01-04,3,3,,AM,AT-08-05
2018-01-04,4,3,2000.0,PM,AT-08-05
2018-01-04,3,3,,AM,AT-08-06
2018-01-04,4,3,2000.0,PM,AT-08-06
2018-01-05,3,3,,AM,AT-08-01
2018-01-05,4,3,2000.0,PM,AT-08-01
2018-01-05,4,4,,AM,AT-08-02
2018-01-05,4,3,2000.0,PM,AT-08-02
2018-01-05,4,4,,AM,AT-08-03
2018-01-05,4,3,2000.0,PM,AT-08-03
2018-01-05,4,3,2000.0,AM,AT-08-04
2018-01-05,4,3,2000.0,PM,AT-08-04
2018-01-05,4,3,2000.0,AM,AT-08-05
2018-01-05,4,3,2000.0,PM,AT-08-05
2018-01-05,4,3,2000.0,AM,AT-08-06
2018-01-05,4,3,2000.0,PM,AT-08-06
2018-01-05,3,3,,AM,AT-08-01
2018-01-05,4,3,2000.0,PM,AT-08-01
2018-01-05,4,3,2200.0,AM,AT-08-02
2018-01-05,4,3,2000.0,PM,AT-08-02
2018-01-05,4,3,2200.0,AM,AT-08-03
2018-01-05,4,3,2000.0,PM,AT-08-03
2018-01-05,4,3,2200.0,AM,AT-08-04
2018-01-05,4,3,2000.0,PM,AT-08-04
2018-01-05,4,3,2200.0,AM,AT-08-05
2018-01-05,4,3,2000.0,PM,AT-08-05
2018-01-05,4,3,2200.0,AM,AT-08-06
2018-01-05,4,3,2000.0,PM,AT-08-06
2018-01-06,2,2,,AM,AT-08-01
2018-01-06,4,3,2000.0,PM,AT-08-01
2018-01-06,3,2,2200.0,AM,AT-08-02
2018-01-06,4,3,2000.0,PM,AT-08-02
2018-01-06,3,2,2200.0,AM,AT-08-03
2018-01-06,4,3,2000.0,PM,AT-08-03
2018-01-06,3,2,2200.0,AM,AT-08-04
2018-01-06,4,3,2000.0,PM,AT-08-04
2018-01-06,3,2,2200.0,AM,AT-08-05
2018-01-06,4,3,2000.0,PM,AT-08-05
2018-01-06,3,2,2200.0,AM,AT-08-06
2018-01-06,4,3,2000.0,PM,AT-08-06
2018-01-07,2,2,,AM,AT-08-01
2018-01-07,4,3,2000.0,PM,AT-08-01
2018-01-07,3,2,2200.0,AM,AT-08-02
2018-01-07,4,3,2000.0,PM,AT-08-02
2018-01-07,3,2,2200.0,AM,AT-08-03
2018-01-07,4,3,2000.0,PM,AT-08-03
2018-01-07,3,2,2200.0,AM,AT-08-04
2018-01-07,4,3,2000.0,PM,AT-08-04
2018-01-07,3,2,2200.0,AM,AT-08-05
2018-01-07,4,3,2000.0,PM,AT-08-05
2018-01-07,3,2,2200.0,AM,AT-08-06
2018-01-07,4,3,2000.0,PM,AT-08-06
2018-01-08,2,2,,AM,AT-08-01
2018-01-08,4,3,2000.0,PM,AT-08-01
2018-01-08,2,2,,AM,AT-08-02
2018-01-08,4,3,2000.0,PM,AT-08-02
2018-01-08,3,2,2500.0,AM,AT-08-03
2018-01-08,4,3,2000.0,PM,AT-08-03
2018-01-08,3,2,2500.0,AM,AT-08-04
2018-01-08,4,3,2000.0,PM,AT-08-04
2018-01-08,3,2,2500.0,AM,AT-08-05
2018-01-08,4,3,2000.0,PM,AT-08-05
2018-01-08,3,2,2500.0,AM,AT-08-06
2018-01-08,4,3,2000.0,PM,AT-08-06
2018-01-09,2,2,,AM,AT-08-01
2018-01-09,4,3,2000.0,PM,AT-08-01
2018-01-09,2,2,,AM,AT-08-02
2018-01-09,4,3,2000.0,PM,AT-08-02
2018-01-09,2,2,,AM,AT-08-03
2018-01-09,4,3,2000.0,PM,AT-08-03
2018-01-09,2,2,,AM,AT-08-04
2018-01-09,4,3,2000.0,PM,AT-08-04
2018-01-09,2,2,,AM,AT-08-05
2018-01-09,4,3,2000.0,PM,AT-08-05
2018-01-09,2,2,,AM,AT-08-06
2018-01-09,4,3,2000.0,PM,AT-08-06
2018-01-10,2,1,1500.0,AM,AT-08-01
2018-01-10,4,3,2000.0,PM,AT-08-01
2018-01-10,2,1,1500.0,AM,AT-08-02
2018-01-10,4,3,2000.0,PM,AT-08-02
2018-01-10,2,1,1500.0,AM,AT-08-03
2018-01-10,4,3,2000.0,PM,AT-08-03
2018-01-10,2,1,1500.0,AM,AT-08-04
2018-01-10,4,3,2000.0,PM,AT-08-04
2018-01-10,2,1,1500.0,AM,AT-08-05
2018-01-10,4,3,2000.0,PM,AT-08-05
2018-01-10,2,1,1500.0,AM,AT-08-06
2018-01-10,4,3,2000.0,PM,AT-08-06
2018-01-11,1,1,,AM,AT-08-01
2018-01-11,4,3,2000.0,PM,AT-08-01
2018-01-11,2,1,2200.0,AM,AT-08-02
2018-01-11,4,3,2000.0,PM,AT-08-02
2018-01-11,2,1,2200.0,AM,AT-08-03
2018-01-11,4,3,2000.0,PM,AT-08-03
2018-01-11,2,1,2200.0,AM,AT-08-04
2018-01-11,4,3,2000.0,PM,AT-08-04
2018-01-11,2,1,2200.0,AM,AT-08-05
2018-01-11,4,3,2000.0,PM,AT-08-05
2018-01-11,2,1,2200.0,AM,AT-08-06
2018-01-11,4,3,2000.0,PM,AT-08-06
2018-01-12,1,1,,AM,AT-08-01
2018-01-12,4,3,2000.0,PM,AT-08-01
2018-01-12,1,1,,AM,AT-08-02
2018-01-12,4,3,2000.0,PM,AT-08-02
2018-01-12,2,1,2200.0,AM,AT-08-03
2018-01-12,4,3,2000.0,PM,AT-08-03
2018-01-12,2,1,2200.0,AM,AT-08-04
2018-01-12,4,3,2000.0,PM,AT-08-04
2018-01-12,2,1,2200.0,AM,AT-08-05
2018-01-12,4,3,2000.0,PM,AT-08-05
2018-01-12,2,1,2200.0,AM,AT-08-06
2018-01-12,4,3,2000.0,PM,AT-08-06
2018-01-13,1,1,,AM,AT-08-01
2018-01-13,4,3,2000.0,PM,AT-08-01
2018-01-13,1,1,,AM,AT-08-02
2018-01-13,4,3,2000.0,PM,AT-08-02
2018-01-13,2,1,2200.0,AM,AT-08-03
2018-01-13,4,3,2000.0,PM,AT-08-03
2018-01-13,2,1,2200.0,AM,AT-08-04
2018-01-13,4,3,2000.0,PM,AT-08-04
2018-01-13,2,1,2200.0,AM,AT-08-05
2018-01-13,4,3,2000.0,PM,AT-08-05
2018-01-13,2,1,2200.0,AM,AT-08-06
2018-01-13,4,3,2000.0,PM,AT-08-06
2018-01-14,1,1,,AM,AT-08-01
2018-01-14,4,3,2000.0,PM,AT-08-01
2018-01-14,1,1,,AM,AT-08-02
2018-01-14,4,3,2000.0,PM,AT-08-02
2018-01-14,2,1,2400.0,AM,AT-08-03
2018-01-14,4,3,2000.0,PM,AT-08-03
2018-01-14,2,1,2400.0,AM,AT-08-04
2018-01-14,4,3,2000.0,PM,AT-08-04
2018-01-14,2,1,2400.0,AM,AT-08-05
2018-01-14,4,3,2000.0,PM,AT-08-05
2018-01-14,2,1,2400.0,AM,AT-08-06
2018-01-14,4,3,2000.0,PM,AT-08-06
2018-01-15,1,1,,AM,AT-08-01
2018-01-15,4,3,2000.0,PM,AT-08-01
2018-01-15,1,1,,AM,AT-08-02
2018-01-15,4,3,2000.0,PM,AT-08-02
2018-01-15,2,1,2400.0,AM,AT-08-03
2018-01-15,4,3,2000.0,PM,AT-08-03
2018-01-15,2,1,2400.0,AM,AT-08-04
2018-01-15,4,3,2000.0,PM,AT-08-04
2018-01-15,2,1,2400.0,AM,AT-08-05
2018-01-15,4,3,2000.0,PM,AT-08-05
2018-01-15,2,1,2400.0,AM,AT-08-06
2018-01-15,4,3,2000.0,PM,AT-08-06
2018-01-16,2,1,1800.0,AM,AT-08-01
2018-01-16,3,2,1800.0,PM,AT-08-01
2018-01-16,2,1,1800.0,AM,AT-08-02
2018-01-16,3,2,1800.0,PM,AT-08-02
2018-01-16,2,1,1800.0,AM,AT-08-03
2018-01-16,3,2,1800.0,PM,AT-08-03
2018-01-16,2,1,2000.0,AM,AT-08-04
2018-01-16,3,2,1800.0,PM,AT-08-04
2018-01-16,2,1,2000.0,AM,AT-08-05
2018-01-16,3,2,1800.0,PM,AT-08-05
2018-01-16,2,1,2000.0,AM,AT-08-06
2018-01-16,3,2,1800.0,PM,AT-08-06
2018-01-17,3,3,,AM,AT-08-01
2018-01-17,4,3,1800.0,PM,AT-08-01
2018-01-17,3,3,,AM,AT-08-02
2018-01-17,4,3,1800.0,PM,AT-08-02
2018-01-17,3,3,,AM,AT-08-03
2018-01-17,4,3,1800.0,PM,AT-08-03
2018-01-17,3,2,1800.0,AM,AT-08-04
2018-01-17,4,3,2000.0,PM,AT-08-04
2018-01-17,3,2,1800.0,AM,AT-08-05
2018-01-17,4,3,2000.0,PM,AT-08-05
2018-01-17,3,2,1800.0,AM,AT-08-06
2018-01-17,4,3,2000.0,PM,AT-08-06
2018-01-18,3,3,,AM,AT-08-01
2018-01-18,4,3,1800.0,PM,AT-08-01
2018-01-18,4,3,1800.0,AM,AT-08-02
2018-01-18,4,3,1800.0,PM,AT-08-02
2018-01-18,4,3,1800.0,AM,AT-08-03
2018-01-18,4,3,1800.0,PM,AT-08-03
2018-01-18,4,3,2000.0,AM,AT-08-04
2018-01-18,4,3,2000.0,PM,AT-08-04
2018-01-18,4,3,2000.0,AM,AT-08-05
2018-01-18,4,3,2000.0,PM,AT-08-05
2018-01-18,4,3,2000.0,AM,AT-08-06
2018-01-18,4,3,2000.0,PM,AT-08-06
2018-01-19,3,2,1800.0,AM,AT-08-01
2018-01-19,4,3,1800.0,PM,AT-08-01
2018-01-19,3,2,1800.0,AM,AT-08-02
2018-01-19,4,3,1800.0,PM,AT-08-02
2018-01-19,3,2,1800.0,AM,AT-08-03
2018-01-19,4,3,1800.0,PM,AT-08-03
2018-01-19,3,2,1800.0,AM,AT-08-04
2018-01-19,4,3,2000.0,PM,AT-08-04
2018-01-19,3,2,1800.0,AM,AT-08-05
2018-01-19,4,3,2000.0,PM,AT-08-05
2018-01-19,3,2,1800.0,AM,AT-08-06
2018-01-19,4,3,2000.0,PM,AT-08-06
2018-01-20,3,2,1600.0,AM,AT-08-01
2018-01-20,4,3,1800.0,PM,AT-08-01
2018-01-20,3,2,1800.0,AM,AT-08-02
2018-01-20,4,3,1800.0,PM,AT-08-02
2018-01-20,3,2,1800.0,AM,AT-08-03
2018-01-20,4,3,1800.0,PM,AT-08-03
2018-01-20,3,2,1800.0,AM,AT-08-04
2018-01-20,4,3,2000.0,PM,AT-08-04
2018-01-20,3,2,1800.0,AM,AT-08-05
2018-01-20,4,3,2000.0,PM,AT-08-05
2018-01-20,3,2,1800.0,AM,AT-08-06
2018-01-20,4,3,2000.0,PM,AT-08-06
2018-01-21,4,3,2000.0,AM,AT-08-01
2018-01-21,4,3,1800.0,PM,AT-08-01
2018-01-21,4,3,2000.0,AM,AT-08-02
2018-01-21,4,3,1800.0,PM,AT-08-02
2018-01-21,4,3,1800.0,AM,AT-08-03
2018-01-21,4,3,1800.0,PM,AT-08-03
2018-01-21,4,3,1800.0,AM,AT-08-04
2018-01-21,4,3,2000.0,PM,AT-08-04
2018-01-21,4,3,1800.0,AM,AT-08-05
2018-01-21,4,3,2000.0,PM,AT-08-05
2018-01-21,4,3,1800.0,AM,AT-08-06
2018-01-21,4,3,2000.0,PM,AT-08-06
2018-01-22,4,3,1800.0,AM,AT-08-01
2018-01-22,4,3,1800.0,PM,AT-08-01
2018-01-22,4,4,,AM,AT-08-02
2018-01-22,4,3,1800.0,PM,AT-08-02
2018-01-22,4,4,,AM,AT-08-03
2018-01-22,4,3,1800.0,PM,AT-08-03
2018-01-22,4,4,,AM,AT-08-04
2018-01-22,4,3,2000.0,PM,AT-08-04
2018-01-22,4,4,,AM,AT-08-05
2018-01-22,4,3,2000.0,PM,AT-08-05
2018-01-22,4,4,,AM,AT-08-06
2018-01-22,4,3,2000.0,PM,AT-08-06
2018-01-22,4,3,1800.0,AM,AT-08-01
2018-01-22,4,3,1800.0,PM,AT-08-01
2018-01-22,4,4,,AM,AT-08-02
2018-01-22,4,3,1800.0,PM,AT-08-02
2018-01-22,4,4,,AM,AT-08-03
2018-01-22,4,3,1800.0,PM,AT-08-03
2018-01-22,4,4,,AM,AT-08-04
2018-01-22,4,3,2000.0,PM,AT-08-04
2018-01-22,5,4,1800.0,AM,AT-08-05
2018-01-22,4,3,2000.0,PM,AT-08-05
2018-01-22,4,4,,AM,AT-08-06
2018-01-22,4,3,2000.0,PM,AT-08-06
2018-01-23,4,3,2000.0,AM,AT-08-01
2018-01-23,4,3,1800.0,PM,AT-08-01
2018-01-23,4,4,,AM,AT-08-02
2018-01-23,4,3,1800.0,PM,AT-08-02
2018-01-23,4,3,2000.0,AM,AT-08-03
2018-01-23,4,3,1800.0,PM,AT-08-03
2018-01-23,4,3,2000.0,AM,AT-08-04
2018-01-23,4,3,2000.0,PM,AT-08-04
2018-01-23,4,3,2000.0,AM,AT-08-05
2018-01-23,4,3,2000.0,PM,AT-08-05
2018-01-23,4,3,2000.0,AM,AT-08-06
2018-01-23,4,3,2000.0,PM,AT-08-06
2018-01-24,3,2,2000.0,AM,AT-08-01
2018-01-24,4,3,1800.0,PM,AT-08-01
2018-01-24,3,3,,AM,AT-08-02
2018-01-24,4,3,1800.0,PM,AT-08-02
2018-01-24,3,2,2000.0,AM,AT-08-03
2018-01-24,4,3,1800.0,PM,AT-08-03
2018-01-24,3,2,2000.0,AM,AT-08-04
2018-01-24,4,3,2000.0,PM,AT-08-04
2018-01-24,3,3,,AM,AT-08-05
2018-01-24,4,3,2000.0,PM,AT-08-05
2018-01-24,3,3,,AM,AT-08-06
2018-01-24,4,3,2000.0,PM,AT-08-06
2018-01-25,3,2,2000.0,AM,AT-08-01
2018-01-25,4,3,1800.0,PM,AT-08-01
2018-01-25,3,2,2000.0,AM,AT-08-02
2018-01-25,4,3,1800.0,PM,AT-08-02
2018-01-25,3,2,2000.0,AM,AT-08-03
2018-01-25,4,3,1800.0,PM,AT-08-03
2018-01-25,3,2,2000.0,AM,AT-08-04
2018-01-25,4,3,2000.0,PM,AT-08-04
2018-01-25,3,2,2000.0,AM,AT-08-05
2018-01-25,4,3,2000.0,PM,AT-08-05
2018-01-25,3,2,2000.0,AM,AT-08-06
2018-01-25,4,3,2000.0,PM,AT-08-06
2018-01-26,2,2,,AM,AT-08-01
2018-01-26,4,3,1800.0,PM,AT-08-01
2018-01-26,3,2,2200.0,AM,AT-08-02
2018-01-26,4,3,1800.0,PM,AT-08-02
2018-01-26,3,2,2200.0,AM,AT-08-03
2018-01-26,4,3,1800.0,PM,AT-08-03
2018-01-26,3,2,2200.0,AM,AT-08-04
2018-01-26,4,3,2000.0,PM,AT-08-04
2018-01-26,3,2,2200.0,AM,AT-08-05
2018-01-26,4,3,2000.0,PM,AT-08-05
2018-01-26,3,2,2200.0,AM,AT-08-06
2018-01-26,4,3,2000.0,PM,AT-08-06
2018-01-27,2,2,,AM,AT-08-01
2018-01-27,4,3,1800.0,PM,AT-08-01
2018-01-27,2,2,,AM,AT-08-02
2018-01-27,4,3,1800.0,PM,AT-08-02
2018-01-27,2,2,,AM,AT-08-03
2018-01-27,4,3,1800.0,PM,AT-08-03
2018-01-27,2,2,,AM,AT-08-04
2018-01-27,4,3,2000.0,PM,AT-08-04
2018-01-27,2,2,,AM,AT-08-05
2018-01-27,4,3,2000.0,PM,AT-08-05
2018-01-27,2,2,,AM,AT-08-06
2018-01-27,4,3,2000.0,PM,AT-08-06
2018-01-28,2,2,,AM,AT-08-01
2018-01-28,4,3,1800.0,PM,AT-08-01
2018-01-28,2,2,,AM,AT-08-02
2018-01-28,4,3,1800.0,PM,AT-08-02
2018-01-28,2,2,,AM,AT-08-03
2018-01-28,4,3,1800.0,PM,AT-08-03
2018-01-28,2,2,,AM,AT-08-04
2018-01-28,4,3,2000.0,PM,AT-08-04
2018-01-28,2,2,,AM,AT-08-05
2018-01-28,4,3,2000.0,PM,AT-08-05
2018-01-28,2,2,,AM,AT-08-06
2018-01-28,4,3,2000.0,PM,AT-08-06
2018-01-29,2,1,2000.0,AM,AT-08-01
2018-01-29,4,3,1800.0,PM,AT-08-01
2018-01-29,2,1,2000.0,AM,AT-08-02
2018-01-29,4,3,1800.0,PM,AT-08-02
2018-01-29,2,2,,AM,AT-08-03
2018-01-29,4,3,1800.0,PM,AT-08-03
2018-01-29,2,2,,AM,AT-08-04
2018-01-29,4,3,2000.0,PM,AT-08-04
2018-01-29,2,2,,AM,AT-08-05
2018-01-29,4,3,2000.0,PM,AT-08-05
2018-01-29,2,2,,AM,AT-08-06
2018-01-29,4,3,2000.0,PM,AT-08-06
2018-01-30,2,1,2000.0,AM,AT-08-01
2018-01-30,4,3,1800.0,PM,AT-08-01
2018-01-30,2,1,2000.0,AM,AT-08-02
2018-01-30,4,3,1800.0,PM,AT-08-02
2018-01-30,2,2,,AM,AT-08-03
2018-01-30,4,3,1800.0,PM,AT-08-03
2018-01-30,2,2,,AM,AT-08-04
2018-01-30,4,3,2000.0,PM,AT-08-04
2018-01-30,2,2,,AM,AT-08-05
2018-01-30,4,3,2000.0,PM,AT-08-05
2018-01-30,2,2,,AM,AT-08-06
2018-01-30,4,3,2000.0,PM,AT-08-06
2018-01-31,1,1,,AM,AT-08-01
2018-01-31,4,3,1800.0,PM,AT-08-01
2018-01-31,2,1,2200.0,AM,AT-08-02
2018-01-31,4,3,1800.0,PM,AT-08-02
2018-01-31,2,2,,AM,AT-08-03
2018-01-31,4,3,1800.0,PM,AT-08-03
2018-01-31,2,2,,AM,AT-08-04
2018-01-31,4,3,2000.0,PM,AT-08-04
2018-01-31,2,2,,AM,AT-08-05
2018-01-31,4,3,2000.0,PM,AT-08-05
2018-01-31,2,2,,AM,AT-08-06
2018-01-31,4,3,2000.0,PM,AT-08-06
2018-02-01,2,1,1800.0,AM,AT-08-01
2018-02-01,4,3,1800.0,PM,AT-08-01
2018-02-01,2,1,1800.0,AM,AT-08-02
2018-02-01,4,3,1800.0,PM,AT-08-02
2018-02-01,2,2,,AM,AT-08-03
2018-02-01,4,3,1800.0,PM,AT-08-03
2018-02-01,2,2,,AM,AT-08-04
2018-02-01,4,3,2000.0,PM,AT-08-04
2018-02-01,2,2,,AM,AT-08-05
2018-02-01,4,3,2000.0,PM,AT-08-05
2018-02-01,2,2,,AM,AT-08-06
2018-02-01,4,3,2000.0,PM,AT-08-06
2018-02-02,2,1,1600.0,AM,AT-08-01
2018-02-02,4,3,1800.0,PM,AT-08-01
2018-02-02,2,2,,AM,AT-08-02
2018-02-02,4,3,1800.0,PM,AT-08-02
2018-02-02,2,2,,AM,AT-08-03
2018-02-02,4,3,1800.0,PM,AT-08-03
2018-02-02,2,2,,AM,AT-08-04
2018-02-02,4,3,2000.0,PM,AT-08-04
2018-02-02,2,2,,AM,AT-08-05
2018-02-02,4,3,2000.0,PM,AT-08-05
2018-02-02,2,2,,AM,AT-08-06
2018-02-02,4,3,2000.0,PM,AT-08-06
2018-02-03,2,1,1800.0,AM,AT-08-01
2018-02-03,4,3,1800.0,PM,AT-08-01
2018-02-03,2,2,,AM,AT-08-02
2018-02-03,4,3,1800.0,PM,AT-08-02
2018-02-03,2,2,,AM,AT-08-03
2018-02-03,4,3,1800.0,PM,AT-08-03
2018-02-03,2,2,,AM,AT-08-04
2018-02-03,4,3,2000.0,PM,AT-08-04
2018-02-03,2,2,,AM,AT-08-05
2018-02-03,4,3,2000.0,PM,AT-08-05
2018-02-03,2,2,,AM,AT-08-06
2018-02-03,4,3,2000.0,PM,AT-08-06
2018-02-04,2,1,2000.0,AM,AT-08-01
2018-02-04,4,3,1800.0,PM,AT-08-01
2018-02-04,2,2,,AM,AT-08-02
2018-02-04,4,3,1800.0,PM,AT-08-02
2018-02-04,2,2,,AM,AT-08-03
2018-02-04,4,3,1800.0,PM,AT-08-03
2018-02-04,2,2,,AM,AT-08-04
2018-02-04,4,3,2000.0,PM,AT-08-04
2018-02-04,2,2,,AM,AT-08-05
2018-02-04,4,3,2000.0,PM,AT-08-05
2018-02-04,2,2,,AM,AT-08-06
2018-02-04,4,3,2000.0,PM,AT-08-06
2018-02-05,2,1,2000.0,AM,AT-08-01
2018-02-05,4,3,1800.0,PM,AT-08-01
2018-02-05,2,2,,AM,AT-08-02
2018-02-05,4,3,1800.0,PM,AT-08-02
2018-02-05,2,2,,AM,AT-08-03
2018-02-05,4,3,1800.0,PM,AT-08-03
2018-02-05,2,2,,AM,AT-08-04
2018-02-05,4,3,2000.0,PM,AT-08-04
2018-02-05,2,2,,AM,AT-08-05
2018-02-05,4,3,2000.0,PM,AT-08-05
2018-02-05,2,2,,AM,AT-08-06
2018-02-05,4,3,2000.0,PM,AT-08-06
2018-02-06,2,1,2000.0,AM,AT-08-01
2018-02-06,4,3,1800.0,PM,AT-08-01
2018-02-06,2,1,2200.0,AM,AT-08-02
2018-02-06,4,3,1800.0,PM,AT-08-02
2018-02-06,2,1,2200.0,AM,AT-08-03
2018-02-06,4,3,1800.0,PM,AT-08-03
2018-02-06,2,1,2200.0,AM,AT-08-04
2018-02-06,4,3,2000.0,PM,AT-08-04
2018-02-06,2,1,2200.0,AM,AT-08-05
2018-02-06,4,3,2000.0,PM,AT-08-05
2018-02-06,2,1,2200.0,AM,AT-08-06
2018-02-06,4,3,2000.0,PM,AT-08-06
2018-02-07,1,1,,AM,AT-08-01
2018-02-07,4,3,1800.0,PM,AT-08-01
2018-02-07,1,1,,AM,AT-08-02
2018-02-07,4,3,1800.0,PM,AT-08-02
2018-02-07,2,1,2400.0,AM,AT-08-03
2018-02-07,4,3,1800.0,PM,AT-08-03
2018-02-07,2,1,2400.0,AM,AT-08-04
2018-02-07,4,3,2000.0,PM,AT-08-04
2018-02-07,2,1,2400.0,AM,AT-08-05
2018-02-07,4,3,2000.0,PM,AT-08-05
2018-02-07,2,1,2400.0,AM,AT-08-06
2018-02-07,4,3,2000.0,PM,AT-08-06
2018-02-08,1,1,,AM,AT-08-01
2018-02-08,4,3,1800.0,PM,AT-08-01
2018-02-08,1,1,,AM,AT-08-02
2018-02-08,4,3,1800.0,PM,AT-08-02
2018-02-08,2,1,2400.0,AM,AT-08-03
2018-02-08,4,3,1800.0,PM,AT-08-03
2018-02-08,2,1,2400.0,AM,AT-08-04
2018-02-08,4,3,2000.0,PM,AT-08-04
2018-02-08,2,1,2400.0,AM,AT-08-05
2018-02-08,4,3,2000.0,PM,AT-08-05
2018-02-08,2,1,2400.0,AM,AT-08-06
2018-02-08,4,3,2000.0,PM,AT-08-06
2018-02-09,1,1,,AM,AT-08-01
2018-02-09,4,3,1800.0,PM,AT-08-01
2018-02-09,1,1,,AM,AT-08-02
2018-02-09,4,3,1800.0,PM,AT-08-02
2018-02-09,2,1,2400.0,AM,AT-08-03
2018-02-09,4,3,1800.0,PM,AT-08-03
2018-02-09,2,1,2400.0,AM,AT-08-04
2018-02-09,4,3,2000.0,PM,AT-08-04
2018-02-09,2,1,2400.0,AM,AT-08-05
2018-02-09,4,3,2000.0,PM,AT-08-05
2018-02-09,2,1,2400.0,AM,AT-08-06
2018-02-09,4,3,2000.0,PM,AT-08-06
2018-02-10,1,1,,AM,AT-08-01
2018-02-10,4,3,1800.0,PM,AT-08-01
2018-02-10,1,1,,AM,AT-08-02
2018-02-10,4,3,1800.0,PM,AT-08-02
2018-02-10,1,1,,AM,AT-08-03
2018-02-10,4,3,1800.0,PM,AT-08-03
2018-02-10,1,1,,AM,AT-08-04
2018-02-10,4,3,2000.0,PM,AT-08-04
2018-02-10,1,1,,AM,AT-08-05
2018-02-10,4,3,2000.0,PM,AT-08-05
2018-02-10,1,1,,AM,AT-08-06
2018-02-10,4,3,2000.0,PM,AT-08-06
2018-02-11,1,1,,AM,AT-08-01
2018-02-11,4,3,1800.0,PM,AT-08-01
2018-02-11,1,1,,AM,AT-08-02
2018-02-11,4,3,1800.0,PM,AT-08-02
2018-02-11,1,1,,AM,AT-08-03
2018-02-11,4,3,1800.0,PM,AT-08-03
2018-02-11,1,1,,AM,AT-08-04
2018-02-11,4,3,2000.0,PM,AT-08-04
2018-02-11,1,1,,AM,AT-08-05
2018-02-11,4,3,2000.0,PM,AT-08-05
2018-02-11,1,1,,AM,AT-08-06
2018-02-11,4,3,2000.0,PM,AT-08-06
2018-02-12,2,1,1800.0,AM,AT-08-01
2018-02-12,4,3,1800.0,PM,AT-08-01
2018-02-12,2,1,1800.0,AM,AT-08-02
2018-02-12,4,3,1800.0,PM,AT-08-02
2018-02-12,2,1,2000.0,AM,AT-08-03
2018-02-12,4,3,1800.0,PM,AT-08-03
2018-02-12,2,1,2000.0,AM,AT-08-04
2018-02-12,4,3,2000.0,PM,AT-08-04
2018-02-12,2,1,2000.0,AM,AT-08-05
2018-02-12,4,3,2000.0,PM,AT-08-05
2018-02-12,2,1,1800.0,AM,AT-08-06
2018-02-12,4,3,2000.0,PM,AT-08-06
2018-02-13,3,2,1800.0,AM,AT-08-01
2018-02-13,4,3,1800.0,PM,AT-08-01
2018-02-13,3,2,1800.0,AM,AT-08-02
2018-02-13,4,3,1800.0,PM,AT-08-02
2018-02-13,3,2,2000.0,AM,AT-08-03
2018-02-13,4,3,1800.0,PM,AT-08-03
2018-02-13,3,2,2000.0,AM,AT-08-04
2018-02-13,4,3,2000.0,PM,AT-08-04
2018-02-13,3,2,2000.0,AM,AT-08-05
2018-02-13,4,3,2000.0,PM,AT-08-05
2018-02-13,3,2,2000.0,AM,AT-08-06
2018-02-13,4,3,2000.0,PM,AT-08-06
2018-02-14,2,2,,AM,AT-08-01
2018-02-14,4,3,1800.0,PM,AT-08-01
2018-02-14,2,2,,AM,AT-08-02
2018-02-14,4,3,1800.0,PM,AT-08-02
2018-02-14,3,2,2400.0,AM,AT-08-03
2018-02-14,4,3,1800.0,PM,AT-08-03
2018-02-14,3,2,2400.0,AM,AT-08-04
2018-02-14,4,3,2000.0,PM,AT-08-04
2018-02-14,3,2,2400.0,AM,AT-08-05
2018-02-14,4,3,2000.0,PM,AT-08-05
2018-02-14,3,2,2400.0,AM,AT-08-06
2018-02-14,4,3,2000.0,PM,AT-08-06
2018-02-15,2,2,,AM,AT-08-01
2018-02-15,4,3,1800.0,PM,AT-08-01
2018-02-15,2,2,,AM,AT-08-02
2018-02-15,4,3,1800.0,PM,AT-08-02
2018-02-15,2,2,,AM,AT-08-03
2018-02-15,4,3,1800.0,PM,AT-08-03
2018-02-15,2,2,,AM,AT-08-04
2018-02-15,4,3,2000.0,PM,AT-08-04
2018-02-15,2,2,,AM,AT-08-05
2018-02-15,4,3,2000.0,PM,AT-08-05
2018-02-15,2,2,,AM,AT-08-06
2018-02-15,4,3,2000.0,PM,AT-08-06
2018-02-16,3,3,,AM,AT-08-01
2018-02-16,4,3,1800.0,PM,AT-08-01
2018-02-16,3,3,,AM,AT-08-02
2018-02-16,4,3,1800.0,PM,AT-08-02
2018-02-16,3,3,,AM,AT-08-03
2018-02-16,4,3,1800.0,PM,AT-08-03
2018-02-16,3,3,,AM,AT-08-04
2018-02-16,4,3,2000.0,PM,AT-08-04
2018-02-16,3,3,,AM,AT-08-05
2018-02-16,4,3,2000.0,PM,AT-08-05
2018-02-16,3,3,,AM,AT-08-06
2018-02-16,4,3,2000.0,PM,AT-08-06
2018-02-17,2,2,,AM,AT-08-01
2018-02-17,4,3,1800.0,PM,AT-08-01
2018-02-17,3,2,2000.0,AM,AT-08-02
2018-02-17,4,3,1800.0,PM,AT-08-02
2018-02-17,3,2,2000.0,AM,AT-08-03
2018-02-17,4,3,1800.0,PM,AT-08-03
2018-02-17,3,2,2200.0,AM,AT-08-04
2018-02-17,4,3,2000.0,PM,AT-08-04
2018-02-17,3,2,2200.0,AM,AT-08-05
2018-02-17,4,3,2000.0,PM,AT-08-05
2018-02-17,3,2,2200.0,AM,AT-08-06
2018-02-17,4,3,2000.0,PM,AT-08-06
2018-02-18,2,2,,AM,AT-08-01
2018-02-18,4,3,1800.0,PM,AT-08-01
2018-02-18,3,2,2200.0,AM,AT-08-02
2018-02-18,4,3,1800.0,PM,AT-08-02
2018-02-18,3,2,2200.0,AM,AT-08-03
2018-02-18,4,3,1800.0,PM,AT-08-03
2018-02-18,3,2,2200.0,AM,AT-08-04
2018-02-18,4,3,2000.0,PM,AT-08-04
2018-02-18,3,2,2200.0,AM,AT-08-05
2018-02-18,4,3,2000.0,PM,AT-08-05
2018-02-18,3,2,2200.0,AM,AT-08-06
2018-02-18,4,3,2000.0,PM,AT-08-06
2018-02-19,2,2,,AM,AT-08-01
2018-02-19,4,3,1800.0,PM,AT-08-01
2018-02-19,2,2,,AM,AT-08-02
2018-02-19,4,3,1800.0,PM,AT-08-02
2018-02-19,3,2,2200.0,AM,AT-08-03
2018-02-19,4,3,1800.0,PM,AT-08-03
2018-02-19,3,2,2200.0,AM,AT-08-04
2018-02-19,4,3,2000.0,PM,AT-08-04
2018-02-19,3,2,2200.0,AM,AT-08-05
2018-02-19,4,3,2000.0,PM,AT-08-05
2018-02-19,3,2,2200.0,AM,AT-08-06
2018-02-19,4,3,2000.0,PM,AT-08-06
2018-02-20,2,1,1600.0,AM,AT-08-01
2018-02-20,4,3,1800.0,PM,AT-08-01
2018-02-20,2,1,1600.0,AM,AT-08-02
2018-02-20,4,3,1800.0,PM,AT-08-02
2018-02-20,3,2,2200.0,AM,AT-08-03
2018-02-20,4,3,1800.0,PM,AT-08-03
2018-02-20,3,2,2200.0,AM,AT-08-04
2018-02-20,4,3,2000.0,PM,AT-08-04
2018-02-20,3,2,2400.0,AM,AT-08-05
2018-02-20,4,3,2000.0,PM,AT-08-05
2018-02-20,3,2,2400.0,AM,AT-08-06
2018-02-20,4,3,2000.0,PM,AT-08-06
2018-02-21,2,1,1800.0,AM,AT-08-01
2018-02-21,4,3,1800.0,PM,AT-08-01
2018-02-21,2,1,1800.0,AM,AT-08-02
2018-02-21,4,3,1800.0,PM,AT-08-02
2018-02-21,2,2,,AM,AT-08-03
2018-02-21,4,3,1800.0,PM,AT-08-03
2018-02-21,2,2,,AM,AT-08-04
2018-02-21,4,3,2000.0,PM,AT-08-04
2018-02-21,2,2,,AM,AT-08-05
2018-02-21,4,3,2000.0,PM,AT-08-05
2018-02-21,2,2,,AM,AT-08-06
2018-02-21,4,3,2000.0,PM,AT-08-06
2018-02-22,2,1,1800.0,AM,AT-08-01
2018-02-22,4,3,1800.0,PM,AT-08-01
2018-02-22,2,1,1800.0,AM,AT-08-02
2018-02-22,4,3,1800.0,PM,AT-08-02
2018-02-22,3,2,2200.0,AM,AT-08-03
2018-02-22,4,3,1800.0,PM,AT-08-03
2018-02-22,3,2,2200.0,AM,AT-08-04
2018-02-22,4,3,2000.0,PM,AT-08-04
2018-02-22,2,2,,AM,AT-08-05
2018-02-22,4,3,2000.0,PM,AT-08-05
2018-02-22,2,2,,AM,AT-08-06
2018-02-22,4,3,2000.0,PM,AT-08-06
2018-02-23,2,1,1800.0,AM,AT-08-01
2018-02-23,4,3,1800.0,PM,AT-08-01
2018-02-23,2,1,1800.0,AM,AT-08-02
2018-02-23,4,3,1800.0,PM,AT-08-02
2018-02-23,3,2,2400.0,AM,AT-08-03
2018-02-23,4,3,1800.0,PM,AT-08-03
2018-02-23,3,2,2400.0,AM,AT-08-04
2018-02-23,4,3,2000.0,PM,AT-08-04
2018-02-23,2,1,2000.0,AM,AT-08-05
2018-02-23,4,3,2000.0,PM,AT-08-05
2018-02-23,2,1,2000.0,AM,AT-08-06
2018-02-23,4,3,2000.0,PM,AT-08-06
2018-02-24,2,1,1800.0,AM,AT-08-01
2018-02-24,4,3,1800.0,PM,AT-08-01
2018-02-24,2,1,1800.0,AM,AT-08-02
2018-02-24,4,3,1800.0,PM,AT-08-02
2018-02-24,3,2,2200.0,AM,AT-08-03
2018-02-24,4,3,1800.0,PM,AT-08-03
2018-02-24,3,2,2200.0,AM,AT-08-04
2018-02-24,4,3,2000.0,PM,AT-08-04
2018-02-24,2,1,2000.0,AM,AT-08-05
2018-02-24,4,3,2000.0,PM,AT-08-05
2018-02-24,2,1,2000.0,AM,AT-08-06
2018-02-24,4,3,2000.0,PM,AT-08-06
2018-02-25,2,1,1800.0,AM,AT-08-01
2018-02-25,4,3,1800.0,PM,AT-08-01
2018-02-25,2,1,1800.0,AM,AT-08-02
2018-02-25,4,3,1800.0,PM,AT-08-02
2018-02-25,3,2,2200.0,AM,AT-08-03
2018-02-25,4,3,1800.0,PM,AT-08-03
2018-02-25,3,2,2200.0,AM,AT-08-04
2018-02-25,4,3,2000.0,PM,AT-08-04
2018-02-25,2,1,2000.0,AM,AT-08-05
2018-02-25,4,3,2000.0,PM,AT-08-05
2018-02-25,2,1,2000.0,AM,AT-08-06
2018-02-25,4,3,2000.0,PM,AT-08-06
2018-02-26,2,1,1800.0,AM,AT-08-01
2018-02-26,4,3,1800.0,PM,AT-08-01
2018-02-26,2,1,1800.0,AM,AT-08-02
2018-02-26,4,3,1800.0,PM,AT-08-02
2018-02-26,3,2,2400.0,AM,AT-08-03
2018-02-26,4,3,1800.0,PM,AT-08-03
2018-02-26,3,2,2400.0,AM,AT-08-04
2018-02-26,4,3,2000.0,PM,AT-08-04
2018-02-26,2,1,2000.0,AM,AT-08-05
2018-02-26,4,3,2000.0,PM,AT-08-05
2018-02-26,2,1,2000.0,AM,AT-08-06
2018-02-26,4,3,2000.0,PM,AT-08-06
2018-02-27,2,1,1800.0,AM,AT-08-01
2018-02-27,4,3,1800.0,PM,AT-08-01
2018-02-27,2,1,1800.0,AM,AT-08-02
2018-02-27,4,3,1800.0,PM,AT-08-02
2018-02-27,2,2,,AM,AT-08-03
2018-02-27,4,3,1800.0,PM,AT-08-03
2018-02-27,2,2,,AM,AT-08-04
2018-02-27,4,3,2000.0,PM,AT-08-04
2018-02-27,2,1,2000.0,AM,AT-08-05
2018-02-27,4,3,2000.0,PM,AT-08-05
2018-02-27,2,1,2000.0,AM,AT-08-06
2018-02-27,4,3,2000.0,PM,AT-08-06
2018-02-28,2,1,2000.0,AM,AT-08-01
2018-02-28,4,3,1800.0,PM,AT-08-01
2018-02-28,2,1,2000.0,AM,AT-08-02
2018-02-28,4,3,1800.0,PM,AT-08-02
2018-02-28,2,2,,AM,AT-08-03
2018-02-28,4,3,1800.0,PM,AT-08-03
2018-02-28,2,2,,AM,AT-08-04
2018-02-28,4,3,2000.0,PM,AT-08-04
2018-02-28,2,1,2000.0,AM,AT-08-05
2018-02-28,4,3,2000.0,PM,AT-08-05
2018-02-28,2,1,2000.0,AM,AT-08-06
2018-02-28,4,3,2000.0,PM,AT-08-06
2018-03-01,2,1,1800.0,AM,AT-08-01
2018-03-01,3,1,1800.0,PM,AT-08-01
2018-03-01,3,2,2000.0,AM,AT-08-02
2018-03-01,3,2,1800.0,PM,AT-08-02
2018-03-01,3,2,2000.0,AM,AT-08-03
2018-03-01,3,2,1800.0,PM,AT-08-03
2018-03-01,2,2,,AM,AT-08-04
2018-03-01,3,2,2000.0,PM,AT-08-04
2018-03-01,2,2,,AM,AT-08-05
2018-03-01,3,2,2000.0,PM,AT-08-05
2018-03-01,2,2,,AM,AT-08-06
2018-03-01,3,2,2000.0,PM,AT-08-06
2018-03-02,2,1,1800.0,AM,AT-08-01
2018-03-02,3,1,1800.0,PM,AT-08-01
2018-03-02,2,2,,AM,AT-08-02
2018-03-02,3,2,1800.0,PM,AT-08-02
2018-03-02,3,2,2000.0,AM,AT-08-03
2018-03-02,3,2,1800.0,PM,AT-08-03
2018-03-02,3,2,2000.0,AM,AT-08-04
2018-03-02,3,2,2000.0,PM,AT-08-04
2018-03-02,2,2,,AM,AT-08-05
2018-03-02,3,2,2000.0,PM,AT-08-05
2018-03-02,3,2,2000.0,AM,AT-08-06
2018-03-02,3,2,2000.0,PM,AT-08-06
2018-03-03,2,1,1800.0,AM,AT-08-01
2018-03-03,3,1,1800.0,PM,AT-08-01
2018-03-03,2,1,1800.0,AM,AT-08-02
2018-03-03,3,2,1800.0,PM,AT-08-02
2018-03-03,2,2,,AM,AT-08-03
2018-03-03,3,2,1800.0,PM,AT-08-03
2018-03-03,2,2,,AM,AT-08-04
2018-03-03,3,2,2000.0,PM,AT-08-04
2018-03-03,2,1,2000.0,AM,AT-08-05
2018-03-03,3,2,2000.0,PM,AT-08-05
2018-03-03,2,1,2000.0,AM,AT-08-06
2018-03-03,3,2,2000.0,PM,AT-08-06
2018-03-04,2,1,1800.0,AM,AT-08-01
2018-03-04,3,1,1800.0,PM,AT-08-01
2018-03-04,2,1,1800.0,AM,AT-08-02
2018-03-04,3,2,1800.0,PM,AT-08-02
2018-03-04,2,2,,AM,AT-08-03
2018-03-04,3,2,1800.0,PM,AT-08-03
2018-03-04,2,2,,AM,AT-08-04
2018-03-04,3,2,2000.0,PM,AT-08-04
2018-03-04,2,1,2000.0,AM,AT-08-05
2018-03-04,3,2,2000.0,PM,AT-08-05
2018-03-04,2,1,2000.0,AM,AT-08-06
2018-03-04,3,2,2000.0,PM,AT-08-06
2018-03-05,2,1,1800.0,AM,AT-08-01
2018-03-05,3,1,1800.0,PM,AT-08-01
2018-03-05,2,1,1800.0,AM,AT-08-02
2018-03-05,3,2,1800.0,PM,AT-08-02
2018-03-05,2,2,,AM,AT-08-03
2018-03-05,3,2,1800.0,PM,AT-08-03
2018-03-05,2,2,,AM,AT-08-04
2018-03-05,3,2,2000.0,PM,AT-08-04
2018-03-05,2,1,2000.0,AM,AT-08-05
2018-03-05,3,2,2000.0,PM,AT-08-05
2018-03-05,2,1,2000.0,AM,AT-08-06
2018-03-05,3,2,2000.0,PM,AT-08-06
2018-03-06,2,1,1800.0,AM,AT-08-01
2018-03-06,3,1,1800.0,PM,AT-08-01
2018-03-06,2,1,1800.0,AM,AT-08-02
2018-03-06,3,2,1800.0,PM,AT-08-02
2018-03-06,2,1,1800.0,AM,AT-08-03
2018-03-06,3,2,1800.0,PM,AT-08-03
2018-03-06,2,1,1800.0,AM,AT-08-04
2018-03-06,3,2,2000.0,PM,AT-08-04
2018-03-06,2,1,2000.0,AM,AT-08-05
2018-03-06,3,2,2000.0,PM,AT-08-05
2018-03-06,2,1,2000.0,AM,AT-08-06
2018-03-06,3,2,2000.0,PM,AT-08-06
2018-03-07,2,1,1800.0,AM,AT-08-01
2018-03-07,3,1,1800.0,PM,AT-08-01
2018-03-07,2,1,1800.0,AM,AT-08-02
2018-03-07,3,2,1800.0,PM,AT-08-02
2018-03-07,2,1,2000.0,AM,AT-08-03
2018-03-07,3,2,1800.0,PM,AT-08-03
2018-03-07,2,1,2000.0,AM,AT-08-04
2018-03-07,3,2,2000.0,PM,AT-08-04
2018-03-07,2,1,2000.0,AM,AT-08-05
2018-03-07,3,2,2000.0,PM,AT-08-05
2018-03-07,2,1,2000.0,AM,AT-08-06
2018-03-07,3,2,2000.0,PM,AT-08-06
2018-03-08,3,2,1800.0,AM,AT-08-01
2018-03-08,3,1,1800.0,PM,AT-08-01
2018-03-08,3,2,1800.0,AM,AT-08-02
2018-03-08,3,2,1800.0,PM,AT-08-02
2018-03-08,3,2,2000.0,AM,AT-08-03
2018-03-08,3,2,1800.0,PM,AT-08-03
2018-03-08,3,2,2000.0,AM,AT-08-04
2018-03-08,3,2,2000.0,PM,AT-08-04
2018-03-08,3,2,1800.0,AM,AT-08-05
2018-03-08,3,2,2000.0,PM,AT-08-05
2018-03-08,3,2,1800.0,AM,AT-08-06
2018-03-08,3,2,2000.0,PM,AT-08-06
2018-03-09,2,2,,AM,AT-08-01
2018-03-09,3,1,1800.0,PM,AT-08-01
2018-03-09,3,2,1800.0,AM,AT-08-02
2018-03-09,3,2,1800.0,PM,AT-08-02
2018-03-09,3,2,2200.0,AM,AT-08-03
2018-03-09,3,2,1800.0,PM,AT-08-03
2018-03-09,3,2,2200.0,AM,AT-08-04
2018-03-09,3,2,2000.0,PM,AT-08-04
2018-03-09,3,2,2000.0,AM,AT-08-05
2018-03-09,3,2,2000.0,PM,AT-08-05
2018-03-09,3,2,2000.0,AM,AT-08-06
2018-03-09,3,2,2000.0,PM,AT-08-06
2018-03-10,2,2,,AM,AT-08-01
2018-03-10,3,1,1800.0,PM,AT-08-01
2018-03-10,3,2,1800.0,AM,AT-08-02
2018-03-10,3,2,1800.0,PM,AT-08-02
2018-03-10,3,2,2100.0,AM,AT-08-03
2018-03-10,3,2,1800.0,PM,AT-08-03
2018-03-10,3,2,2200.0,AM,AT-08-04
2018-03-10,3,2,2000.0,PM,AT-08-04
2018-03-10,3,2,2200.0,AM,AT-08-05
2018-03-10,3,2,2000.0,PM,AT-08-05
2018-03-10,3,2,2200.0,AM,AT-08-06
2018-03-10,3,2,2000.0,PM,AT-08-06
2018-03-11,3,3,,AM,AT-08-01
2018-03-11,3,1,1800.0,PM,AT-08-01
2018-03-11,3,3,,AM,AT-08-02
2018-03-11,3,2,1800.0,PM,AT-08-02
2018-03-11,3,3,,AM,AT-08-03
2018-03-11,3,2,1800.0,PM,AT-08-03
2018-03-11,3,3,,AM,AT-08-04
2018-03-11,3,2,2000.0,PM,AT-08-04
2018-03-11,3,3,,AM,AT-08-05
2018-03-11,3,2,2000.0,PM,AT-08-05
2018-03-11,3,3,,AM,AT-08-06
2018-03-11,3,2,2000.0,PM,AT-08-06
2018-03-12,2,2,,AM,AT-08-01
2018-03-12,3,1,1800.0,PM,AT-08-01
2018-03-12,2,2,,AM,AT-08-02
2018-03-12,3,2,1800.0,PM,AT-08-02
2018-03-12,2,2,,AM,AT-08-03
2018-03-12,3,2,1800.0,PM,AT-08-03
2018-03-12,2,2,,AM,AT-08-04
2018-03-12,3,2,2000.0,PM,AT-08-04
2018-03-12,2,2,,AM,AT-08-05
2018-03-12,3,2,2000.0,PM,AT-08-05
2018-03-12,2,2,,AM,AT-08-06
2018-03-12,3,2,2000.0,PM,AT-08-06
2018-03-13,2,2,,AM,AT-08-01
2018-03-13,3,1,1800.0,PM,AT-08-01
2018-03-13,2,2,,AM,AT-08-02
2018-03-13,3,2,1800.0,PM,AT-08-02
2018-03-13,2,2,,AM,AT-08-03
2018-03-13,3,2,1800.0,PM,AT-08-03
2018-03-13,2,2,,AM,AT-08-04
2018-03-13,3,2,2000.0,PM,AT-08-04
2018-03-13,2,2,,AM,AT-08-05
2018-03-13,3,2,2000.0,PM,AT-08-05
2018-03-13,2,2,,AM,AT-08-06
2018-03-13,3,2,2000.0,PM,AT-08-06
2018-03-13,2,2,,AM,AT-08-01
2018-03-13,3,1,1800.0,PM,AT-08-01
2018-03-13,2,2,,AM,AT-08-02
2018-03-13,3,2,1800.0,PM,AT-08-02
2018-03-13,2,2,,AM,AT-08-03
2018-03-13,3,2,1800.0,PM,AT-08-03
2018-03-13,2,2,,AM,AT-08-04
2018-03-13,3,2,2000.0,PM,AT-08-04
2018-03-13,2,2,,AM,AT-08-05
2018-03-13,3,2,2000.0,PM,AT-08-05
2018-03-13,2,2,,AM,AT-08-06
2018-03-13,3,2,2000.0,PM,AT-08-06
2018-03-14,3,2,1800.0,AM,AT-08-01
2018-03-14,3,1,1800.0,PM,AT-08-01
2018-03-14,3,2,1800.0,AM,AT-08-02
2018-03-14,3,2,1800.0,PM,AT-08-02
2018-03-14,3,2,1800.0,AM,AT-08-03
2018-03-14,3,2,1800.0,PM,AT-08-03
2018-03-14,2,2,,AM,AT-08-04
2018-03-14,3,2,2000.0,PM,AT-08-04
2018-03-14,2,2,,AM,AT-08-05
2018-03-14,3,2,2000.0,PM,AT-08-05
2018-03-14,2,2,,AM,AT-08-06
2018-03-14,3,2,2000.0,PM,AT-08-06
2018-03-15,3,2,1800.0,AM,AT-08-01
2018-03-15,3,1,1800.0,PM,AT-08-01
2018-03-15,3,2,1800.0,AM,AT-08-02
2018-03-15,3,2,1800.0,PM,AT-08-02
2018-03-15,3,2,1800.0,AM,AT-08-03
2018-03-15,3,2,1800.0,PM,AT-08-03
2018-03-15,3,2,2200.0,AM,AT-08-04
2018-03-15,3,2,2000.0,PM,AT-08-04
2018-03-15,3,2,2200.0,AM,AT-08-05
2018-03-15,3,2,2000.0,PM,AT-08-05
2018-03-15,3,2,2200.0,AM,AT-08-06
2018-03-15,3,2,2000.0,PM,AT-08-06
2018-03-16,3,2,2000.0,AM,AT-08-01
2018-03-16,3,1,1800.0,PM,AT-08-01
2018-03-16,3,2,2000.0,AM,AT-08-02
2018-03-16,3,2,1800.0,PM,AT-08-02
2018-03-16,3,2,2000.0,AM,AT-08-03
2018-03-16,3,2,1800.0,PM,AT-08-03
2018-03-16,3,2,2200.0,AM,AT-08-04
2018-03-16,3,2,2000.0,PM,AT-08-04
2018-03-16,3,2,2200.0,AM,AT-08-05
2018-03-16,3,2,2000.0,PM,AT-08-05
2018-03-16,3,2,2200.0,AM,AT-08-06
2018-03-16,3,2,2000.0,PM,AT-08-06
2018-03-17,2,1,2000.0,AM,AT-08-01
2018-03-17,3,1,1800.0,PM,AT-08-01
2018-03-17,2,1,2000.0,AM,AT-08-02
2018-03-17,3,2,1800.0,PM,AT-08-02
2018-03-17,2,1,2000.0,AM,AT-08-03
2018-03-17,3,2,1800.0,PM,AT-08-03
2018-03-17,2,1,2000.0,AM,AT-08-04
2018-03-17,3,2,2000.0,PM,AT-08-04
2018-03-17,2,1,2000.0,AM,AT-08-05
2018-03-17,3,2,2000.0,PM,AT-08-05
2018-03-17,2,1,2000.0,AM,AT-08-06
2018-03-17,3,2,2000.0,PM,AT-08-06
2018-03-18,2,1,2000.0,AM,AT-08-01
2018-03-18,3,1,1800.0,PM,AT-08-01
2018-03-18,2,1,2000.0,AM,AT-08-02
2018-03-18,3,2,1800.0,PM,AT-08-02
2018-03-18,2,1,2000.0,AM,AT-08-03
2018-03-18,3,2,1800.0,PM,AT-08-03
2018-03-18,2,1,2000.0,AM,AT-08-04
2018-03-18,3,2,2000.0,PM,AT-08-04
2018-03-18,2,1,2000.0,AM,AT-08-05
2018-03-18,3,2,2000.0,PM,AT-08-05
2018-03-18,2,1,2000.0,AM,AT-08-06
2018-03-18,3,2,2000.0,PM,AT-08-06
2018-03-19,2,1,2000.0,AM,AT-08-01
2018-03-19,3,1,1800.0,PM,AT-08-01
2018-03-19,2,1,2000.0,AM,AT-08-02
2018-03-19,3,2,1800.0,PM,AT-08-02
2018-03-19,2,1,2000.0,AM,AT-08-03
2018-03-19,3,2,1800.0,PM,AT-08-03
2018-03-19,2,1,2000.0,AM,AT-08-04
2018-03-19,3,2,2000.0,PM,AT-08-04
2018-03-19,2,1,2000.0,AM,AT-08-05
2018-03-19,3,2,2000.0,PM,AT-08-05
2018-03-19,2,1,2000.0,AM,AT-08-06
2018-03-19,3,2,2000.0,PM,AT-08-06
2018-03-20,2,1,2000.0,AM,AT-08-01
2018-03-20,3,1,1800.0,PM,AT-08-01
2018-03-20,2,1,2000.0,AM,AT-08-02
2018-03-20,3,2,1800.0,PM,AT-08-02
2018-03-20,2,1,2000.0,AM,AT-08-03
2018-03-20,3,2,1800.0,PM,AT-08-03
2018-03-20,2,1,2000.0,AM,AT-08-04
2018-03-20,3,2,2000.0,PM,AT-08-04
2018-03-20,2,1,2000.0,AM,AT-08-05
2018-03-20,3,2,2000.0,PM,AT-08-05
2018-03-20,2,1,2000.0,AM,AT-08-06
2018-03-20,3,2,2000.0,PM,AT-08-06
2018-03-21,1,1,,AM,AT-08-01
2018-03-21,3,1,1800.0,PM,AT-08-01
2018-03-21,2,1,2000.0,AM,AT-08-02
2018-03-21,3,2,1800.0,PM,AT-08-02
2018-03-21,2,1,2000.0,AM,AT-08-03
2018-03-21,3,2,1800.0,PM,AT-08-03
2018-03-21,2,1,2000.0,AM,AT-08-04
2018-03-21,3,2,2000.0,PM,AT-08-04
2018-03-21,2,1,2000.0,AM,AT-08-05
2018-03-21,3,2,2000.0,PM,AT-08-05
2018-03-21,2,1,2000.0,AM,AT-08-06
2018-03-21,3,2,2000.0,PM,AT-08-06
2018-03-22,2,2,,AM,AT-08-01
2018-03-22,3,1,1800.0,PM,AT-08-01
2018-03-22,2,2,,AM,AT-08-02
2018-03-22,3,2,1800.0,PM,AT-08-02
2018-03-22,2,2,,AM,AT-08-03
2018-03-22,3,2,1800.0,PM,AT-08-03
2018-03-22,2,2,,AM,AT-08-04
2018-03-22,3,2,2000.0,PM,AT-08-04
2018-03-22,2,2,,AM,AT-08-05
2018-03-22,3,2,2000.0,PM,AT-08-05
2018-03-22,2,2,,AM,AT-08-06
2018-03-22,3,2,2000.0,PM,AT-08-06
2018-03-23,2,2,,AM,AT-08-01
2018-03-23,3,1,1800.0,PM,AT-08-01
2018-03-23,2,2,,AM,AT-08-02
2018-03-23,3,2,1800.0,PM,AT-08-02
2018-03-23,2,2,,AM,AT-08-03
2018-03-23,3,2,1800.0,PM,AT-08-03
2018-03-23,2,2,,AM,AT-08-04
2018-03-23,3,2,2000.0,PM,AT-08-04
2018-03-23,2,2,,AM,AT-08-05
2018-03-23,3,2,2000.0,PM,AT-08-05
2018-03-23,2,2,,AM,AT-08-06
2018-03-23,3,2,2000.0,PM,AT-08-06
2018-03-24,2,2,,AM,AT-08-01
2018-03-24,3,1,1800.0,PM,AT-08-01
2018-03-24,2,2,,AM,AT-08-02
2018-03-24,3,2,1800.0,PM,AT-08-02
2018-03-24,2,2,,AM,AT-08-03
2018-03-24,3,2,1800.0,PM,AT-08-03
2018-03-24,2,2,,AM,AT-08-04
2018-03-24,3,2,2000.0,PM,AT-08-04
2018-03-24,2,2,,AM,AT-08-05
2018-03-24,3,2,2000.0,PM,AT-08-05
2018-03-24,2,2,,AM,AT-08-06
2018-03-24,3,2,2000.0,PM,AT-08-06
2018-03-25,2,2,,AM,AT-08-01
2018-03-25,3,1,1800.0,PM,AT-08-01
2018-03-25,2,2,,AM,AT-08-02
2018-03-25,3,2,1800.0,PM,AT-08-02
2018-03-25,2,2,,AM,AT-08-03
2018-03-25,3,2,1800.0,PM,AT-08-03
2018-03-25,2,2,,AM,AT-08-04
2018-03-25,3,2,2000.0,PM,AT-08-04
2018-03-25,2,2,,AM,AT-08-05
2018-03-25,3,2,2000.0,PM,AT-08-05
2018-03-25,2,2,,AM,AT-08-06
2018-03-25,3,2,2000.0,PM,AT-08-06
2018-03-26,2,2,,AM,AT-08-01
2018-03-26,3,1,1800.0,PM,AT-08-01
2018-03-26,2,2,,AM,AT-08-02
2018-03-26,3,2,1800.0,PM,AT-08-02
2018-03-26,2,2,,AM,AT-08-03
2018-03-26,3,2,1800.0,PM,AT-08-03
2018-03-26,2,2,,AM,AT-08-04
2018-03-26,3,2,2000.0,PM,AT-08-04
2018-03-26,2,2,,AM,AT-08-05
2018-03-26,3,2,2000.0,PM,AT-08-05
2018-03-26,2,2,,AM,AT-08-06
2018-03-26,3,2,2000.0,PM,AT-08-06
2018-03-27,1,1,,AM,AT-08-01
2018-03-27,3,1,1800.0,PM,AT-08-01
2018-03-27,2,1,2000.0,AM,AT-08-02
2018-03-27,3,2,1800.0,PM,AT-08-02
2018-03-27,2,1,2000.0,AM,AT-08-03
2018-03-27,3,2,1800.0,PM,AT-08-03
2018-03-27,2,1,2000.0,AM,AT-08-04
2018-03-27,3,2,2000.0,PM,AT-08-04
2018-03-27,2,1,2000.0,AM,AT-08-05
2018-03-27,3,2,2000.0,PM,AT-08-05
2018-03-27,2,1,2000.0,AM,AT-08-06
2018-03-27,3,2,2000.0,PM,AT-08-06
2018-03-28,2,2,,AM,AT-08-01
2018-03-28,3,1,1800.0,PM,AT-08-01
2018-03-28,3,2,2000.0,AM,AT-08-02
2018-03-28,3,2,1800.0,PM,AT-08-02
2018-03-28,3,2,2000.0,AM,AT-08-03
2018-03-28,3,2,1800.0,PM,AT-08-03
2018-03-28,3,2,2000.0,AM,AT-08-04
2018-03-28,3,2,2000.0,PM,AT-08-04
2018-03-28,2,2,,AM,AT-08-05
2018-03-28,3,2,2000.0,PM,AT-08-05
2018-03-28,2,2,,AM,AT-08-06
2018-03-28,3,2,2000.0,PM,AT-08-06
2018-03-29,3,3,,AM,AT-08-01
2018-03-29,3,1,1800.0,PM,AT-08-01
2018-03-29,3,3,,AM,AT-08-02
2018-03-29,3,2,1800.0,PM,AT-08-02
2018-03-29,3,3,,AM,AT-08-03
2018-03-29,3,2,1800.0,PM,AT-08-03
2018-03-29,3,3,,AM,AT-08-04
2018-03-29,3,2,2000.0,PM,AT-08-04
2018-03-29,3,3,,AM,AT-08-05
2018-03-29,3,2,2000.0,PM,AT-08-05
2018-03-29,3,2,2000.0,AM,AT-08-06
2018-03-29,3,2,2000.0,PM,AT-08-06
2018-03-30,3,2,2000.0,AM,AT-08-01
2018-03-30,3,3,,PM,AT-08-01
2018-03-30,3,2,2000.0,AM,AT-08-02
2018-03-30,3,3,,PM,AT-08-02
2018-03-30,3,2,2000.0,AM,AT-08-03
2018-03-30,3,3,,PM,AT-08-03
2018-03-30,3,2,2000.0,AM,AT-08-04
2018-03-30,3,3,,PM,AT-08-04
2018-03-30,3,2,2000.0,AM,AT-08-05
2018-03-30,3,3,,PM,AT-08-05
2018-03-30,3,2,2000.0,AM,AT-08-06
2018-03-30,3,3,,PM,AT-08-06
2018-03-31,3,3,,AM,AT-08-01
2018-03-31,3,3,,PM,AT-08-01
2018-03-31,3,2,2000.0,AM,AT-08-02
2018-03-31,3,3,,PM,AT-08-02
2018-03-31,3,2,2000.0,AM,AT-08-03
2018-03-31,3,3,,PM,AT-08-03
2018-03-31,3,2,2000.0,AM,AT-08-04
2018-03-31,3,3,,PM,AT-08-04
2018-03-31,3,3,,AM,AT-08-05
2018-03-31,3,3,,PM,AT-08-05
2018-03-31,3,2,2000.0,AM,AT-08-06
2018-03-31,3,3,,PM,AT-08-06
2018-04-01,3,2,2000.0,AM,AT-08-01
2018-04-01,3,3,,PM,AT-08-01
2018-04-01,3,2,2000.0,AM,AT-08-02
2018-04-01,3,3,,PM,AT-08-02
2018-04-01,3,2,2000.0,AM,AT-08-03
2018-04-01,3,3,,PM,AT-08-03
2018-04-01,3,2,2000.0,AM,AT-08-04
2018-04-01,3,3,,PM,AT-08-04
2018-04-01,3,2,2000.0,AM,AT-08-05
2018-04-01,3,3,,PM,AT-08-05
2018-04-01,3,2,2000.0,AM,AT-08-06
2018-04-01,3,3,,PM,AT-08-06
2018-04-02,3,3,,AM,AT-08-01
2018-04-02,3,3,,PM,AT-08-01
2018-04-02,3,3,,AM,AT-08-02
2018-04-02,3,3,,PM,AT-08-02
2018-04-02,3,3,,AM,AT-08-03
2018-04-02,3,3,,PM,AT-08-03
2018-04-02,3,3,,AM,AT-08-04
2018-04-02,3,3,,PM,AT-08-04
2018-04-02,3,3,,AM,AT-08-05
2018-04-02,3,3,,PM,AT-08-05
2018-04-02,3,3,,AM,AT-08-06
2018-04-02,3,3,,PM,AT-08-06
2018-04-03,3,3,,AM,AT-08-01
2018-04-03,3,3,,PM,AT-08-01
2018-04-03,3,3,,AM,AT-08-02
2018-04-03,3,3,,PM,AT-08-02
2018-04-03,3,3,,AM,AT-08-03
2018-04-03,3,3,,PM,AT-08-03
2018-04-03,3,3,,AM,AT-08-04
2018-04-03,3,3,,PM,AT-08-04
2018-04-03,3,3,,AM,AT-08-05
2018-04-03,3,3,,PM,AT-08-05
2018-04-03,3,3,,AM,AT-08-06
2018-04-03,3,3,,PM,AT-08-06
2018-04-04,2,2,,AM,AT-08-01
2018-04-04,3,3,,PM,AT-08-01
2018-04-04,2,2,,AM,AT-08-02
2018-04-04,3,3,,PM,AT-08-02
2018-04-04,2,2,,AM,AT-08-03
2018-04-04,3,3,,PM,AT-08-03
2018-04-04,2,2,,AM,AT-08-04
2018-04-04,3,3,,PM,AT-08-04
2018-04-04,2,2,,AM,AT-08-05
2018-04-04,3,3,,PM,AT-08-05
2018-04-04,2,2,,AM,AT-08-06
2018-04-04,3,3,,PM,AT-08-06
2018-04-05,2,3,2000.0,AM,AT-08-01
2018-04-05,3,3,,PM,AT-08-01
2018-04-05,2,3,2000.0,AM,AT-08-02
2018-04-05,3,3,,PM,AT-08-02
2018-04-05,2,3,2000.0,AM,AT-08-03
2018-04-05,3,3,,PM,AT-08-03
2018-04-05,2,3,2000.0,AM,AT-08-04
2018-04-05,3,3,,PM,AT-08-04
2018-04-05,2,3,2000.0,AM,AT-08-05
2018-04-05,3,3,,PM,AT-08-05
2018-04-05,2,3,2000.0,AM,AT-08-06
2018-04-05,3,3,,PM,AT-08-06
2018-04-06,2,2,,AM,AT-08-01
2018-04-06,3,3,,PM,AT-08-01
2018-04-06,2,2,,AM,AT-08-02
2018-04-06,3,3,,PM,AT-08-02
2018-04-06,2,2,,AM,AT-08-03
2018-04-06,3,3,,PM,AT-08-03
2018-04-06,2,2,,AM,AT-08-04
2018-04-06,3,3,,PM,AT-08-04
2018-04-06,2,2,,AM,AT-08-05
2018-04-06,3,3,,PM,AT-08-05
2018-04-06,2,2,,AM,AT-08-06
2018-04-06,3,3,,PM,AT-08-06
2018-04-07,1,1,,AM,AT-08-01
2018-04-07,3,3,,PM,AT-08-01
2018-04-07,2,1,2200.0,AM,AT-08-02
2018-04-07,3,3,,PM,AT-08-02
2018-04-07,2,1,2200.0,AM,AT-08-03
2018-04-07,2,3,2500.0,PM,AT-08-03
2018-04-07,2,1,2200.0,AM,AT-08-04
2018-04-07,2,3,2500.0,PM,AT-08-04
2018-04-07,2,1,2200.0,AM,AT-08-05
2018-04-07,2,3,2500.0,PM,AT-08-05
2018-04-07,2,1,2200.0,AM,AT-08-06
2018-04-07,2,3,2500.0,PM,AT-08-06
2018-04-08,1,1,,AM,AT-08-01
2018-04-08,3,3,,PM,AT-08-01
2018-04-08,2,1,2300.0,AM,AT-08-02
2018-04-08,3,3,,PM,AT-08-02
2018-04-08,2,1,2300.0,AM,AT-08-03
2018-04-08,2,3,2500.0,PM,AT-08-03
2018-04-08,2,1,2300.0,AM,AT-08-04
2018-04-08,2,3,2500.0,PM,AT-08-04
2018-04-08,2,2,,AM,AT-08-05
2018-04-08,2,3,2500.0,PM,AT-08-05
2018-04-08,2,2,,AM,AT-08-06
2018-04-08,2,3,2500.0,PM,AT-08-06
2018-04-09,2,2,,AM,AT-08-01
2018-04-09,3,3,,PM,AT-08-01
2018-04-09,2,2,,AM,AT-08-02
2018-04-09,3,3,,PM,AT-08-02
2018-04-09,2,2,,AM,AT-08-03
2018-04-09,3,3,,PM,AT-08-03
2018-04-09,2,2,,AM,AT-08-04
2018-04-09,3,3,,PM,AT-08-04
2018-04-09,2,2,,AM,AT-08-05
2018-04-09,3,3,,PM,AT-08-05
2018-04-09,2,2,,AM,AT-08-06
2018-04-09,3,3,,PM,AT-08-06
2018-04-10,1,1,,AM,AT-08-01
2018-04-10,3,3,,PM,AT-08-01
2018-04-10,2,1,2400.0,AM,AT-08-02
2018-04-10,3,3,,PM,AT-08-02
2018-04-10,2,1,2400.0,AM,AT-08-03
2018-04-10,2,3,2800.0,PM,AT-08-03
2018-04-10,2,1,2400.0,AM,AT-08-04
2018-04-10,2,3,2800.0,PM,AT-08-04
2018-04-10,2,2,,AM,AT-08-05
2018-04-10,2,3,2800.0,PM,AT-08-05
2018-04-10,2,2,,AM,AT-08-06
2018-04-10,2,3,2800.0,PM,AT-08-06
2018-04-11,1,2,2200.0,AM,AT-08-01
2018-04-11,3,3,,PM,AT-08-01
2018-04-11,1,2,2200.0,AM,AT-08-02
2018-04-11,3,3,,PM,AT-08-02
2018-04-11,1,2,2200.0,AM,AT-08-03
2018-04-11,2,3,2800.0,PM,AT-08-03
2018-04-11,1,2,2200.0,AM,AT-08-04
2018-04-11,2,3,2800.0,PM,AT-08-04
2018-04-11,1,2,2200.0,AM,AT-08-05
2018-04-11,2,3,2800.0,PM,AT-08-05
2018-04-11,2,2,,AM,AT-08-06
2018-04-11,2,3,2800.0,PM,AT-08-06
2018-04-12,2,2,,AM,AT-08-01
2018-04-12,3,3,,PM,AT-08-01
2018-04-12,2,2,,AM,AT-08-02
2018-04-12,3,3,,PM,AT-08-02
2018-04-12,2,2,,AM,AT-08-03
2018-04-12,2,3,2800.0,PM,AT-08-03
2018-04-12,2,2,,AM,AT-08-04
2018-04-12,2,3,2800.0,PM,AT-08-04
2018-04-12,2,2,,AM,AT-08-05
2018-04-12,2,3,2800.0,PM,AT-08-05
2018-04-12,2,2,,AM,AT-08-06
2018-04-12,2,3,2800.0,PM,AT-08-06
2018-04-13,2,2,,AM,AT-08-01
2018-04-13,3,3,,PM,AT-08-01
2018-04-13,2,2,,AM,AT-08-02
2018-04-13,3,3,,PM,AT-08-02
2018-04-13,2,2,,AM,AT-08-03
2018-04-13,2,3,2800.0,PM,AT-08-03
2018-04-13,2,2,,AM,AT-08-04
2018-04-13,2,3,2800.0,PM,AT-08-04
2018-04-13,2,2,,AM,AT-08-05
2018-04-13,2,3,2800.0,PM,AT-08-05
2018-04-13,2,2,,AM,AT-08-06
2018-04-13,2,3,2800.0,PM,AT-08-06
2018-04-14,1,1,,AM,AT-08-01
2018-04-14,2,2,,PM,AT-08-01
2018-04-14,2,1,2400.0,AM,AT-08-02
2018-04-14,2,2,,PM,AT-08-02
2018-04-14,2,1,2400.0,AM,AT-08-03
2018-04-14,2,2,,PM,AT-08-03
2018-04-14,2,1,2400.0,AM,AT-08-04
2018-04-14,2,2,,PM,AT-08-04
2018-04-14,2,1,2400.0,AM,AT-08-05
2018-04-14,2,2,,PM,AT-08-05
2018-04-14,2,1,2400.0,AM,AT-08-06
2018-04-14,2,2,,PM,AT-08-06
2018-04-15,1,1,,AM,AT-08-01
2018-04-15,2,2,,PM,AT-08-01
2018-04-15,2,1,2400.0,AM,AT-08-02
2018-04-15,2,2,,PM,AT-08-02
2018-04-15,2,1,2400.0,AM,AT-08-03
2018-04-15,2,3,2700.0,PM,AT-08-03
2018-04-15,2,1,2400.0,AM,AT-08-04
2018-04-15,2,3,2700.0,PM,AT-08-04
2018-04-15,2,1,2400.0,AM,AT-08-05
2018-04-15,2,3,2700.0,PM,AT-08-05
2018-04-15,2,1,2400.0,AM,AT-08-06
2018-04-15,2,3,2700.0,PM,AT-08-06
2018-04-16,2,3,2400.0,AM,AT-08-01
2018-04-16,2,2,,PM,AT-08-01
2018-04-16,2,3,2400.0,AM,AT-08-02
2018-04-16,2,2,,PM,AT-08-02
2018-04-16,2,3,2400.0,AM,AT-08-03
2018-04-16,2,3,2700.0,PM,AT-08-03
2018-04-16,2,3,2400.0,AM,AT-08-04
2018-04-16,2,3,2700.0,PM,AT-08-04
2018-04-16,2,3,2400.0,AM,AT-08-05
2018-04-16,2,3,2700.0,PM,AT-08-05
2018-04-16,2,3,2400.0,AM,AT-08-06
2018-04-16,2,3,2700.0,PM,AT-08-06
2018-04-17,3,3,,AM,AT-08-01
2018-04-17,3,3,,PM,AT-08-01
2018-04-17,2,3,2600.0,AM,AT-08-02
2018-04-17,3,3,,PM,AT-08-02
2018-04-17,2,3,2600.0,AM,AT-08-03
2018-04-17,3,3,,PM,AT-08-03
2018-04-17,2,3,2600.0,AM,AT-08-04
2018-04-17,3,3,,PM,AT-08-04
2018-04-17,2,3,2600.0,AM,AT-08-05
2018-04-17,3,3,,PM,AT-08-05
2018-04-17,2,3,2600.0,AM,AT-08-06
2018-04-17,3,3,,PM,AT-08-06
2018-04-18,2,2,,AM,AT-08-01
2018-04-18,2,3,2600.0,PM,AT-08-01
2018-04-18,1,2,2600.0,AM,AT-08-02
2018-04-18,2,3,2600.0,PM,AT-08-02
2018-04-18,1,2,2600.0,AM,AT-08-03
2018-04-18,2,3,2600.0,PM,AT-08-03
2018-04-18,1,2,2600.0,AM,AT-08-04
2018-04-18,2,3,2600.0,PM,AT-08-04
2018-04-18,1,2,2600.0,AM,AT-08-05
2018-04-18,2,3,2600.0,PM,AT-08-05
2018-04-18,1,2,2600.0,AM,AT-08-06
2018-04-18,2,3,2600.0,PM,AT-08-06
2018-04-19,2,2,,AM,AT-08-01
2018-04-19,3,3,,PM,AT-08-01
2018-04-19,2,2,,AM,AT-08-02
2018-04-19,3,3,,PM,AT-08-02
2018-04-19,2,2,,AM,AT-08-03
2018-04-19,3,3,,PM,AT-08-03
2018-04-19,2,2,,AM,AT-08-04
2018-04-19,3,3,,PM,AT-08-04
2018-04-19,2,2,,AM,AT-08-05
2018-04-19,3,3,,PM,AT-08-05
2018-04-19,2,2,,AM,AT-08-06
2018-04-19,3,3,,PM,AT-08-06
2018-04-20,2,2,,AM,AT-08-01
2018-04-20,3,3,,PM,AT-08-01
2018-04-20,1,2,2200.0,AM,AT-08-02
2018-04-20,2,3,2600.0,PM,AT-08-02
2018-04-20,1,2,2200.0,AM,AT-08-03
2018-04-20,2,3,2600.0,PM,AT-08-03
2018-04-20,1,2,2200.0,AM,AT-08-04
2018-04-20,2,3,2600.0,PM,AT-08-04
2018-04-20,1,2,2200.0,AM,AT-08-05
2018-04-20,2,3,2600.0,PM,AT-08-05
2018-04-20,1,2,2200.0,AM,AT-08-06
2018-04-20,2,3,2600.0,PM,AT-08-06
2018-04-21,2,2,,AM,AT-08-01
2018-04-21,3,3,,PM,AT-08-01
2018-04-21,1,2,2200.0,AM,AT-08-02
2018-04-21,3,3,,PM,AT-08-02
2018-04-21,1,2,2200.0,AM,AT-08-03
2018-04-21,2,3,2800.0,PM,AT-08-03
2018-04-21,1,2,2200.0,AM,AT-08-04
2018-04-21,2,3,2800.0,PM,AT-08-04
2018-04-21,1,2,2200.0,AM,AT-08-05
2018-04-21,3,3,,PM,AT-08-05
2018-04-21,1,2,2200.0,AM,AT-08-06
2018-04-21,2,3,2800.0,PM,AT-08-06
2018-04-22,2,2,,AM,AT-08-01
2018-04-22,3,3,,PM,AT-08-01
2018-04-22,1,2,2200.0,AM,AT-08-02
2018-04-22,3,3,,PM,AT-08-02
2018-04-22,1,2,2200.0,AM,AT-08-03
2018-04-22,3,3,,PM,AT-08-03
2018-04-22,1,2,2200.0,AM,AT-08-04
2018-04-22,3,3,,PM,AT-08-04
2018-04-22,1,2,2200.0,AM,AT-08-05
2018-04-22,3,3,,PM,AT-08-05
2018-04-22,1,2,2200.0,AM,AT-08-06
2018-04-22,2,3,3000.0,PM,AT-08-06
2018-04-23,2,2,,AM,AT-08-01
2018-04-23,3,3,,PM,AT-08-01
2018-04-23,1,2,2200.0,AM,AT-08-02
2018-04-23,3,3,,PM,AT-08-02
2018-04-23,1,2,2200.0,AM,AT-08-03
2018-04-23,3,3,,PM,AT-08-03
2018-04-23,1,2,2200.0,AM,AT-08-04
2018-04-23,3,3,,PM,AT-08-04
2018-04-23,1,2,2200.0,AM,AT-08-05
2018-04-23,3,3,,PM,AT-08-05
2018-04-23,1,2,2200.0,AM,AT-08-06
2018-04-23,2,3,3000.0,PM,AT-08-06
2018-04-24,2,2,,AM,AT-08-01
2018-04-24,3,3,,PM,AT-08-01
2018-04-24,2,2,,AM,AT-08-02
2018-04-24,3,3,,PM,AT-08-02
2018-04-24,1,2,2500.0,AM,AT-08-03
2018-04-24,3,3,,PM,AT-08-03
2018-04-24,1,2,2500.0,AM,AT-08-04
2018-04-24,2,3,2800.0,PM,AT-08-04
2018-04-24,1,2,2500.0,AM,AT-08-05
2018-04-24,2,3,2800.0,PM,AT-08-05
2018-04-24,1,2,2500.0,AM,AT-08-06
2018-04-24,2,3,2800.0,PM,AT-08-06
2018-04-25,1,1,,AM,AT-08-01
2018-04-25,3,3,,PM,AT-08-01
2018-04-25,1,1,,AM,AT-08-02
2018-04-25,3,3,,PM,AT-08-02
2018-04-25,1,1,,AM,AT-08-03
2018-04-25,3,3,,PM,AT-08-03
2018-04-25,1,1,,AM,AT-08-04
2018-04-25,2,3,2800.0,PM,AT-08-04
2018-04-25,1,1,,AM,AT-08-05
2018-04-25,2,3,2800.0,PM,AT-08-05
2018-04-25,1,1,,AM,AT-08-06
2018-04-25,2,3,2800.0,PM,AT-08-06
2018-04-26,1,2,2000.0,AM,AT-08-01
2018-04-26,2,2,,PM,AT-08-01
2018-04-26,1,2,2200.0,AM,AT-08-02
2018-04-26,2,2,,PM,AT-08-02
2018-04-26,1,2,2000.0,AM,AT-08-03
2018-04-26,2,2,,PM,AT-08-03
2018-04-26,1,2,2000.0,AM,AT-08-04
2018-04-26,2,2,,PM,AT-08-04
2018-04-26,1,2,2000.0,AM,AT-08-05
2018-04-26,2,2,,PM,AT-08-05
2018-04-26,1,2,2000.0,AM,AT-08-06
2018-04-26,2,2,,PM,AT-08-06
2018-04-27,1,1,,AM,AT-08-01
2018-04-27,2,2,,PM,AT-08-01
2018-04-27,1,1,,AM,AT-08-02
2018-04-27,2,2,,PM,AT-08-02
2018-04-27,1,1,,AM,AT-08-03
2018-04-27,1,2,2500.0,PM,AT-08-03
2018-04-27,1,1,,AM,AT-08-04
2018-04-27,1,2,2500.0,PM,AT-08-04
2018-04-27,1,1,,AM,AT-08-05
2018-04-27,1,2,2500.0,PM,AT-08-05
2018-04-27,1,1,,AM,AT-08-06
2018-04-27,1,2,2500.0,PM,AT-08-06
2018-04-28,1,1,,AM,AT-08-01
2018-04-28,3,3,,PM,AT-08-01
2018-04-28,1,1,,AM,AT-08-02
2018-04-28,3,3,,PM,AT-08-02
2018-04-28,1,1,,AM,AT-08-03
2018-04-28,3,3,,PM,AT-08-03
2018-04-28,1,1,,AM,AT-08-04
2018-04-28,2,3,2800.0,PM,AT-08-04
2018-04-28,1,1,,AM,AT-08-05
2018-04-28,2,3,2800.0,PM,AT-08-05
2018-04-28,1,1,,AM,AT-08-06
2018-04-28,2,3,2800.0,PM,AT-08-06
2018-04-29,1,1,,AM,AT-08-01
2018-04-29,2,2,,PM,AT-08-01
2018-04-29,1,1,,AM,AT-08-02
2018-04-29,2,2,,PM,AT-08-02
2018-04-29,1,1,,AM,AT-08-03
2018-04-29,2,2,,PM,AT-08-03
2018-04-29,1,1,,AM,AT-08-04
2018-04-29,2,2,,PM,AT-08-04
2018-04-29,1,1,,AM,AT-08-05
2018-04-29,2,2,,PM,AT-08-05
2018-04-29,1,1,,AM,AT-08-06
2018-04-29,2,2,,PM,AT-08-06
2018-04-30,1,1,,AM,AT-08-01
2018-04-30,2,2,,PM,AT-08-01
2018-04-30,1,1,,AM,AT-08-02
2018-04-30,2,2,,PM,AT-08-02
2018-04-30,1,1,,AM,AT-08-03
2018-04-30,2,2,,PM,AT-08-03
2018-04-30,1,1,,AM,AT-08-04
2018-04-30,2,2,,PM,AT-08-04
2018-04-30,1,1,,AM,AT-08-05
2018-04-30,2,2,,PM,AT-08-05
2018-04-30,1,1,,AM,AT-08-06
2018-04-30,2,2,,PM,AT-08-06
