[
  {
    "valid_regions": [
      "AT-06-04",
      "AT-06-05",
      "AT-06-07",
      "AT-06-18",
      "AT-06-08",
      "AT-06-17",
      "AT-06-15",
      "AT-06-16",
      "AT-06-14",
      "AT-06-13",
      "AT-06-06"
    ],
    "danger_main": [
      {
        "main_value": 1,
        "valid_elevation": null
      }
    ],
    "dangerpattern": [],
    "problem_list": [
      {
        "problem_type": "favourable situation",
        "aspect": [
          "N",
          "NE",
          "E"
        ],
        "valid_elevation": null
      }
    ],
    "report_texts": null,
    "report_id": "RID44RGR1",
    "rep_date": "2020-12-13T18:56:36+00:00",
    "validity_begin": "2020-12-13T18:56:36+00:00",
    "validity_end": "2020-12-14T18:00:00+00:00"
  }
]