LWD;Ausgabezeit;Region;Stufe;Override Stufe;snowpack_stability;frequency;avalanche_sice;daytime;latidude_region;latitide_boundary;latitude;problem 1;problem 2;Stufe;Override Stufe;snowpack_stability;frequency;avalanche_sice;daytime;latidude_region;latitide_boundary;latitude;problem 1;problem 2;Stufe;Override Stufe;snowpack_stability;frequency;avalanche_sice;daytime;latidude_region;latitide_boundary;latitude;problem 1;problem 2;Stufe;Override Stufe;snowpack_stability;frequency;avalanche_sice;daytime;latidude_region;latitide_boundary;latitude;problem 1;problem 2;

Salzburg;2022-11-30 17:00:00;R1;2;1;fair;few;medium;;high;latitude;2700;persistant-weak-layer;gliding-snow;1;0;fair;few;small;;low;latitude;2700;persistant-weak-layer;gliding-snow;
;;R2;1;0;fair;few;small;;;;;persistant-weak-layer;gliding-snow;
;;
Salzburg;2022-12-02 17:00:00;R1;2;0;poor;few;medium;;high;latitude;2300;wind-drifted-snow;gliding-snow;1;0;fair;few;small;;low;latitude;2300;wind-drifted-snow;gliding-snow;
;;R2;1;1;poor;few;small;;;;;wind-drifted-snow;;
;;
Salzburg;2022-12-03 17:00:00;R1;2;0;poor;some;medium;;high;latitude;2300;wind-drifted-snow;gliding-snow;1;0;fair;few;small;;low;latitude;2300;wind-drifted-snow;gliding-snow;
;;R2;1;1;poor;few;small;;;;;wind-drifted-snow;;
;;
Salzburg;2022-12-04 17:00:00;R1;2;0;poor;few;medium;;high;latitude;2400;wind-drifted-snow;gliding-snow;1;0;fair;few;small;;low;latitude;2400;wind-drifted-snow;gliding-snow;
;;R2;1;1;poor;few;small;;;;;wind-drifted-snow;;
;;
Salzburg;2022-12-05 17:00:00;R1;2;0;poor;few;medium;;high;latitude;2400;persistant-weak-layer;gliding-snow;1;0;fair;few;small;;low;latitude;2400;persistant-weak-layer;gliding-snow;
;;R2;1;1;fair;few;small;;;;;wind-drifted-snow;;
;;
Salzburg;2022-12-06 17:00:00;R1;2;0;poor;few;medium;;high;latitude;2400;wind-drifted-snow;persistant-weak-layer;1;0;fair;few;small;;low;latitude;2400;wind-drifted-snow;persistant-weak-layer;
;;R2;1;1;fair;few;small;;;;;wind-drifted-snow;;
;;
Salzburg;2022-12-07 17:00:00;R1;2;0;poor;few;medium;;high;latitude;2400;wind-drifted-snow;persistant-weak-layer;1;0;fair;few;small;;low;latitude;2400;wind-drifted-snow;persistant-weak-layer;
;;R2;1;1;fair;few;small;;;;;wind-drifted-snow;;
;;
Salzburg;2022-12-08 17:00:00;R1;2;0;poor;few;medium;;high;forest;2400;wind-drifted-snow;;1;0;fair;few;small;;low;forest;2400;wind-drifted-snow;;
;;R2;1;1;fair;few;small;;;;;wind-drifted-snow;;
;;
Salzburg;2022-12-09 07:00:00;R1;2;0;poor;few;medium;;high;forest;2400;wind-drifted-snow;;1;0;fair;few;small;;low;forest;2400;wind-drifted-snow;;
;;R2;1;1;fair;few;small;;;;;wind-drifted-snow;;
;;
Salzburg;2022-12-09 17:00:00;R1;2;0;very_poor;few;medium;morning;high;forest;;wind-drifted-snow;;3;0;very_poor;some;medium;afternoon;high;forest;;persistant-weak-layer;;1;0;fair;few;small;morning;low;forest;;wind-drifted-snow;;1;0;fair;few;small;afternoon;low;forest;;persistant-weak-layer;;
;;R2;1;0;very_poor;few;small;morning;high;forest;;wind-drifted-snow;;2;0;very_poor;few;medium;afternoon;high;forest;;persistant-weak-layer;;1;0;fair;none;small;morning;low;forest;;wind-drifted-snow;;1;0;poor;few;small;afternoon;low;forest;;persistant-weak-layer;;
;;
Salzburg;2022-12-10 17:00:00;R1;3;0;very_poor;some;medium;;high;forest;;persistant-weak-layer;wind-drifted-snow;1;0;poor;few;small;;low;forest;;persistant-weak-layer;wind-drifted-snow;
;;R2;2;0;very_poor;few;medium;;high;forest;;persistant-weak-layer;wind-drifted-snow;1;0;poor;few;small;;low;forest;;persistant-weak-layer;wind-drifted-snow;
;;R3;2;0;very_poor;few;medium;;high;forest;;wind-drifted-snow;;1;0;poor;few;small;;low;forest;;wind-drifted-snow;;
;;
Salzburg;2022-12-11 17:00:00;R1;3;0;very_poor;some;medium;;high;forest;;persistant-weak-layer;wind-drifted-snow;1;0;fair;few;small;;low;forest;;persistant-weak-layer;wind-drifted-snow;
;;R2;2;0;very_poor;few;medium;;high;forest;;persistant-weak-layer;wind-drifted-snow;1;0;poor;few;small;;low;forest;;persistant-weak-layer;wind-drifted-snow;
;;R3;2;0;poor;few;medium;;high;forest;;wind-drifted-snow;;1;0;poor;few;small;;low;forest;;wind-drifted-snow;;
;;
Salzburg;2022-12-12 17:00:00;R1;3;0;very_poor;some;medium;;high;forest;;persistant-weak-layer;wind-drifted-snow;1;0;fair;few;small;;low;forest;;persistant-weak-layer;wind-drifted-snow;
;;R2;2;0;very_poor;few;medium;;high;forest;;persistant-weak-layer;wind-drifted-snow;1;0;poor;few;small;;low;forest;;persistant-weak-layer;wind-drifted-snow;
;;R3;2;0;poor;few;medium;;high;forest;;wind-drifted-snow;;1;0;poor;few;small;;low;forest;;wind-drifted-snow;;
;;
Salzburg;2022-12-13 17:00:00;R1;3;0;very_poor;some;medium;;high;forest;;wind-drifted-snow;persistant-weak-layer;1;0;fair;few;small;;low;forest;;wind-drifted-snow;persistant-weak-layer;
;;R2;2;0;poor;few;medium;;high;forest;;persistant-weak-layer;wind-drifted-snow;1;0;poor;few;small;;low;forest;;persistant-weak-layer;wind-drifted-snow;
;;
Salzburg;2022-12-14 17:00:00;R1;2;0;poor;some;medium;;high;latitude;2000;wind-drifted-snow;persistant-weak-layer;1;0;fair;few;small;;low;latitude;2000;wind-drifted-snow;persistant-weak-layer;
;;R2;2;0;poor;few;medium;;high;forest;;persistant-weak-layer;wind-drifted-snow;1;0;poor;few;small;;low;forest;;persistant-weak-layer;wind-drifted-snow;
;;R3;1;0;fair;none;small;;;;;gliding-snow;persistant-weak-layer;
;;R4;2;0;poor;few;medium;;high;latitude;2000;persistant-weak-layer;wind-drifted-snow;1;0;fair;none;small;;low;latitude;2000;persistant-weak-layer;wind-drifted-snow;
;;
Salzburg;2022-12-15 17:00:00;R1;2;0;poor;some;medium;;high;latitude;2300;wind-drifted-snow;persistant-weak-layer;1;0;fair;few;small;;low;latitude;2300;wind-drifted-snow;persistant-weak-layer;
;;R2;1;0;fair;few;medium;;;;;persistant-weak-layer;gliding-snow;
;;
Salzburg;2022-12-16 17:00:00;R1;2;0;poor;few;medium;;high;latitude;2300;wind-drifted-snow;persistant-weak-layer;1;0;fair;few;small;;low;latitude;2300;wind-drifted-snow;persistant-weak-layer;
;;R2;1;0;fair;few;medium;;;;;wind-drifted-snow;gliding-snow;
;;R3;2;0;poor;few;medium;;high;latitude;2000;wind-drifted-snow;persistant-weak-layer;1;0;poor;few;small;;low;latitude;2000;wind-drifted-snow;persistant-weak-layer;
;;
Salzburg;2022-12-17 17:00:00;R1;2;0;poor;few;medium;;high;latitude;2300;wind-drifted-snow;persistant-weak-layer;1;0;fair;few;small;;low;latitude;2300;wind-drifted-snow;persistant-weak-layer;
;;R2;1;0;fair;few;small;;;;;wind-drifted-snow;gliding-snow;
;;R3;2;0;poor;few;medium;;high;latitude;2000;wind-drifted-snow;persistant-weak-layer;1;0;poor;few;small;;low;latitude;2000;wind-drifted-snow;persistant-weak-layer;
;;
Salzburg;2022-12-18 17:00:00;R1;2;0;poor;few;medium;;high;latitude;2500;wind-drifted-snow;persistant-weak-layer;1;0;fair;few;small;;low;latitude;2500;wind-drifted-snow;persistant-weak-layer;
;;R2;1;0;fair;few;small;;;;;wind-drifted-snow;gliding-snow;
;;R3;2;0;poor;few;medium;;high;latitude;2000;wind-drifted-snow;persistant-weak-layer;1;0;poor;few;small;;low;latitude;2000;wind-drifted-snow;persistant-weak-layer;
;;
Salzburg;2022-12-19 17:00:00;R1;2;0;poor;few;medium;;high;latitude;2300;persistant-weak-layer;gliding-snow;1;1;very_poor;some;small;;low;latitude;2300;persistant-weak-layer;gliding-snow;
;;R2;1;0;very_poor;few;small;;;;;gliding-snow;;
;;R3;2;0;poor;few;medium;;high;latitude;2000;wind-drifted-snow;;1;0;poor;few;small;;low;latitude;2000;wind-drifted-snow;;
;;
Salzburg;2022-12-20 17:00:00;R1;2;0;poor;few;medium;;high;latitude;2300;persistant-weak-layer;gliding-snow;1;1;very_poor;some;small;;low;latitude;2300;persistant-weak-layer;gliding-snow;
;;R2;1;0;very_poor;few;small;;;;;gliding-snow;;
;;R3;1;0;fair;few;medium;;high;latitude;2000;wind-drifted-snow;;1;0;very_poor;none;small;;low;latitude;2000;wind-drifted-snow;;
;;
Salzburg;2022-12-21 17:00:00;R1;2;0;poor;few;medium;;high;latitude;2300;persistant-weak-layer;gliding-snow;1;1;very_poor;some;small;;low;latitude;2300;persistant-weak-layer;gliding-snow;
;;R2;1;0;very_poor;few;small;;;;;wet-snow;;
;;
Salzburg;2022-12-22 17:00:00;R1;2;0;poor;few;medium;;high;latitude;2300;persistant-weak-layer;wet-snow;1;1;very_poor;some;small;;low;latitude;2300;persistant-weak-layer;wet-snow;
;;R2;1;1;very_poor;some;small;;;;;wet-snow;;
;;R3;2;0;poor;some;small;;high;latitude;2000;wind-drifted-snow;wet-snow;1;1;very_poor;some;small;;low;latitude;2000;wind-drifted-snow;wet-snow;
;;
Salzburg;2022-12-23 07:59:16;R1;2;0;poor;few;medium;;high;latitude;2300;persistant-weak-layer;wet-snow;2;0;very_poor;some;small;;low;latitude;2300;persistant-weak-layer;wet-snow;
;;R2;2;0;very_poor;some;small;;;;;wet-snow;;
;;R3;2;0;poor;some;small;;high;latitude;2000;wind-drifted-snow;wet-snow;2;0;very_poor;some;small;;low;latitude;2000;wind-drifted-snow;wet-snow;
;;
Salzburg;2022-12-23 17:00:00;R1;3;0;very_poor;some;medium;;high;latitude;2200;persistant-weak-layer;wet-snow;2;0;very_poor;some;small;;low;latitude;2200;persistant-weak-layer;wet-snow;
;;R2;2;0;very_poor;some;small;;high;latitude;1800;wind-drifted-snow;wet-snow;1;0;very_poor;none;small;;low;latitude;1800;wind-drifted-snow;wet-snow;
;;R3;3;0;very_poor;some;medium;;high;latitude;2200;wind-drifted-snow;wet-snow;2;0;very_poor;some;small;;low;latitude;2200;wind-drifted-snow;wet-snow;
;;R4;1;0;very_poor;few;;;;;;wet-snow;;
;;R5;1;0;very_poor;;;;;;;wet-snow;;
;;
Salzburg;2022-12-24 17:00:00;R1;3;0;very_poor;some;medium;;high;latitude;2300;persistant-weak-layer;wind-drifted-snow;1;0;fair;none;small;;low;latitude;2300;persistant-weak-layer;wind-drifted-snow;
;;R2;2;0;poor;few;medium;;high;latitude;2300;wind-drifted-snow;gliding-snow;1;0;fair;none;small;;low;latitude;2300;wind-drifted-snow;gliding-snow;
;;R3;2;0;poor;some;medium;;high;latitude;2300;wind-drifted-snow;new-snow;1;0;fair;none;small;;low;latitude;2300;wind-drifted-snow;new-snow;
;;R4;1;0;poor;none;small;;;;;gliding-snow;;
;;R5;1;1;fair;none;medium;;;;;gliding-snow;;
;;
Salzburg;2022-12-25 17:00:00;R1;2;0;poor;few;medium;;high;latitude;2300;persistant-weak-layer;wind-drifted-snow;1;0;fair;none;small;;low;latitude;2300;persistant-weak-layer;wind-drifted-snow;
;;R2;2;0;poor;few;medium;;high;latitude;2500;wind-drifted-snow;gliding-snow;1;0;very_poor;few;small;;low;latitude;2500;wind-drifted-snow;gliding-snow;
;;R3;1;0;poor;none;small;;;;;gliding-snow;;
;;R4;1;0;poor;few;small;;;;;wind-drifted-snow;;
;;
Salzburg;2022-12-26 17:00:00;R1;2;0;poor;few;medium;;high;latitude;2300;persistant-weak-layer;wind-drifted-snow;1;0;fair;none;small;;low;latitude;2300;persistant-weak-layer;wind-drifted-snow;
;;R2;2;0;poor;few;medium;;high;latitude;2500;wind-drifted-snow;;1;0;fair;none;small;;low;latitude;2500;wind-drifted-snow;;
;;R3;1;0;poor;few;small;;;;;wind-drifted-snow;gliding-snow;
;;
Salzburg;2022-12-27 17:00:00;R1;2;0;poor;few;medium;;high;latitude;2300;persistant-weak-layer;wind-drifted-snow;1;0;fair;none;small;;low;latitude;2300;persistant-weak-layer;wind-drifted-snow;
;;R2;2;0;poor;few;medium;;high;latitude;2500;wind-drifted-snow;;1;0;fair;none;small;;low;latitude;2500;wind-drifted-snow;;
;;R3;1;0;poor;few;small;;;;;wind-drifted-snow;gliding-snow;
;;
Salzburg;2022-12-29 17:00:00;R1;2;0;poor;few;medium;;high;latitude;2300;persistant-weak-layer;wind-drifted-snow;1;0;fair;none;small;;low;latitude;2300;persistant-weak-layer;wind-drifted-snow;
;;R2;1;0;fair;few;small;;;;;wind-drifted-snow;;
;;
Salzburg;2022-12-28 17:00:00;R1;2;0;poor;few;medium;;high;latitude;2300;persistant-weak-layer;wind-drifted-snow;1;0;fair;none;small;;low;latitude;2300;persistant-weak-layer;wind-drifted-snow;
;;R2;1;0;fair;few;medium;;;;;wind-drifted-snow;;
;;R3;1;0;fair;few;small;;;;;wind-drifted-snow;gliding-snow;
;;
Salzburg;2022-12-30 17:00:00;R1;2;0;poor;few;medium;;high;latitude;2300;persistant-weak-layer;wind-drifted-snow;1;0;fair;none;small;;low;latitude;2300;persistant-weak-layer;wind-drifted-snow;
;;R2;1;0;poor;few;small;;;;;wind-drifted-snow;;
;;R3;1;0;poor;few;small;;high;latitude;2000;wind-drifted-snow;;1;0;fair;few;small;;low;latitude;2000;wind-drifted-snow;;
;;
Salzburg;2022-12-31 17:00:00;R1;2;0;poor;few;medium;;high;latitude;2500;gliding-snow;persistant-weak-layer;1;0;fair;none;small;;low;latitude;2500;gliding-snow;persistant-weak-layer;
;;R2;1;0;poor;few;small;;;;;gliding-snow;;
;;
Salzburg;2023-01-01 17:00:00;R1;1;0;poor;none;medium;;;;;gliding-snow;persistant-weak-layer;
;;R2;1;0;poor;none;small;;;;;gliding-snow;;
;;
Salzburg;2023-01-02 17:00:00;R1;1;0;poor;none;medium;;;;;gliding-snow;persistant-weak-layer;
;;R2;1;0;poor;none;small;;;;;gliding-snow;;
;;
Salzburg;2023-01-03 17:00:00;R1;1;0;poor;none;medium;;;;;gliding-snow;persistant-weak-layer;
;;R2;1;0;poor;none;small;;;;;gliding-snow;;
;;
Salzburg;2023-01-04 17:00:00;R1;1;0;poor;none;medium;;;;;wind-drifted-snow;gliding-snow;
;;R2;1;0;poor;few;small;;;;;wind-drifted-snow;gliding-snow;
;;
Salzburg;2023-01-05 17:00:00;R1;1;0;poor;none;medium;;;;;wind-drifted-snow;;
;;R2;1;0;poor;few;small;;;;;wind-drifted-snow;;
;;
Salzburg;2023-01-06 17:00:00;R1;1;1;poor;some;small;;;;;wind-drifted-snow;;
;;R2;1;0;poor;few;small;;;;;wind-drifted-snow;;
;;
Salzburg;2023-01-07 17:00:00;R1;1;1;poor;some;small;;;;;wind-drifted-snow;;
;;R2;1;0;poor;few;small;;;;;wind-drifted-snow;;
;;
Salzburg;2023-01-08 17:00:00;R1;3;0;very_poor;some;medium;;high;forest;;persistant-weak-layer;wind-drifted-snow;1;0;poor;few;small;;low;forest;;persistant-weak-layer;wind-drifted-snow;
;;R2;2;0;poor;some;medium;;high;latitude;2200;wind-drifted-snow;;1;0;fair;few;small;;low;latitude;2200;wind-drifted-snow;;
;;R3;1;0;poor;none;small;;;;;wind-drifted-snow;;
;;
Salzburg;2023-01-09 17:00:00;R1;3;0;very_poor;some;large;;high;forest;;persistant-weak-layer;wind-drifted-snow;1;0;poor;few;small;;low;forest;;persistant-weak-layer;wind-drifted-snow;
;;R2;2;0;very_poor;few;medium;;high;latitude;2200;wind-drifted-snow;;1;0;poor;few;small;;low;latitude;2200;wind-drifted-snow;;
;;R3;1;0;poor;few;small;;;;;wind-drifted-snow;;
;;
Salzburg;2023-01-10 10:01:54;R1;3;0;very_poor;some;large;;high;forest;;persistant-weak-layer;wind-drifted-snow;1;0;poor;few;small;;low;forest;;persistant-weak-layer;wind-drifted-snow;
;;R2;2;0;very_poor;few;medium;;high;latitude;2200;wind-drifted-snow;;1;0;poor;few;small;;low;latitude;2200;wind-drifted-snow;;
;;R3;1;0;poor;few;small;;;;;wind-drifted-snow;;
;;
Salzburg;2023-01-10 17:00:00;R1;3;0;very_poor;some;large;;high;forest;;persistant-weak-layer;gliding-snow;2;0;very_poor;few;medium;;low;forest;;persistant-weak-layer;gliding-snow;
;;R2;2;0;poor;some;medium;;high;forest;;wind-drifted-snow;;1;0;very_poor;few;small;;low;forest;;wind-drifted-snow;;
;;R3;1;0;poor;few;small;;;;;wind-drifted-snow;;
;;R4;1;0;poor;none;small;;;;;wind-drifted-snow;;
;;
Salzburg;2023-01-11 17:00:00;R1;3;0;poor;some;large;;high;latitude;2200;persistant-weak-layer;wind-drifted-snow;2;0;very_poor;few;medium;;low;latitude;2200;persistant-weak-layer;wind-drifted-snow;
;;R2;2;0;poor;some;medium;;high;forest;;wind-drifted-snow;;1;0;very_poor;few;small;;low;forest;;wind-drifted-snow;;
;;R3;1;0;fair;none;small;;;;;wind-drifted-snow;;
;;R4;1;0;fair;none;small;;;;;wind-drifted-snow;;
;;
Salzburg;2023-01-12 17:00:00;R1;2;0;poor;some;medium;;high;latitude;2000;persistant-weak-layer;wind-drifted-snow;1;0;very_poor;none;small;;low;latitude;2000;persistant-weak-layer;wind-drifted-snow;
;;R2;2;0;poor;some;medium;;high;latitude;2300;wind-drifted-snow;;1;0;very_poor;few;small;;low;latitude;2300;wind-drifted-snow;;
;;R3;1;0;fair;none;small;;;;;wind-drifted-snow;;
;;R4;1;0;fair;none;small;;;;;wind-drifted-snow;;
;;R5;1;0;fair;some;small;;;;;wind-drifted-snow;;
;;
Salzburg;2023-01-13 17:00:00;R1;2;0;poor;some;medium;;high;latitude;2000;persistant-weak-layer;wind-drifted-snow;1;0;poor;none;small;;low;latitude;2000;persistant-weak-layer;wind-drifted-snow;
;;R2;2;0;poor;some;medium;;high;latitude;2000;wind-drifted-snow;;1;0;poor;few;small;;low;latitude;2000;wind-drifted-snow;;
;;R3;1;0;fair;none;small;;;;;wind-drifted-snow;;
;;R4;1;0;fair;none;small;;;;;wind-drifted-snow;;
;;
Salzburg;2023-01-14 17:00:00;R1;2;0;poor;some;medium;;high;latitude;1700;persistant-weak-layer;wind-drifted-snow;1;0;poor;few;small;;low;latitude;1700;persistant-weak-layer;wind-drifted-snow;
;;R2;2;0;poor;some;medium;;high;latitude;2000;wind-drifted-snow;;1;0;poor;few;small;;low;latitude;2000;wind-drifted-snow;;
;;R3;1;0;fair;none;small;;;;;wind-drifted-snow;;
;;R4;2;0;poor;few;medium;;high;latitude;2000;wind-drifted-snow;;1;0;poor;few;small;;low;latitude;2000;wind-drifted-snow;;
;;
Salzburg;2023-01-15 17:00:00;R1;2;0;poor;some;medium;;high;latitude;1700;persistant-weak-layer;wind-drifted-snow;1;0;poor;few;small;;low;latitude;1700;persistant-weak-layer;wind-drifted-snow;
;;R2;2;0;poor;some;medium;;high;forest;;wind-drifted-snow;;1;0;poor;few;small;;low;forest;;wind-drifted-snow;;
;;R3;1;0;fair;none;small;;;;;wind-drifted-snow;;
;;R4;2;0;poor;few;medium;;high;forest;2000;wind-drifted-snow;;1;0;poor;few;small;;low;forest;2000;wind-drifted-snow;;
;;
Salzburg;2023-01-16 10:42:41;R1;2;0;poor;some;medium;;high;latitude;1700;persistant-weak-layer;wind-drifted-snow;1;0;poor;few;small;;low;latitude;1700;persistant-weak-layer;wind-drifted-snow;
;;R2;2;0;poor;some;medium;;high;forest;;wind-drifted-snow;;1;0;poor;few;small;;low;forest;;wind-drifted-snow;;
;;R3;1;0;fair;none;small;;;;;wind-drifted-snow;;
;;R4;2;0;poor;few;medium;;high;forest;2000;wind-drifted-snow;;1;0;poor;few;small;;low;forest;2000;wind-drifted-snow;;
;;R5;3;0;poor;many;medium;;high;latitude;2000;wind-drifted-snow;persistant-weak-layer;1;0;poor;few;small;;low;latitude;2000;wind-drifted-snow;persistant-weak-layer;
;;
Salzburg;2023-01-16 17:00:00;R1;2;0;poor;some;medium;;high;forest;;wind-drifted-snow;persistant-weak-layer;1;0;poor;few;small;;low;forest;;wind-drifted-snow;persistant-weak-layer;
;;R2;2;0;poor;some;medium;;high;forest;;wind-drifted-snow;;1;0;poor;few;small;;low;forest;;wind-drifted-snow;;
;;R3;1;0;fair;none;small;;;;;wind-drifted-snow;;
;;R4;2;0;poor;few;medium;;high;forest;;wind-drifted-snow;;1;0;poor;few;small;;low;forest;;wind-drifted-snow;;
;;R5;3;0;poor;many;medium;;high;forest;;wind-drifted-snow;persistant-weak-layer;1;0;poor;few;small;;low;forest;;wind-drifted-snow;persistant-weak-layer;
;;R6;3;0;poor;many;medium;;high;forest;;wind-drifted-snow;;1;0;poor;few;small;;low;forest;;wind-drifted-snow;;
;;
Salzburg;2023-01-17 17:00:00;R1;2;0;poor;some;medium;;high;latitude;1800;wind-drifted-snow;persistant-weak-layer;1;0;poor;few;small;;low;latitude;1800;wind-drifted-snow;persistant-weak-layer;
;;R2;1;0;fair;none;small;;;;;wind-drifted-snow;;
;;R3;3;0;poor;many;medium;;high;latitude;1800;wind-drifted-snow;persistant-weak-layer;1;0;poor;few;small;;low;latitude;1800;wind-drifted-snow;persistant-weak-layer;
;;
Salzburg;2023-01-18 17:00:00;R1;2;0;poor;some;medium;;high;latitude;1800;wind-drifted-snow;persistant-weak-layer;1;0;poor;few;small;;low;latitude;1800;wind-drifted-snow;persistant-weak-layer;
;;R2;1;0;fair;none;small;;;;;wind-drifted-snow;;
;;R3;3;0;poor;many;medium;;high;latitude;1800;wind-drifted-snow;persistant-weak-layer;1;0;poor;few;small;;low;latitude;1800;wind-drifted-snow;persistant-weak-layer;
;;
Salzburg;2023-01-19 17:00:00;R1;2;0;poor;few;medium;;high;latitude;1800;new-snow;persistant-weak-layer;1;0;poor;few;small;;low;latitude;1800;new-snow;persistant-weak-layer;
;;R2;1;0;fair;none;small;;;;;new-snow;;
;;R3;3;0;poor;many;medium;;high;latitude;1600;wind-drifted-snow;persistant-weak-layer;1;0;poor;few;small;;low;latitude;1600;wind-drifted-snow;persistant-weak-layer;
;;R4;3;0;poor;many;medium;;high;latitude;2300;wind-drifted-snow;persistant-weak-layer;2;0;poor;some;medium;;low;latitude;2300;wind-drifted-snow;persistant-weak-layer;
;;
Salzburg;2023-01-20 17:00:00;R1;2;0;very_poor;some;small;morning;high;forest;;new-snow;persistant-weak-layer;3;0;very_poor;some;medium;afternoon;high;latitude;1800;wind-drifted-snow;persistant-weak-layer;1;0;very_poor;few;small;morning;low;forest;;new-snow;persistant-weak-layer;1;0;very_poor;few;small;afternoon;low;latitude;1800;wind-drifted-snow;persistant-weak-layer;
;;R2;2;0;very_poor;some;small;;high;latitude;1400;new-snow;;1;0;very_poor;few;small;;low;latitude;1400;new-snow;;
;;R3;3;0;very_poor;some;medium;;high;latitude;1600;wind-drifted-snow;persistant-weak-layer;1;0;very_poor;few;small;;low;latitude;1600;wind-drifted-snow;persistant-weak-layer;
;;R4;3;0;very_poor;some;medium;;high;latitude;1800;wind-drifted-snow;persistant-weak-layer;2;0;very_poor;some;small;;low;latitude;1800;wind-drifted-snow;persistant-weak-layer;
;;R5;3;0;very_poor;some;medium;;high;latitude;2000;new-snow;wind-drifted-snow;2;0;very_poor;few;medium;;low;latitude;2000;new-snow;wind-drifted-snow;
;;
Salzburg;2023-01-21 17:00:00;R1;2;0;very_poor;few;medium;;;;;new-snow;wind-drifted-snow;
;;R2;3;0;very_poor;some;medium;;high;latitude;1600;wind-drifted-snow;persistant-weak-layer;2;0;very_poor;some;small;;low;latitude;1600;wind-drifted-snow;persistant-weak-layer;
;;R3;3;0;very_poor;some;medium;;high;latitude;1800;wind-drifted-snow;persistant-weak-layer;2;0;very_poor;some;small;;low;latitude;1800;wind-drifted-snow;persistant-weak-layer;
;;R4;3;0;very_poor;some;medium;;high;latitude;2000;wind-drifted-snow;new-snow;2;0;very_poor;few;medium;;low;latitude;2000;wind-drifted-snow;new-snow;
;;
Salzburg;2023-01-22 17:00:00;R1;3;0;very_poor;some;medium;;high;latitude;1600;wind-drifted-snow;persistant-weak-layer;2;0;very_poor;some;small;;low;latitude;1600;wind-drifted-snow;persistant-weak-layer;
;;R2;3;0;very_poor;some;medium;;high;latitude;2000;wind-drifted-snow;persistant-weak-layer;2;0;very_poor;some;small;;low;latitude;2000;wind-drifted-snow;persistant-weak-layer;
;;R3;2;0;poor;some;medium;;;;;wind-drifted-snow;;
;;
Salzburg;2023-01-23 17:00:00;R1;3;0;very_poor;some;medium;;;;;new-snow;wind-drifted-snow;
;;R2;3;0;very_poor;some;medium;;high;latitude;2000;wind-drifted-snow;persistant-weak-layer;2;0;very_poor;some;small;;low;latitude;2000;wind-drifted-snow;persistant-weak-layer;
;;R3;2;0;fair;some;medium;;high;latitude;1300;wind-drifted-snow;;1;0;fair;few;small;;low;latitude;1300;wind-drifted-snow;;
;;R4;3;0;very_poor;some;medium;;high;latitude;1800;new-snow;wind-drifted-snow;2;0;very_poor;few;medium;;low;latitude;1800;new-snow;wind-drifted-snow;
;;R5;3;0;very_poor;some;medium;;high;latitude;1800;wind-drifted-snow;;1;0;very_poor;few;small;;low;latitude;1800;wind-drifted-snow;;
;;
Salzburg;2023-01-24 17:00:00;R1;3;0;very_poor;some;medium;;;;;new-snow;;
;;R2;3;0;poor;some;large;;high;latitude;2000;wind-drifted-snow;persistant-weak-layer;2;0;poor;some;medium;;low;latitude;2000;wind-drifted-snow;persistant-weak-layer;
;;R3;2;0;fair;some;medium;;high;latitude;1300;wind-drifted-snow;;1;0;fair;few;small;;low;latitude;1300;wind-drifted-snow;;
;;R4;3;0;poor;some;large;;high;latitude;1800;new-snow;wind-drifted-snow;2;0;poor;some;medium;;low;latitude;1800;new-snow;wind-drifted-snow;
;;R5;3;1;poor;some;medium;;high;latitude;1800;wind-drifted-snow;;1;0;poor;few;small;;low;latitude;1800;wind-drifted-snow;;
;;
Salzburg;2023-01-25 17:00:00;R1;3;0;poor;some;large;;high;forest;;new-snow;wind-drifted-snow;2;0;poor;some;medium;;low;forest;;new-snow;wind-drifted-snow;
;;R2;2;0;poor;some;medium;;;;;wind-drifted-snow;persistant-weak-layer;
;;R3;2;0;poor;some;medium;;;;;new-snow;wind-drifted-snow;
;;R4;2;0;poor;some;medium;;high;latitude;1800;wind-drifted-snow;;1;0;poor;few;small;;low;latitude;1800;wind-drifted-snow;;
;;
Salzburg;2023-01-26 17:00:00;R1;2;0;poor;some;medium;;;;;wind-drifted-snow;;
;;R2;2;0;poor;some;medium;;high;forest;;wind-drifted-snow;persistant-weak-layer;1;0;poor;few;small;;low;forest;;wind-drifted-snow;persistant-weak-layer;
;;R3;2;0;poor;some;medium;;high;forest;;wind-drifted-snow;;1;0;poor;few;small;;low;forest;;wind-drifted-snow;;
;;R4;2;0;poor;some;medium;;high;forest;;wind-drifted-snow;persistant-weak-layer;1;0;poor;few;small;;low;forest;;wind-drifted-snow;persistant-weak-layer;
;;
Salzburg;2023-01-27 17:00:00;R1;2;0;poor;some;medium;;high;forest;;wind-drifted-snow;;1;0;poor;few;small;;low;forest;;wind-drifted-snow;;
;;R2;2;0;poor;few;medium;;high;latitude;2000;persistant-weak-layer;;1;0;poor;few;small;;low;latitude;2000;persistant-weak-layer;;
;;
Salzburg;2023-01-28 17:00:00;R1;2;0;poor;some;medium;;high;latitude;1800;wind-drifted-snow;persistant-weak-layer;1;0;poor;few;small;;low;latitude;1800;wind-drifted-snow;persistant-weak-layer;
;;R2;2;0;poor;few;medium;;high;latitude;2200;persistant-weak-layer;;1;0;fair;few;small;;low;latitude;2200;persistant-weak-layer;;
;;R3;1;0;fair;few;medium;;;;;persistant-weak-layer;;
;;
Salzburg;2023-01-29 17:00:00;R1;2;0;poor;some;medium;;high;latitude;1800;wind-drifted-snow;;1;0;poor;few;small;;low;latitude;1800;wind-drifted-snow;;
;;R2;2;0;poor;few;medium;morning;high;latitude;1800;wind-drifted-snow;persistant-weak-layer;3;0;very_poor;some;medium;afternoon;high;latitude;1800;wind-drifted-snow;persistant-weak-layer;1;0;good;none;small;morning;low;latitude;1800;wind-drifted-snow;persistant-weak-layer;1;0;poor;few;small;afternoon;low;latitude;1800;wind-drifted-snow;persistant-weak-layer;
;;R3;2;0;poor;some;medium;morning;high;latitude;1800;wind-drifted-snow;;3;0;very_poor;some;medium;afternoon;high;latitude;1800;wind-drifted-snow;;1;0;good;none;small;morning;low;latitude;1800;wind-drifted-snow;;1;0;poor;few;small;afternoon;low;latitude;1800;wind-drifted-snow;;
;;
Salzburg;2023-01-30 17:00:00;R1;2;0;poor;some;medium;;high;latitude;1800;wind-drifted-snow;;1;0;poor;few;small;;low;latitude;1800;wind-drifted-snow;;
;;R2;3;0;very_poor;some;medium;;high;latitude;1800;wind-drifted-snow;persistant-weak-layer;1;0;poor;few;small;;low;latitude;1800;wind-drifted-snow;persistant-weak-layer;
;;R3;3;0;very_poor;some;medium;;high;forest;;wind-drifted-snow;;1;0;poor;few;small;;low;forest;;wind-drifted-snow;;
;;
Salzburg;2023-01-31 17:00:00;R1;2;0;poor;few;medium;;high;latitude;1800;wind-drifted-snow;;1;0;poor;few;small;;low;latitude;1800;wind-drifted-snow;;
;;R2;3;0;very_poor;some;medium;;high;forest;;wind-drifted-snow;persistant-weak-layer;1;0;poor;few;small;;low;forest;;wind-drifted-snow;persistant-weak-layer;
;;R3;3;0;very_poor;some;medium;;high;forest;;wind-drifted-snow;;1;0;poor;few;small;;low;forest;;wind-drifted-snow;;
;;
Salzburg;2023-02-01 17:00:00;R1;2;0;poor;some;medium;morning;high;forest;;wind-drifted-snow;;3;0;very_poor;some;medium;afternoon;high;forest;;wind-drifted-snow;;1;0;fair;few;small;morning;low;forest;;wind-drifted-snow;;1;0;fair;few;small;afternoon;low;forest;;wind-drifted-snow;;
;;R2;3;0;very_poor;some;medium;morning;high;forest;;wind-drifted-snow;persistant-weak-layer;4;0;very_poor;some;very_large;afternoon;high;forest;;new-snow;persistant-weak-layer;2;0;poor;few;medium;morning;low;forest;;wind-drifted-snow;persistant-weak-layer;3;0;very_poor;some;medium;afternoon;low;forest;;new-snow;persistant-weak-layer;
;;R3;3;0;very_poor;some;medium;morning;high;forest;;wind-drifted-snow;;4;0;very_poor;many;large;afternoon;high;forest;;new-snow;;2;0;poor;some;medium;morning;low;forest;;wind-drifted-snow;;3;0;very_poor;some;medium;afternoon;low;forest;;new-snow;;
;;R4;3;0;very_poor;some;medium;morning;high;forest;;wind-drifted-snow;;4;1;very_poor;some;large;afternoon;high;forest;;new-snow;;2;0;poor;some;small;morning;low;forest;;wind-drifted-snow;;3;0;very_poor;some;medium;afternoon;low;forest;;new-snow;;
;;
Salzburg;2023-02-02 17:00:00;R1;4;0;very_poor;many;large;;high;forest;;new-snow;persistant-weak-layer;3;0;very_poor;some;medium;;low;forest;;new-snow;persistant-weak-layer;
;;R2;4;0;very_poor;many;large;;high;forest;;new-snow;gliding-snow;3;0;very_poor;some;medium;;low;forest;;new-snow;gliding-snow;
;;R3;4;0;very_poor;many;large;;high;forest;;new-snow;;3;0;very_poor;some;medium;;low;forest;;new-snow;;
;;R4;3;0;very_poor;some;medium;;high;latitude;1600;wind-drifted-snow;;1;0;poor;few;small;;low;latitude;1600;wind-drifted-snow;;
;;
Salzburg;2023-02-03 17:00:00;R1;4;0;very_poor;many;large;;high;forest;;new-snow;persistant-weak-layer;3;0;very_poor;some;large;;low;forest;;new-snow;persistant-weak-layer;
;;R2;4;0;very_poor;many;large;;high;forest;;new-snow;gliding-snow;3;0;very_poor;some;medium;;low;forest;;new-snow;gliding-snow;
;;R3;4;0;very_poor;many;large;;high;forest;;new-snow;;3;0;very_poor;some;large;;low;forest;;new-snow;;
;;R4;3;0;very_poor;some;medium;;high;latitude;1600;wind-drifted-snow;;1;0;poor;few;small;;low;latitude;1600;wind-drifted-snow;;
;;
Salzburg;2023-02-04 17:00:00;R1;3;0;poor;some;large;;high;latitude;1400;wind-drifted-snow;;2;0;poor;some;medium;;low;latitude;1400;wind-drifted-snow;;
;;R2;3;0;poor;some;large;;;;;wind-drifted-snow;;
;;R3;4;0;very_poor;many;large;;high;latitude;2200;wind-drifted-snow;persistant-weak-layer;3;0;poor;some;large;;low;latitude;2200;wind-drifted-snow;persistant-weak-layer;
;;R4;3;0;very_poor;some;medium;;high;latitude;1600;wind-drifted-snow;;1;0;poor;few;small;;low;latitude;1600;wind-drifted-snow;;
;;
Salzburg;2023-02-05 17:00:00;R1;2;0;poor;few;medium;;high;latitude;1400;wind-drifted-snow;;1;0;fair;few;small;;low;latitude;1400;wind-drifted-snow;;
;;R2;3;0;poor;some;large;;high;latitude;2000;wind-drifted-snow;;2;0;poor;some;medium;;low;latitude;2000;wind-drifted-snow;;
;;R3;3;0;poor;some;large;;high;forest;;wind-drifted-snow;;2;0;poor;some;medium;;low;forest;;wind-drifted-snow;;
;;R4;3;0;poor;some;large;;high;latitude;2200;wind-drifted-snow;persistant-weak-layer;2;0;poor;some;medium;;low;latitude;2200;wind-drifted-snow;persistant-weak-layer;
;;
Salzburg;2023-02-06 17:00:00;R1;2;1;fair;few;medium;;high;forest;;wind-drifted-snow;;1;0;fair;few;small;;low;forest;;wind-drifted-snow;;
;;R2;2;0;fair;few;large;;;;;wind-drifted-snow;;
;;R3;2;0;poor;few;large;;;;;wind-drifted-snow;persistant-weak-layer;
;;
Salzburg;2023-02-07 17:00:00;R1;2;0;fair;some;medium;;high;forest;;wind-drifted-snow;gliding-snow;1;0;good;few;medium;;low;forest;;wind-drifted-snow;gliding-snow;
;;R2;2;0;poor;some;medium;morning;high;tree;;wind-drifted-snow;persistant-weak-layer;3;0;poor;some;large;afternoon;high;latitude;2000;wind-drifted-snow;persistant-weak-layer;1;0;fair;few;medium;morning;low;tree;;wind-drifted-snow;persistant-weak-layer;1;0;fair;few;medium;afternoon;low;latitude;2000;wind-drifted-snow;persistant-weak-layer;
;;
Salzburg;2023-02-08 17:00:00;R1;2;0;poor;some;medium;;high;forest;;wind-drifted-snow;gliding-snow;1;0;good;few;medium;;low;forest;;wind-drifted-snow;gliding-snow;
;;R2;2;0;poor;some;medium;;high;forest;;wind-drifted-snow;persistant-weak-layer;1;1;very_poor;few;medium;;low;forest;;wind-drifted-snow;persistant-weak-layer;
;;
Salzburg;2023-02-09 17:00:00;R1;2;0;poor;some;medium;;high;forest;;wind-drifted-snow;gliding-snow;1;0;good;few;medium;;low;forest;;wind-drifted-snow;gliding-snow;
;;R2;2;0;poor;some;medium;;high;forest;;wind-drifted-snow;persistant-weak-layer;1;1;very_poor;few;medium;;low;forest;;wind-drifted-snow;persistant-weak-layer;
;;
Salzburg;2023-02-10 17:00:00;R1;2;0;poor;some;medium;;high;latitude;1800;wind-drifted-snow;gliding-snow;1;0;fair;few;medium;;low;latitude;1800;wind-drifted-snow;gliding-snow;
;;R2;2;0;poor;some;medium;;high;latitude;1800;wind-drifted-snow;persistant-weak-layer;1;1;very_poor;few;medium;;low;latitude;1800;wind-drifted-snow;persistant-weak-layer;
;;R3;1;0;fair;few;medium;;;;;gliding-snow;persistant-weak-layer;
;;
Salzburg;2023-02-11 17:00:00;R1;2;0;poor;few;medium;;high;latitude;2000;wind-drifted-snow;gliding-snow;1;0;fair;few;medium;;low;latitude;2000;wind-drifted-snow;gliding-snow;
;;R2;2;0;poor;few;medium;;high;latitude;2000;wind-drifted-snow;persistant-weak-layer;1;0;fair;few;medium;;low;latitude;2000;wind-drifted-snow;persistant-weak-layer;
;;R3;1;0;fair;few;medium;;;;;gliding-snow;persistant-weak-layer;
;;R4;2;0;poor;few;medium;;high;latitude;1600;wind-drifted-snow;persistant-weak-layer;1;0;fair;few;medium;;low;latitude;1600;wind-drifted-snow;persistant-weak-layer;
;;
Salzburg;2023-02-12 17:00:00;R1;2;0;poor;few;medium;;high;latitude;2000;wind-drifted-snow;persistant-weak-layer;1;0;poor;few;small;;low;latitude;2000;wind-drifted-snow;persistant-weak-layer;
;;R2;2;0;poor;few;medium;;high;latitude;2400;wind-drifted-snow;gliding-snow;1;0;very_poor;few;small;;low;latitude;2400;wind-drifted-snow;gliding-snow;
;;R3;1;0;poor;few;small;;;;;wind-drifted-snow;;
;;R4;1;0;fair;few;medium;;;;;wind-drifted-snow;;
;;R5;1;0;very_poor;few;small;;;;;gliding-snow;;
;;
Salzburg;2023-02-13 17:00:00;R1;2;0;poor;few;medium;morning;high;latitude;2200;persistant-weak-layer;gliding-snow;2;0;poor;few;medium;afternoon;high;latitude;2200;wet-snow;persistant-weak-layer;1;1;very_poor;few;medium;morning;low;latitude;2200;persistant-weak-layer;gliding-snow;2;0;very_poor;few;medium;afternoon;low;latitude;2200;wet-snow;persistant-weak-layer;
;;R2;1;0;fair;few;medium;morning;high;latitude;2600;gliding-snow;;1;0;fair;few;medium;afternoon;high;latitude;2600;wet-snow;gliding-snow;1;1;very_poor;few;medium;morning;low;latitude;2600;gliding-snow;;2;0;very_poor;few;medium;afternoon;low;latitude;2600;wet-snow;gliding-snow;
;;
Salzburg;2023-02-14 17:00:00;R1;2;0;poor;few;medium;morning;high;latitude;2200;persistant-weak-layer;gliding-snow;2;0;poor;few;medium;afternoon;high;latitude;2200;wet-snow;persistant-weak-layer;1;1;very_poor;few;medium;morning;low;latitude;2200;persistant-weak-layer;gliding-snow;2;0;very_poor;few;medium;afternoon;low;latitude;2200;wet-snow;persistant-weak-layer;
;;R2;1;0;fair;few;medium;morning;high;latitude;2600;gliding-snow;;1;0;fair;few;medium;afternoon;high;latitude;2600;wet-snow;gliding-snow;1;1;very_poor;few;medium;morning;low;latitude;2600;gliding-snow;;2;0;very_poor;few;medium;afternoon;low;latitude;2600;wet-snow;gliding-snow;
;;
Salzburg;2023-02-15 17:00:00;R1;2;0;poor;few;medium;morning;high;latitude;2200;persistant-weak-layer;gliding-snow;2;0;poor;few;medium;afternoon;high;latitude;2200;wet-snow;persistant-weak-layer;1;1;very_poor;few;medium;morning;low;latitude;2200;persistant-weak-layer;gliding-snow;2;0;very_poor;few;medium;afternoon;low;latitude;2200;wet-snow;persistant-weak-layer;
;;R2;1;0;fair;few;medium;morning;high;latitude;2400;gliding-snow;;1;0;fair;few;medium;afternoon;high;latitude;2400;wet-snow;gliding-snow;1;1;very_poor;few;medium;morning;low;latitude;2400;gliding-snow;;2;0;very_poor;few;medium;afternoon;low;latitude;2400;wet-snow;gliding-snow;
;;
Salzburg;2023-02-16 17:00:00;R1;1;0;fair;few;small;;;;;persistant-weak-layer;gliding-snow;
;;R2;1;0;fair;few;small;;;;;gliding-snow;;
;;
Salzburg;2023-02-17 17:00:00;R1;1;0;fair;few;medium;morning;high;latitude;2400;persistant-weak-layer;gliding-snow;1;0;fair;few;medium;afternoon;high;latitude;2400;wet-snow;persistant-weak-layer;1;1;very_poor;few;medium;morning;low;latitude;2400;persistant-weak-layer;gliding-snow;2;0;very_poor;few;medium;afternoon;low;latitude;2400;wet-snow;persistant-weak-layer;
;;R2;1;1;very_poor;few;medium;morning;high;latitude;2400;gliding-snow;;1;1;very_poor;few;medium;afternoon;high;latitude;2400;wet-snow;gliding-snow;1;1;very_poor;few;medium;morning;low;latitude;2400;gliding-snow;;2;0;very_poor;few;medium;afternoon;low;latitude;2400;wet-snow;gliding-snow;
;;
Salzburg;2023-02-18 17:00:00;R1;1;0;fair;few;medium;;;;;persistant-weak-layer;gliding-snow;
;;R2;1;1;very_poor;few;medium;;;;;wet-snow;gliding-snow;
;;
Salzburg;2023-02-19 17:00:00;R1;1;0;fair;few;medium;morning;high;latitude;2400;persistant-weak-layer;gliding-snow;1;0;fair;few;medium;afternoon;high;latitude;2400;wet-snow;persistant-weak-layer;1;1;very_poor;few;medium;morning;low;latitude;2400;persistant-weak-layer;gliding-snow;2;0;very_poor;few;medium;afternoon;low;latitude;2400;wet-snow;persistant-weak-layer;
;;R2;1;1;very_poor;few;medium;morning;;;;wet-snow;gliding-snow;2;0;very_poor;few;medium;afternoon;;;;wet-snow;gliding-snow;
;;R3;1;1;very_poor;few;medium;morning;;;;gliding-snow;;2;0;very_poor;few;medium;afternoon;;;;wet-snow;gliding-snow;
;;
Salzburg;2023-02-20 17:00:00;R1;1;0;fair;few;medium;morning;high;latitude;2600;persistant-weak-layer;gliding-snow;1;0;fair;few;medium;afternoon;high;latitude;2600;wet-snow;persistant-weak-layer;1;1;very_poor;few;medium;morning;low;latitude;2600;persistant-weak-layer;gliding-snow;2;0;very_poor;few;medium;afternoon;low;latitude;2600;wet-snow;persistant-weak-layer;
;;R2;1;1;very_poor;few;medium;morning;;;;gliding-snow;wet-snow;2;0;very_poor;few;medium;afternoon;;;;wet-snow;gliding-snow;
;;
Salzburg;2023-02-21 17:00:00;R1;1;0;fair;few;medium;morning;;;;gliding-snow;wet-snow;2;0;fair;some;medium;afternoon;;;;gliding-snow;wet-snow;
;;R2;1;0;fair;few;medium;morning;high;latitude;2600;gliding-snow;persistant-weak-layer;1;0;fair;few;medium;afternoon;high;latitude;2600;gliding-snow;persistant-weak-layer;1;0;fair;few;medium;morning;low;latitude;2600;gliding-snow;persistant-weak-layer;2;0;fair;some;medium;afternoon;low;latitude;2600;gliding-snow;persistant-weak-layer;
;;
Salzburg;2023-02-22 17:00:00;R1;1;0;fair;few;medium;;;;;gliding-snow;;
;;R2;1;0;fair;few;medium;;;;;gliding-snow;persistant-weak-layer;
;;
Salzburg;2023-02-23 17:00:00;R1;1;0;fair;few;medium;;;;;gliding-snow;;
;;R2;2;0;fair;some;medium;;high;latitude;2500;persistant-weak-layer;wind-drifted-snow;1;0;fair;few;medium;;low;latitude;2500;persistant-weak-layer;wind-drifted-snow;
;;
Salzburg;2023-02-24 17:00:00;R1;2;0;poor;some;medium;;high;latitude;1500;wind-drifted-snow;gliding-snow;1;0;fair;few;small;;low;latitude;1500;wind-drifted-snow;gliding-snow;
;;R2;2;0;poor;some;medium;;high;latitude;1800;wind-drifted-snow;persistant-weak-layer;1;0;poor;few;small;;low;latitude;1800;wind-drifted-snow;persistant-weak-layer;
;;R3;1;0;fair;few;small;;;;;persistant-weak-layer;;
;;
Salzburg;2023-02-25 17:00:00;R1;2;0;poor;some;medium;;high;latitude;1500;wind-drifted-snow;gliding-snow;1;0;fair;few;small;;low;latitude;1500;wind-drifted-snow;gliding-snow;
;;R2;2;0;poor;few;medium;;high;latitude;1800;wind-drifted-snow;persistant-weak-layer;1;0;poor;few;small;;low;latitude;1800;wind-drifted-snow;persistant-weak-layer;
;;R3;1;0;fair;few;small;;;;;persistant-weak-layer;;
;;
Salzburg;2023-02-26 17:00:00;R1;2;0;poor;some;medium;;high;forest;1500;wind-drifted-snow;persistant-weak-layer;1;0;poor;few;small;;low;forest;1500;wind-drifted-snow;persistant-weak-layer;
;;R2;2;0;poor;some;medium;;high;latitude;1800;wind-drifted-snow;persistant-weak-layer;1;0;poor;few;small;;low;latitude;1800;wind-drifted-snow;persistant-weak-layer;
;;R3;1;0;poor;few;small;;;;;wind-drifted-snow;;
;;
Salzburg;2023-02-27 17:00:00;R1;2;0;poor;few;medium;morning;high;forest;;wind-drifted-snow;;2;0;poor;few;medium;afternoon;high;forest;;wind-drifted-snow;wet-snow;1;0;poor;few;small;morning;low;forest;;wind-drifted-snow;;2;0;very_poor;few;medium;afternoon;low;forest;;wind-drifted-snow;wet-snow;
;;R2;2;0;poor;few;medium;;high;latitude;1800;wind-drifted-snow;;1;0;poor;few;small;;low;latitude;1800;wind-drifted-snow;;
;;R3;1;0;poor;few;small;;;;;wind-drifted-snow;;
;;
Salzburg;2023-02-28 17:00:00;R1;2;0;poor;few;medium;;high;latitude;2000;wind-drifted-snow;;1;0;poor;few;small;;low;latitude;2000;wind-drifted-snow;;
;;R2;2;0;poor;some;medium;;high;latitude;2000;wind-drifted-snow;;1;0;poor;few;small;;low;latitude;2000;wind-drifted-snow;;
;;R3;1;0;poor;few;small;;;;;wind-drifted-snow;;
;;
Salzburg;2023-03-01 17:00:00;R1;2;0;poor;few;medium;;high;latitude;2400;wind-drifted-snow;;1;0;poor;few;small;;low;latitude;2400;wind-drifted-snow;;
;;R2;1;0;poor;few;small;;;;;wind-drifted-snow;;
;;
Salzburg;2023-03-02 17:00:00;R1;1;0;poor;few;small;;;;;wind-drifted-snow;;
;;
Salzburg;2023-03-03 17:00:00;R1;1;0;fair;few;small;;;;;wind-drifted-snow;;
;;
Salzburg;2023-03-04 17:00:00;R1;1;0;fair;few;small;;;;;wind-drifted-snow;;
;;
Salzburg;2023-03-05 17:00:00;R1;1;0;fair;none;small;;;;;wind-drifted-snow;;
;;
Salzburg;2023-03-06 17:00:00;R1;1;0;fair;none;small;;;;;wind-drifted-snow;;
;;R2;1;0;poor;few;small;;;;;wind-drifted-snow;;
;;
Salzburg;2023-03-07 17:00:00;R1;1;0;poor;few;small;;;;;wind-drifted-snow;;
;;R2;2;0;poor;some;small;;high;forest;;wind-drifted-snow;;1;0;fair;few;small;;low;forest;;wind-drifted-snow;;
;;
Salzburg;2023-03-08 17:00:00;R1;1;0;poor;few;small;;;;;wind-drifted-snow;;
;;R2;2;0;poor;some;small;;high;latitude;2200;wind-drifted-snow;;1;0;fair;few;small;;low;latitude;2200;wind-drifted-snow;;
;;
Salzburg;2023-03-09 17:00:00;R1;1;0;poor;few;small;;;;;wind-drifted-snow;;
;;R2;2;0;poor;some;small;;high;latitude;2200;wind-drifted-snow;;1;0;fair;few;small;;low;latitude;2200;wind-drifted-snow;;
;;
Salzburg;2023-03-10 17:00:00;R1;2;0;poor;few;medium;;high;latitude;2200;wind-drifted-snow;;1;0;poor;few;small;;low;latitude;2200;wind-drifted-snow;;
;;R2;1;0;poor;few;small;;;;;wind-drifted-snow;;
;;
Salzburg;2023-03-11 17:00:00;R1;2;0;poor;few;medium;;high;latitude;2200;wind-drifted-snow;;1;0;poor;few;small;;low;latitude;2200;wind-drifted-snow;;
;;R2;1;0;poor;few;small;;;;;wind-drifted-snow;;
;;
Salzburg;2023-03-12 17:00:00;R1;1;0;poor;few;small;;;;;wet-snow;;
;;R2;1;0;poor;few;small;morning;;;;wind-drifted-snow;;2;0;very_poor;some;small;afternoon;;;;wet-snow;;
;;
Salzburg;2023-03-13 17:00:00;R1;2;0;poor;some;medium;;high;latitude;2000;wind-drifted-snow;;1;0;poor;few;small;;low;latitude;2000;wind-drifted-snow;;
;;R2;2;0;poor;few;medium;;high;latitude;2000;wind-drifted-snow;;1;0;poor;few;small;;low;latitude;2000;wind-drifted-snow;;
;;R3;1;0;poor;few;small;;;;;wind-drifted-snow;;
;;R4;1;0;poor;few;small;;;;;wind-drifted-snow;;
;;
Salzburg;2023-03-14 17:00:00;R1;2;0;poor;few;medium;;high;latitude;2000;wind-drifted-snow;;1;0;poor;few;small;;low;latitude;2000;wind-drifted-snow;;
;;R2;2;0;poor;few;medium;;high;latitude;2000;wind-drifted-snow;;1;0;poor;few;small;;low;latitude;2000;wind-drifted-snow;;
;;R3;1;0;poor;few;small;;;;;wind-drifted-snow;;
;;R4;1;0;poor;few;small;;;;;wind-drifted-snow;;
;;R5;3;1;poor;some;medium;;high;latitude;2000;wind-drifted-snow;;1;0;fair;few;small;;low;latitude;2000;wind-drifted-snow;;
;;
Salzburg;2023-03-15 17:00:00;R1;2;0;poor;few;medium;;high;latitude;2200;wind-drifted-snow;;1;0;poor;few;small;;low;latitude;2200;wind-drifted-snow;;
;;R2;1;0;poor;few;small;;;;;wind-drifted-snow;;
;;R3;3;1;poor;some;medium;;high;latitude;2200;wind-drifted-snow;persistant-weak-layer;1;0;poor;few;small;;low;latitude;2200;wind-drifted-snow;persistant-weak-layer;
;;
Salzburg;2023-03-16 17:00:00;R1;1;0;very_poor;few;small;;;;;wet-snow;;
;;R2;2;0;poor;few;medium;morning;high;latitude;2200;wind-drifted-snow;wet-snow;2;0;poor;few;medium;afternoon;high;latitude;2200;wind-drifted-snow;wet-snow;1;0;fair;few;small;morning;low;latitude;2200;wind-drifted-snow;wet-snow;2;0;very_poor;some;small;afternoon;low;latitude;2200;wind-drifted-snow;wet-snow;
;;
Salzburg;2023-03-17 17:00:00;R1;2;0;poor;few;medium;morning;high;latitude;2600;wind-drifted-snow;;3;0;very_poor;some;medium;afternoon;high;latitude;1800;wet-snow;gliding-snow;1;0;fair;few;medium;morning;low;latitude;2600;wind-drifted-snow;;1;0;very_poor;few;small;afternoon;low;latitude;1800;wet-snow;gliding-snow;
;;R2;1;0;very_poor;few;small;morning;high;latitude;1800;wind-drifted-snow;;2;0;very_poor;few;medium;afternoon;high;latitude;1800;wet-snow;gliding-snow;1;0;good;none;small;morning;low;latitude;1800;wind-drifted-snow;;1;0;good;none;small;afternoon;low;latitude;1800;wet-snow;gliding-snow;
;;R3;1;0;very_poor;few;small;morning;;;;gliding-snow;;1;0;very_poor;few;small;afternoon;;;;wet-snow;gliding-snow;
;;
Salzburg;2023-03-18 17:00:00;R1;2;0;poor;few;medium;;high;latitude;2200;persistant-weak-layer;wet-snow;1;0;very_poor;few;small;;low;latitude;2200;persistant-weak-layer;wet-snow;
;;R2;1;0;very_poor;few;small;;;;;wet-snow;gliding-snow;
;;
Salzburg;2023-03-19 17:00:00;R1;2;0;poor;few;medium;;high;latitude;2200;persistant-weak-layer;gliding-snow;1;0;very_poor;few;small;;low;latitude;2200;persistant-weak-layer;gliding-snow;
;;R2;1;0;poor;none;small;;;;;gliding-snow;;
;;
Salzburg;2023-03-20 17:00:00;R1;2;0;poor;few;medium;morning;high;latitude;2200;persistant-weak-layer;gliding-snow;2;0;poor;few;medium;afternoon;high;latitude;2200;wet-snow;persistant-weak-layer;1;0;very_poor;none;medium;morning;low;latitude;2200;persistant-weak-layer;gliding-snow;2;1;very_poor;few;large;afternoon;low;latitude;2200;wet-snow;persistant-weak-layer;
;;R2;1;0;fair;few;small;morning;high;latitude;2400;gliding-snow;;1;0;fair;few;small;afternoon;high;latitude;2400;wet-snow;gliding-snow;1;0;fair;few;small;morning;low;latitude;2400;gliding-snow;;2;0;very_poor;few;medium;afternoon;low;latitude;2400;wet-snow;gliding-snow;
;;R3;1;0;very_poor;few;small;;;;;wet-snow;;
;;
Salzburg;2023-03-21 17:00:00;R1;2;0;poor;few;medium;morning;high;latitude;2600;wet-snow;gliding-snow;2;0;poor;few;medium;afternoon;high;latitude;2600;wet-snow;gliding-snow;2;0;very_poor;few;medium;morning;low;latitude;2600;wet-snow;gliding-snow;3;0;very_poor;some;large;afternoon;low;latitude;2600;wet-snow;gliding-snow;
;;R2;2;1;very_poor;some;medium;;;;;wet-snow;gliding-snow;
;;R3;1;0;very_poor;few;small;;;;;wet-snow;;
;;
Salzburg;2023-03-22 17:00:00;R1;1;0;fair;few;medium;morning;high;latitude;2600;gliding-snow;;2;0;poor;few;medium;afternoon;high;latitude;2600;wet-snow;gliding-snow;2;0;very_poor;few;medium;morning;low;latitude;2600;gliding-snow;;3;0;very_poor;some;large;afternoon;low;latitude;2600;wet-snow;gliding-snow;
;;R2;1;0;very_poor;few;small;morning;;;;gliding-snow;;2;1;very_poor;some;medium;afternoon;;;;wet-snow;gliding-snow;
;;R3;1;0;very_poor;few;small;;;;;wet-snow;;
;;
Salzburg;2023-03-23 17:00:00;R1;2;0;very_poor;few;medium;;high;latitude;2600;wet-snow;gliding-snow;3;0;very_poor;some;large;;low;latitude;2600;wet-snow;gliding-snow;
;;R2;2;1;very_poor;some;medium;;;;;wet-snow;gliding-snow;
;;R3;1;0;very_poor;few;small;;;;;wet-snow;;
;;
Salzburg;2023-03-24 17:00:00;R1;2;0;poor;few;large;;;;;wet-snow;gliding-snow;
;;R2;2;0;poor;few;medium;;;;;wet-snow;gliding-snow;
;;R3;1;0;poor;few;small;;;;;wet-snow;;
;;
Salzburg;2023-03-25 17:00:00;R1;2;0;poor;few;medium;;high;latitude;2200;gliding-snow;wind-drifted-snow;1;0;fair;few;medium;;low;latitude;2200;gliding-snow;wind-drifted-snow;
;;R2;1;0;fair;few;medium;;;;;wet-snow;;
;;
Salzburg;2023-03-26 16:00:00;R1;2;0;poor;some;medium;;high;latitude;1500;wind-drifted-snow;;1;0;good;none;small;;low;latitude;1500;wind-drifted-snow;;
;;R2;3;0;very_poor;some;medium;;high;latitude;2000;wind-drifted-snow;;2;0;poor;some;medium;;low;latitude;2000;wind-drifted-snow;;
;;
Salzburg;2023-03-27 16:00:00;R1;2;1;poor;some;medium;;high;latitude;1500;wind-drifted-snow;;1;0;fair;few;small;;low;latitude;1500;wind-drifted-snow;;
;;R2;3;1;poor;some;medium;;high;latitude;1800;wind-drifted-snow;;2;0;poor;some;medium;;low;latitude;1800;wind-drifted-snow;;
;;
Salzburg;2023-03-28 06:00:28;R1;2;1;poor;some;medium;;high;latitude;1500;wind-drifted-snow;;1;0;fair;few;small;;low;latitude;1500;wind-drifted-snow;;
;;R2;3;1;poor;some;medium;;high;latitude;1800;wind-drifted-snow;;2;0;poor;some;medium;;low;latitude;1800;wind-drifted-snow;;
;;
Salzburg;2023-03-28 15:30:20;R1;2;0;poor;some;small;;high;latitude;1500;wet-snow;;1;0;fair;few;medium;;low;latitude;1500;wet-snow;;
;;R2;3;0;very_poor;some;medium;;high;latitude;2200;wind-drifted-snow;wet-snow;2;0;poor;some;small;;low;latitude;2200;wind-drifted-snow;wet-snow;
;;
Salzburg;2023-03-29 16:00:00;R1;2;0;poor;some;medium;morning;high;latitude;1500;wet-snow;gliding-snow;3;0;poor;some;large;afternoon;high;latitude;1500;wet-snow;gliding-snow;1;0;fair;some;small;morning;low;latitude;1500;wet-snow;gliding-snow;1;0;fair;some;small;afternoon;low;latitude;1500;wet-snow;gliding-snow;
;;R2;2;0;poor;some;medium;morning;high;latitude;1500;wet-snow;gliding-snow;3;0;poor;some;large;afternoon;high;latitude;1500;wet-snow;gliding-snow;1;0;fair;some;small;morning;low;latitude;1500;wet-snow;gliding-snow;1;0;fair;some;small;afternoon;low;latitude;1500;wet-snow;gliding-snow;
;;
Salzburg;2023-03-30 16:00:00;R1;2;0;poor;some;medium;;high;latitude;1500;gliding-snow;wet-snow;1;0;fair;few;small;;low;latitude;1500;gliding-snow;wet-snow;
;;R2;2;0;poor;some;medium;;high;latitude;1500;gliding-snow;wind-drifted-snow;1;0;fair;few;small;;low;latitude;1500;gliding-snow;wind-drifted-snow;
;;
Salzburg;2023-03-31 16:00:00;R1;2;1;poor;some;medium;;high;latitude;1500;gliding-snow;wet-snow;1;0;fair;few;small;;low;latitude;1500;gliding-snow;wet-snow;
;;R2;2;0;poor;some;medium;;high;latitude;1500;gliding-snow;wind-drifted-snow;1;0;poor;few;small;;low;latitude;1500;gliding-snow;wind-drifted-snow;
;;R3;3;1;poor;some;medium;;high;latitude;2500;wind-drifted-snow;wet-snow;2;0;very_poor;few;medium;;low;latitude;2500;wind-drifted-snow;wet-snow;
;;
Salzburg;2023-04-01 16:00:00;R1;2;0;poor;few;medium;;high;latitude;1500;gliding-snow;wind-drifted-snow;1;0;fair;few;small;;low;latitude;1500;gliding-snow;wind-drifted-snow;
;;R2;2;0;poor;some;medium;;high;latitude;1500;persistant-weak-layer;wind-drifted-snow;1;0;poor;few;small;;low;latitude;1500;persistant-weak-layer;wind-drifted-snow;
;;R3;3;1;poor;some;medium;;high;latitude;2500;persistant-weak-layer;wind-drifted-snow;2;0;poor;some;medium;;low;latitude;2500;persistant-weak-layer;wind-drifted-snow;
;;
Salzburg;2023-04-02 16:00:00;R1;1;0;very_poor;none;medium;;;;;gliding-snow;wind-drifted-snow;
;;R2;2;0;poor;few;medium;;high;latitude;2200;persistant-weak-layer;wind-drifted-snow;1;0;very_poor;none;medium;;low;latitude;2200;persistant-weak-layer;wind-drifted-snow;
;;R3;1;0;fair;none;medium;;;;;persistant-weak-layer;wind-drifted-snow;
;;
Salzburg;2023-04-03 16:00:00;R1;1;0;very_poor;none;medium;;;;;gliding-snow;wind-drifted-snow;
;;R2;2;0;poor;some;medium;;high;latitude;2100;persistant-weak-layer;wind-drifted-snow;1;0;very_poor;none;medium;;low;latitude;2100;persistant-weak-layer;wind-drifted-snow;
;;R3;1;0;fair;none;medium;;;;;persistant-weak-layer;wind-drifted-snow;
;;
Salzburg;2023-04-04 16:00:00;R1;1;0;very_poor;none;small;;;;;gliding-snow;wind-drifted-snow;
;;R2;2;1;fair;few;medium;;high;latitude;2100;persistant-weak-layer;wind-drifted-snow;1;0;very_poor;none;medium;;low;latitude;2100;persistant-weak-layer;wind-drifted-snow;
;;R3;1;0;fair;none;medium;;;;;persistant-weak-layer;wind-drifted-snow;
;;
Salzburg;2023-04-05 16:00:00;R1;1;0;very_poor;none;small;;;;;gliding-snow;;
;;R2;2;1;fair;few;medium;;high;latitude;2500;persistant-weak-layer;wind-drifted-snow;1;0;very_poor;none;medium;;low;latitude;2500;persistant-weak-layer;wind-drifted-snow;
;;R3;1;0;fair;none;medium;;;;;persistant-weak-layer;;
;;
Salzburg;2023-04-06 16:00:00;R1;1;0;very_poor;none;small;;;;;gliding-snow;;
;;R2;2;0;poor;few;medium;;high;latitude;2500;persistant-weak-layer;;1;0;very_poor;none;medium;;low;latitude;2500;persistant-weak-layer;;
;;R3;1;0;fair;none;medium;;;;;persistant-weak-layer;;
;;
Salzburg;2023-04-07 16:00:00;R1;1;0;poor;few;small;;;;;wind-drifted-snow;;
;;R2;2;0;poor;few;medium;;high;latitude;2500;persistant-weak-layer;wind-drifted-snow;1;0;very_poor;none;medium;;low;latitude;2500;persistant-weak-layer;wind-drifted-snow;
;;R3;1;0;good;none;small;;;;;wind-drifted-snow;;
;;
Salzburg;2023-04-08 16:00:00;R1;2;0;poor;some;medium;;high;latitude;2300;wind-drifted-snow;persistant-weak-layer;1;0;poor;few;small;;low;latitude;2300;wind-drifted-snow;persistant-weak-layer;
;;R2;2;0;poor;few;medium;;high;latitude;2300;wind-drifted-snow;;1;0;poor;few;small;;low;latitude;2300;wind-drifted-snow;;
;;R3;1;0;poor;few;small;;;;;wind-drifted-snow;;
;;R4;1;0;good;none;small;;;;;wind-drifted-snow;;
;;
Salzburg;2023-04-09 16:00:00;R1;2;0;poor;few;medium;;high;latitude;2500;persistant-weak-layer;wind-drifted-snow;1;0;poor;few;small;;low;latitude;2500;persistant-weak-layer;wind-drifted-snow;
;;R2;1;0;poor;few;small;;;;;wind-drifted-snow;;
;;R3;1;0;good;none;small;;;;;wind-drifted-snow;;
;;
Salzburg;2023-04-10 16:00:00;R1;2;0;poor;few;medium;;high;latitude;2600;persistant-weak-layer;wind-drifted-snow;1;0;poor;few;small;;low;latitude;2600;persistant-weak-layer;wind-drifted-snow;
;;R2;1;0;poor;few;small;;;;;wind-drifted-snow;;
;;R3;1;0;good;none;small;;;;;wind-drifted-snow;;
;;
Salzburg;2023-04-11 16:00:00;R1;2;0;poor;few;medium;;high;latitude;2600;persistant-weak-layer;wind-drifted-snow;1;0;poor;few;small;;low;latitude;2600;persistant-weak-layer;wind-drifted-snow;
;;R2;1;0;poor;few;small;;;;;wind-drifted-snow;wet-snow;
;;R3;1;0;good;none;small;;;;;wet-snow;;
;;
Salzburg;2023-04-12 16:00:00;R1;3;0;very_poor;some;large;;high;latitude;2000;new-snow;persistant-weak-layer;2;0;poor;some;medium;;low;latitude;2000;new-snow;persistant-weak-layer;
;;R2;2;0;poor;few;medium;morning;high;latitude;2000;wind-drifted-snow;;3;0;very_poor;some;medium;afternoon;high;latitude;2200;new-snow;gliding-snow;1;0;fair;few;small;morning;low;latitude;2000;wind-drifted-snow;;2;0;very_poor;few;medium;afternoon;low;latitude;2200;new-snow;gliding-snow;
;;R3;2;0;poor;few;medium;;high;forest;;wind-drifted-snow;;1;0;very_poor;few;small;;low;forest;;wind-drifted-snow;;
;;
Salzburg;2023-04-13 16:00:00;R1;4;0;very_poor;many;large;;high;latitude;2400;new-snow;persistant-weak-layer;3;0;very_poor;some;medium;;low;latitude;2400;new-snow;persistant-weak-layer;
;;R2;3;0;very_poor;some;medium;;;;;new-snow;gliding-snow;
;;R3;3;0;very_poor;some;large;;high;forest;;new-snow;gliding-snow;2;0;very_poor;few;medium;;low;forest;;new-snow;gliding-snow;
;;R4;3;0;very_poor;some;medium;;high;latitude;1600;wind-drifted-snow;gliding-snow;2;0;poor;few;medium;;low;latitude;1600;wind-drifted-snow;gliding-snow;
;;
Salzburg;2023-04-14 16:00:00;R1;3;0;very_poor;some;large;;high;forest;;wind-drifted-snow;new-snow;2;0;poor;some;medium;;low;forest;;wind-drifted-snow;new-snow;
;;R2;3;0;very_poor;some;large;;high;forest;;wind-drifted-snow;gliding-snow;2;0;very_poor;few;medium;;low;forest;;wind-drifted-snow;gliding-snow;
;;R3;3;0;very_poor;some;medium;;high;forest;;wind-drifted-snow;gliding-snow;2;0;poor;few;medium;;low;forest;;wind-drifted-snow;gliding-snow;
;;
Salzburg;2023-04-15 16:00:00;R1;3;0;poor;some;large;;high;latitude;2000;wind-drifted-snow;wet-snow;2;0;poor;some;medium;;low;latitude;2000;wind-drifted-snow;wet-snow;
;;R2;2;0;poor;some;medium;;;;;wet-snow;;
;;R3;2;0;poor;some;medium;;;;;wind-drifted-snow;wet-snow;
;;
Salzburg;2023-04-16 16:00:00;R1;3;0;poor;some;large;;high;latitude;2400;wind-drifted-snow;wet-snow;2;0;poor;some;medium;;low;latitude;2400;wind-drifted-snow;wet-snow;
;;R2;2;0;poor;some;medium;;;;;gliding-snow;wet-snow;
;;R3;2;0;poor;some;medium;;;;;gliding-snow;wind-drifted-snow;
;;
Salzburg;2023-04-17 16:00:00;R1;2;0;poor;few;large;;high;latitude;2500;wind-drifted-snow;wet-snow;2;0;poor;few;medium;;low;latitude;2500;wind-drifted-snow;wet-snow;
;;R2;2;0;poor;few;medium;;;;;gliding-snow;wet-snow;
;;R3;2;0;poor;few;medium;;high;latitude;1400;gliding-snow;wet-snow;1;0;good;none;small;;low;latitude;1400;gliding-snow;wet-snow;
;;
Salzburg;2023-04-18 16:00:00;R1;2;0;poor;few;medium;;high;latitude;1400;wet-snow;wind-drifted-snow;1;0;very_poor;few;small;;low;latitude;1400;wet-snow;wind-drifted-snow;
;;R2;2;0;fair;some;medium;;high;latitude;1400;gliding-snow;wet-snow;1;0;very_poor;few;small;;low;latitude;1400;gliding-snow;wet-snow;
;;R3;2;0;poor;few;medium;;high;latitude;1400;gliding-snow;wet-snow;1;0;good;none;small;;low;latitude;1400;gliding-snow;wet-snow;
;;
Salzburg;2023-04-19 16:00:00;R1;2;0;poor;some;medium;;high;latitude;1800;wind-drifted-snow;persistant-weak-layer;1;0;fair;few;small;;low;latitude;1800;wind-drifted-snow;persistant-weak-layer;
;;R2;2;0;very_poor;some;small;;high;latitude;1400;wind-drifted-snow;wet-snow;1;0;very_poor;few;small;;low;latitude;1400;wind-drifted-snow;wet-snow;
;;R3;1;0;very_poor;few;small;;;;;wet-snow;wind-drifted-snow;
;;
Salzburg;2023-04-20 07:03:16;R1;2;0;poor;some;medium;;high;latitude;1800;wind-drifted-snow;persistant-weak-layer;1;0;fair;few;small;;low;latitude;1800;wind-drifted-snow;persistant-weak-layer;
;;R2;2;0;very_poor;some;small;;high;latitude;1400;wind-drifted-snow;wet-snow;1;0;very_poor;few;small;;low;latitude;1400;wind-drifted-snow;wet-snow;
;;R3;1;0;very_poor;few;small;;;;;wet-snow;wind-drifted-snow;
;;R4;3;0;poor;many;medium;;high;latitude;1800;wind-drifted-snow;persistant-weak-layer;1;0;poor;few;small;;low;latitude;1800;wind-drifted-snow;persistant-weak-layer;
;;
Salzburg;2023-04-20 16:00:00;R1;2;0;poor;some;medium;;high;latitude;1400;wind-drifted-snow;wet-snow;1;0;very_poor;few;small;;low;latitude;1400;wind-drifted-snow;wet-snow;
;;R2;2;0;poor;few;medium;;high;latitude;1400;wind-drifted-snow;wet-snow;1;0;very_poor;few;small;;low;latitude;1400;wind-drifted-snow;wet-snow;
;;R3;2;0;very_poor;some;small;;high;latitude;1400;wet-snow;;1;0;very_poor;few;small;;low;latitude;1400;wet-snow;;
;;R4;3;0;poor;many;medium;;high;latitude;1600;wind-drifted-snow;wet-snow;1;0;very_poor;few;small;;low;latitude;1600;wind-drifted-snow;wet-snow;
;;
Salzburg;2023-04-21 16:00:00;R1;3;0;very_poor;some;large;;high;latitude;2200;persistant-weak-layer;wet-snow;2;0;very_poor;few;medium;;low;latitude;2200;persistant-weak-layer;wet-snow;
;;R2;2;0;very_poor;few;medium;;;;;wet-snow;;
;;R3;2;0;very_poor;few;medium;;;;;wet-snow;;
;;
Salzburg;2023-04-22 16:00:00;R1;3;0;very_poor;some;large;;high;latitude;2200;wet-snow;persistant-weak-layer;2;0;very_poor;few;medium;;low;latitude;2200;wet-snow;persistant-weak-layer;
;;R2;2;0;very_poor;few;medium;;;;;wet-snow;;
;;R3;2;0;very_poor;few;medium;;;;;wet-snow;;
;;
Salzburg;2023-04-23 16:00:00;R1;2;0;poor;few;large;;high;latitude;2400;persistant-weak-layer;wind-drifted-snow;1;0;very_poor;few;small;;low;latitude;2400;persistant-weak-layer;wind-drifted-snow;
;;R2;2;0;poor;some;small;;high;latitude;2400;wind-drifted-snow;;1;0;very_poor;few;small;;low;latitude;2400;wind-drifted-snow;;
;;
Salzburg;2023-04-24 06:00:00;R1;2;0;poor;few;large;;high;latitude;2400;persistant-weak-layer;wind-drifted-snow;1;0;very_poor;few;small;;low;latitude;2400;persistant-weak-layer;wind-drifted-snow;
;;R2;2;0;poor;some;small;;high;latitude;2400;wind-drifted-snow;;1;0;very_poor;few;small;;low;latitude;2400;wind-drifted-snow;;
;;R3;3;0;very_poor;some;medium;;high;latitude;2600;wind-drifted-snow;persistant-weak-layer;2;0;poor;some;medium;;low;latitude;2600;wind-drifted-snow;persistant-weak-layer;
;;
Salzburg;2023-04-24 06:00:00;R1;3;0;very_poor;some;medium;;high;latitude;2600;wind-drifted-snow;persistant-weak-layer;2;0;very_poor;few;medium;;low;latitude;2600;wind-drifted-snow;persistant-weak-layer;
;;R2;2;0;poor;some;small;;high;latitude;2400;wind-drifted-snow;;1;0;very_poor;few;small;;low;latitude;2400;wind-drifted-snow;;
;;R3;2;0;poor;some;medium;;high;latitude;2400;persistant-weak-layer;wind-drifted-snow;1;0;poor;few;small;;low;latitude;2400;persistant-weak-layer;wind-drifted-snow;
;;
Salzburg;2023-04-24 16:00:00;R1;3;0;very_poor;some;medium;;high;latitude;2600;wind-drifted-snow;persistant-weak-layer;2;0;very_poor;few;medium;;low;latitude;2600;wind-drifted-snow;persistant-weak-layer;
;;R2;2;0;poor;some;small;;high;latitude;2400;wind-drifted-snow;;1;0;very_poor;few;small;;low;latitude;2400;wind-drifted-snow;;
;;R3;2;0;poor;some;medium;;high;latitude;2400;persistant-weak-layer;wind-drifted-snow;1;0;poor;few;small;;low;latitude;2400;persistant-weak-layer;wind-drifted-snow;
;;
Salzburg;2023-04-25 16:00:00;R1;3;0;very_poor;some;medium;;high;latitude;2600;wind-drifted-snow;persistant-weak-layer;2;0;very_poor;few;medium;;low;latitude;2600;wind-drifted-snow;persistant-weak-layer;
;;R2;2;0;poor;some;small;;high;latitude;2400;wind-drifted-snow;gliding-snow;1;0;very_poor;few;small;;low;latitude;2400;wind-drifted-snow;gliding-snow;
;;R3;2;0;poor;some;medium;;high;latitude;2400;persistant-weak-layer;wind-drifted-snow;1;0;poor;few;small;;low;latitude;2400;persistant-weak-layer;wind-drifted-snow;
;;R4;1;0;poor;few;small;;;;;wind-drifted-snow;;
;;
Salzburg;2023-04-26 16:00:00;R1;2;0;poor;some;medium;;high;latitude;2000;wind-drifted-snow;gliding-snow;1;0;very_poor;few;small;;low;latitude;2000;wind-drifted-snow;gliding-snow;
;;R2;2;0;poor;some;medium;;high;latitude;2400;wind-drifted-snow;;1;0;poor;few;small;;low;latitude;2400;wind-drifted-snow;;
;;R3;1;0;poor;few;small;;;;;wind-drifted-snow;;
;;R4;1;0;very_poor;none;small;;;;;wet-snow;;
;;
Salzburg;2023-04-27 16:00:00;R1;2;0;poor;few;medium;morning;high;latitude;2400;wind-drifted-snow;gliding-snow;2;0;poor;few;medium;afternoon;high;latitude;2400;wet-snow;gliding-snow;1;0;fair;few;small;morning;low;latitude;2400;wind-drifted-snow;gliding-snow;3;0;very_poor;some;medium;afternoon;low;latitude;2400;wet-snow;gliding-snow;
;;R2;2;0;poor;few;medium;morning;high;latitude;2600;wind-drifted-snow;;2;0;poor;few;medium;afternoon;high;latitude;2600;wet-snow;wind-drifted-snow;1;0;very_poor;none;small;morning;low;latitude;2600;wind-drifted-snow;;2;0;very_poor;few;medium;afternoon;low;latitude;2600;wet-snow;wind-drifted-snow;
;;R3;1;0;good;none;small;morning;;;;wind-drifted-snow;;2;0;very_poor;some;small;afternoon;;;;wet-snow;;
;;R4;1;0;very_poor;none;small;;;;;wet-snow;;
;;
Salzburg;2023-04-28 16:00:00;R1;2;0;very_poor;few;medium;;high;latitude;2200;wet-snow;;1;0;very_poor;few;small;;low;latitude;2200;wet-snow;;
;;R2;2;0;very_poor;few;medium;;;;;wet-snow;wind-drifted-snow;
;;R3;2;0;poor;some;medium;;high;latitude;2400;wet-snow;wind-drifted-snow;3;0;very_poor;some;medium;;low;latitude;2400;wet-snow;wind-drifted-snow;
;;R4;1;0;very_poor;few;small;;;;;wet-snow;;
;;
Salzburg;2023-04-29 16:00:00;R1;2;0;very_poor;few;medium;;high;latitude;2200;wet-snow;;1;0;very_poor;few;small;;low;latitude;2200;wet-snow;;
;;R2;2;0;very_poor;few;medium;;;;;wet-snow;wind-drifted-snow;
;;R3;2;0;poor;some;medium;;high;latitude;2600;wet-snow;wind-drifted-snow;3;0;very_poor;some;medium;;low;latitude;2600;wet-snow;wind-drifted-snow;
;;R4;1;0;very_poor;few;small;;;;;wet-snow;;
;;
Salzburg;2023-04-30 16:00:00;R1;2;0;very_poor;few;medium;;high;latitude;2200;wet-snow;gliding-snow;1;0;very_poor;few;small;;low;latitude;2200;wet-snow;gliding-snow;
;;R2;2;0;very_poor;few;medium;;;;;wet-snow;gliding-snow;
;;R3;2;0;poor;some;medium;;high;latitude;2600;wet-snow;gliding-snow;3;0;very_poor;some;medium;;low;latitude;2600;wet-snow;gliding-snow;
;;