[
  {
    "valid_regions": [
      "AT-06-01",
      "AT-06-02",
      "AT-06-04",
      "AT-06-05",
      "AT-06-07",
      "AT-06-06",
      "AT-06-08",
      "AT-06-03",
      "AT-06-09",
      "AT-06-10",
      "AT-06-11",
      "AT-06-18",
      "AT-06-16",
      "AT-06-15",
      "AT-06-17"
    ],
    "danger_main": [
      {
        "main_value": 1,
        "valid_elevation": null
      }
    ],
    "dangerpattern": [],
    "problem_list": [
      {
        "problem_type": "wet snow",
        "aspect": [
          "SE",
          "S",
          "SW"
        ],
        "valid_elevation": null
      }
    ],
    "report_texts": null,
    "report_id": "RID972RGR1",
    "rep_date": "2021-04-30T16:00:00+00:00",
    "validity_begin": "2021-05-01T22:00:00+00:00",
    "validity_end": "2021-05-03T11:00:00+00:00"
  },
  {
    "valid_regions": [
      "AT-06-01",
      "AT-06-02",
      "AT-06-04",
      "AT-06-05",
      "AT-06-07",
      "AT-06-06",
      "AT-06-08",
      "AT-06-03",
      "AT-06-09",
      "AT-06-10",
      "AT-06-11",
      "AT-06-18",
      "AT-06-16",
      "AT-06-15",
      "AT-06-17"
    ],
    "danger_main": [
      {
        "main_value": 2,
        "valid_elevation": null
      }
    ],
    "dangerpattern": [],
    "problem_list": [
      {
        "problem_type": "wet snow",
        "aspect": [
          "SE",
          "S",
          "SW"
        ],
        "valid_elevation": null
      }
    ],
    "report_texts": null,
    "report_id": "RID972RGR1_PM",
    "rep_date": "2021-04-30T16:00:00+00:00",
    "validity_begin": "2021-05-02T10:00:00+00:00",
    "validity_end": "2021-05-03T23:00:00+00:00",
    "predecessor_id": "RID972RGR1"
  }
]