[
  {
    "valid_regions": [
      "AT-04-05",
      "AT-04-06",
      "AT-04-07",
      "AT-04-08",
      "AT-04-09",
      "AT-04-04",
      "AT-04-03",
      "AT-04-02",
      "AT-04-01"
    ],
    "danger_main": [
      {
        "main_value": 1,
        "valid_elevation": null
      }
    ],
    "dangerpattern": [],
    "problem_list": [
      {
        "problem_type": "favourable situation",
        "aspect": [
          "N"
        ],
        "valid_elevation": null
      }
    ],
    "report_texts": null,
    "report_id": "RID20RGR1",
    "rep_date": "2020-12-07T17:00:00+00:00",
    "validity_begin": "2020-12-07T23:00:00+00:00",
    "validity_end": "2020-12-09T23:00:00+00:00"
  }
]