LWD;Ausgabezeit;Region;Stufe;Override Stufe;snowpack_stability;frequency;avalanche_sice;daytime;latidude_region;latitide_boundary;latitude;problem 1;problem 2;Stufe;Override Stufe;snowpack_stability;frequency;avalanche_sice;daytime;latidude_region;latitide_boundary;latitude;problem 1;problem 2;Stufe;Override Stufe;snowpack_stability;frequency;avalanche_sice;daytime;latidude_region;latitide_boundary;latitude;problem 1;problem 2;Stufe;Override Stufe;snowpack_stability;frequency;avalanche_sice;daytime;latidude_region;latitide_boundary;latitude;problem 1;problem 2;

Vorarlberg;2023-11-28 17:00:00;R1;3;0;poor;some;large;;high;latitude;1600;wind-drifted-snow;gliding-snow;2;0;poor;some;medium;;low;latitude;1600;wind-drifted-snow;gliding-snow;
;;R2;3;0;poor;some;large;;high;latitude;1800;wind-drifted-snow;persistant-weak-layer;2;0;poor;some;medium;;low;latitude;1800;wind-drifted-snow;persistant-weak-layer;
;;
Vorarlberg;2023-11-30 07:02:50;R1;2;0;fair;some;medium;;;;;wind-drifted-snow;gliding-snow;
;;R2;3;0;poor;some;large;;high;latitude;2000;wind-drifted-snow;persistant-weak-layer;2;0;poor;some;medium;;low;latitude;2000;wind-drifted-snow;persistant-weak-layer;
;;
Vorarlberg;2023-12-01 17:00:00;R1;3;0;poor;some;large;;high;latitude;1600;new-snow;gliding-snow;2;0;poor;some;medium;;low;latitude;1600;new-snow;gliding-snow;
;;R2;3;0;poor;some;large;;high;latitude;1800;new-snow;gliding-snow;2;0;poor;some;medium;;low;latitude;1800;new-snow;gliding-snow;
;;
Vorarlberg;2023-12-02 06:45:51;R1;4;0;poor;some;very_large;;high;forest;1800;new-snow;gliding-snow;3;0;poor;some;large;;low;forest;1800;new-snow;gliding-snow;
;;R2;4;0;very_poor;some;very_large;;high;latitude;1800;new-snow;gliding-snow;3;0;poor;some;large;;low;latitude;1800;new-snow;gliding-snow;
;;
Vorarlberg;2023-12-02 17:00:00;R1;3;0;poor;some;large;;high;latitude;1600;new-snow;gliding-snow;2;0;poor;few;medium;;low;latitude;1600;new-snow;gliding-snow;
;;R2;4;0;very_poor;some;very_large;;high;latitude;2000;new-snow;gliding-snow;3;0;poor;some;large;;low;latitude;2000;new-snow;gliding-snow;
;;
Vorarlberg;2023-12-03 17:00:00;R1;3;0;poor;some;large;;high;forest;;wind-drifted-snow;gliding-snow;2;0;fair;some;medium;;low;forest;;wind-drifted-snow;gliding-snow;
;;R2;3;0;poor;some;large;;high;latitude;1800;wind-drifted-snow;gliding-snow;2;0;fair;some;medium;;low;latitude;1800;wind-drifted-snow;gliding-snow;
;;
Vorarlberg;2023-12-04 17:00:00;R1;2;0;fair;some;medium;;;;;wind-drifted-snow;gliding-snow;
;;R2;3;0;poor;some;large;;high;latitude;1800;wind-drifted-snow;gliding-snow;2;0;fair;some;medium;;low;latitude;1800;wind-drifted-snow;gliding-snow;
;;
Vorarlberg;2023-12-05 17:00:00;R1;2;0;fair;some;medium;;;;;wind-drifted-snow;gliding-snow;
;;R2;3;0;poor;some;large;;high;latitude;2200;wind-drifted-snow;gliding-snow;2;0;fair;some;medium;;low;latitude;2200;wind-drifted-snow;gliding-snow;
;;
Vorarlberg;2023-12-06 17:00:00;R1;2;0;fair;some;medium;;high;latitude;1600;wind-drifted-snow;gliding-snow;1;0;fair;few;medium;;low;latitude;1600;wind-drifted-snow;gliding-snow;
;;R2;2;0;fair;some;medium;;;;;wind-drifted-snow;gliding-snow;
;;
Vorarlberg;2023-12-07 17:00:00;R1;2;0;fair;some;medium;;high;latitude;1600;wind-drifted-snow;gliding-snow;1;0;fair;few;medium;;low;latitude;1600;wind-drifted-snow;gliding-snow;
;;R2;2;0;fair;some;medium;;;;;wind-drifted-snow;gliding-snow;
;;
Vorarlberg;2023-12-08 17:00:00;R1;2;0;poor;few;medium;;;;;wind-drifted-snow;gliding-snow;
;;R2;2;0;fair;some;medium;;;;;wind-drifted-snow;gliding-snow;
;;
Vorarlberg;2023-12-09 17:00:00;R1;2;0;poor;some;medium;;;;;wet-snow;wind-drifted-snow;
;;R2;3;0;poor;some;large;;;;;wind-drifted-snow;wet-snow;
;;
Vorarlberg;2023-12-10 17:00:00;R1;2;0;poor;some;medium;;;;;wet-snow;gliding-snow;
;;R2;3;0;poor;some;large;;;;;new-snow;wet-snow;
;;
Vorarlberg;2023-12-11 17:00:00;R1;2;0;poor;some;medium;;;;;wet-snow;gliding-snow;
;;R2;3;0;poor;some;large;;;;;new-snow;wet-snow;
;;
Vorarlberg;2023-12-12 17:00:00;R1;2;0;poor;some;medium;;;;;gliding-snow;wind-drifted-snow;
;;R2;3;0;poor;some;large;;high;latitude;2000;new-snow;gliding-snow;2;0;poor;some;medium;;low;latitude;2000;new-snow;gliding-snow;
;;
Vorarlberg;2023-12-13 17:00:00;R1;2;0;poor;some;medium;;;;;gliding-snow;wind-drifted-snow;
;;R2;3;0;poor;some;large;;high;latitude;2000;wind-drifted-snow;gliding-snow;2;0;poor;some;medium;;low;latitude;2000;wind-drifted-snow;gliding-snow;
;;
Vorarlberg;2023-12-14 17:00:00;R1;2;0;poor;some;small;;high;latitude;1500;new-snow;gliding-snow;1;0;fair;few;small;;low;latitude;1500;new-snow;gliding-snow;
;;R2;3;0;poor;some;large;;high;latitude;2000;new-snow;gliding-snow;2;0;poor;some;medium;;low;latitude;2000;new-snow;gliding-snow;
;;
Vorarlberg;2023-12-15 07:00:00;R1;2;0;poor;some;small;;high;latitude;1500;new-snow;gliding-snow;1;0;fair;few;small;;low;latitude;1500;new-snow;gliding-snow;
;;R2;3;0;poor;some;large;;high;latitude;1800;new-snow;gliding-snow;2;0;poor;some;medium;;low;latitude;1800;new-snow;gliding-snow;
;;
Vorarlberg;2023-12-15 17:00:00;R1;2;0;poor;some;small;;high;latitude;1500;new-snow;gliding-snow;1;0;fair;few;small;;low;latitude;1500;new-snow;gliding-snow;
;;R2;3;0;poor;some;large;;high;latitude;2000;new-snow;gliding-snow;2;0;poor;some;medium;;low;latitude;2000;new-snow;gliding-snow;
;;
Vorarlberg;2023-12-16 17:00:00;R1;2;0;fair;some;medium;;;;;wind-drifted-snow;gliding-snow;
;;R2;2;0;fair;some;medium;;;;;wind-drifted-snow;gliding-snow;
;;
Vorarlberg;2023-12-17 17:00:00;R1;2;0;fair;some;medium;;;;;gliding-snow;wind-drifted-snow;
;;R2;2;0;fair;some;medium;;;;;gliding-snow;wind-drifted-snow;
;;
Vorarlberg;2023-12-18 17:00:00;R1;2;0;fair;some;medium;;high;latitude;1500;gliding-snow;wind-drifted-snow;1;0;fair;few;small;;low;latitude;1500;gliding-snow;wind-drifted-snow;
;;R2;2;0;fair;some;medium;;high;latitude;1500;gliding-snow;wind-drifted-snow;1;0;fair;few;small;;low;latitude;1500;gliding-snow;wind-drifted-snow;
;;
Vorarlberg;2023-12-19 17:00:00;R1;2;0;fair;some;medium;;high;latitude;1500;gliding-snow;wind-drifted-snow;1;0;fair;few;small;;low;latitude;1500;gliding-snow;wind-drifted-snow;
;;R2;2;0;fair;some;medium;;;;;gliding-snow;wind-drifted-snow;
;;
Vorarlberg;2023-12-20 17:00:00;R1;2;0;fair;some;medium;;high;forest;;wind-drifted-snow;gliding-snow;1;0;fair;few;small;;low;forest;;wind-drifted-snow;gliding-snow;
;;R2;3;0;poor;some;large;;high;forest;;wind-drifted-snow;gliding-snow;2;0;fair;some;medium;;low;forest;;wind-drifted-snow;gliding-snow;
;;
Vorarlberg;2023-12-21 17:00:00;R1;3;0;poor;many;medium;;high;forest;;new-snow;wind-drifted-snow;2;0;poor;some;medium;;low;forest;;new-snow;wind-drifted-snow;
;;R2;4;0;very_poor;many;large;;high;forest;;new-snow;wind-drifted-snow;3;0;very_poor;some;medium;;low;forest;;new-snow;wind-drifted-snow;
;;
Vorarlberg;2023-12-22 17:00:00;R1;3;0;poor;many;medium;;high;forest;;new-snow;wind-drifted-snow;2;0;poor;some;medium;;low;forest;;new-snow;wind-drifted-snow;
;;R2;4;0;very_poor;many;large;;high;forest;;new-snow;wind-drifted-snow;3;0;very_poor;some;medium;;low;forest;;new-snow;wind-drifted-snow;
;;
Vorarlberg;2023-12-23 17:00:00;R1;3;0;very_poor;some;large;;high;latitude;1800;wind-drifted-snow;gliding-snow;2;0;poor;some;medium;;low;latitude;1800;wind-drifted-snow;gliding-snow;
;;R2;3;0;very_poor;some;large;;high;forest;;wind-drifted-snow;gliding-snow;2;0;poor;some;medium;;low;forest;;wind-drifted-snow;gliding-snow;
;;
Vorarlberg;2023-12-24 17:00:00;R1;2;0;fair;some;large;;;;;wind-drifted-snow;wet-snow;
;;R2;3;0;poor;some;large;;high;latitude;2200;wind-drifted-snow;wet-snow;2;0;poor;some;medium;;low;latitude;2200;wind-drifted-snow;wet-snow;
;;
Vorarlberg;2023-12-25 17:00:00;R1;2;0;fair;some;large;;;;;gliding-snow;no-problem;
;;R2;2;0;poor;few;medium;;high;latitude;2400;gliding-snow;wind-drifted-snow;3;0;poor;some;large;;low;latitude;2400;gliding-snow;wind-drifted-snow;
;;
Vorarlberg;2023-12-26 17:00:00;R1;2;0;fair;some;large;;;;;gliding-snow;no-problem;
;;R2;2;0;poor;some;medium;;;;;gliding-snow;gliding-snow;
;;R3;1;0;fair;few;small;;;;;gliding-snow;;
;;
Vorarlberg;2023-12-27 17:00:00;R1;2;0;poor;few;medium;;;;;gliding-snow;no-problem;
;;R2;1;0;fair;few;small;;high;latitude;2500;gliding-snow;no-problem;2;0;fair;some;medium;;low;latitude;2500;gliding-snow;no-problem;
;;R3;1;0;fair;few;small;;;;;gliding-snow;;
;;
Vorarlberg;2023-12-28 17:00:00;R1;2;0;fair;some;medium;;;;;gliding-snow;no-problem;
;;R2;1;0;fair;few;small;;high;latitude;2400;gliding-snow;no-problem;2;0;fair;some;medium;;low;latitude;2400;gliding-snow;no-problem;
;;R3;1;0;good;few;small;;;;;gliding-snow;;
;;
Vorarlberg;2023-12-29 17:00:00;R1;2;0;fair;some;medium;;;;;gliding-snow;no-problem;
;;R2;1;0;fair;few;small;;high;latitude;2400;gliding-snow;no-problem;2;0;fair;some;medium;;low;latitude;2400;gliding-snow;no-problem;
;;R3;1;0;good;few;small;;;;;gliding-snow;;
;;
Vorarlberg;2023-12-30 17:00:00;R1;1;0;fair;few;small;;;;;gliding-snow;;
;;R2;1;0;good;few;small;;high;latitude;2400;gliding-snow;;2;0;fair;some;medium;;low;latitude;2400;gliding-snow;;
;;
Vorarlberg;2023-12-31 17:00:00;R1;2;0;fair;some;medium;;high;latitude;1800;wind-drifted-snow;gliding-snow;1;0;fair;few;medium;;low;latitude;1800;wind-drifted-snow;gliding-snow;
;;R2;2;0;fair;some;medium;;;;;wind-drifted-snow;gliding-snow;
;;
Vorarlberg;2024-01-01 17:00:00;R1;2;0;fair;some;medium;;high;latitude;1800;wind-drifted-snow;gliding-snow;1;0;fair;few;medium;;low;latitude;1800;wind-drifted-snow;gliding-snow;
;;R2;2;0;fair;some;medium;;;;;wind-drifted-snow;gliding-snow;
;;
Vorarlberg;2024-01-02 17:00:00;R1;2;0;fair;some;medium;;high;latitude;1800;wind-drifted-snow;gliding-snow;2;0;poor;few;medium;;low;latitude;1800;wind-drifted-snow;gliding-snow;
;;R2;2;0;fair;some;medium;;;;;wind-drifted-snow;gliding-snow;
;;R3;1;0;poor;few;small;;;;;wind-drifted-snow;gliding-snow;
;;
Vorarlberg;2024-01-03 17:00:00;R1;2;0;fair;some;medium;;high;latitude;1800;wind-drifted-snow;gliding-snow;1;0;fair;few;medium;;low;latitude;1800;wind-drifted-snow;gliding-snow;
;;R2;2;0;poor;few;medium;;high;latitude;2000;wind-drifted-snow;gliding-snow;1;0;fair;few;medium;;low;latitude;2000;wind-drifted-snow;gliding-snow;
;;R3;1;0;poor;few;small;;;;;wind-drifted-snow;;
;;
Vorarlberg;2024-01-04 06:36:34;R1;2;0;fair;some;medium;;high;latitude;1800;wind-drifted-snow;gliding-snow;1;0;fair;few;medium;;low;latitude;1800;wind-drifted-snow;gliding-snow;
;;R2;1;0;poor;few;small;;;;;wind-drifted-snow;;
;;
Vorarlberg;2024-01-04 07:00:00;R1;2;0;fair;some;medium;;high;latitude;1800;wind-drifted-snow;gliding-snow;1;0;fair;few;medium;;low;latitude;1800;wind-drifted-snow;gliding-snow;
;;R2;1;0;poor;few;small;;;;;wind-drifted-snow;;
;;
Vorarlberg;2024-01-04 17:00:00;R1;2;0;fair;some;medium;;high;latitude;2000;wind-drifted-snow;gliding-snow;1;0;fair;few;medium;;low;latitude;2000;wind-drifted-snow;gliding-snow;
;;R2;1;0;poor;few;small;;;;;wind-drifted-snow;;
;;
Vorarlberg;2024-01-05 17:00:00;R1;2;0;fair;some;medium;;high;latitude;1600;new-snow;wind-drifted-snow;1;0;fair;few;medium;;low;latitude;1600;new-snow;wind-drifted-snow;
;;R2;2;0;poor;some;medium;;high;latitude;1600;new-snow;;1;0;fair;few;small;;low;latitude;1600;new-snow;;
;;
Vorarlberg;2024-01-06 07:00:00;R1;2;0;fair;some;medium;;high;latitude;1600;new-snow;wind-drifted-snow;1;0;fair;few;medium;;low;latitude;1600;new-snow;wind-drifted-snow;
;;R2;2;0;poor;some;medium;;high;latitude;1600;new-snow;wind-drifted-snow;1;0;fair;few;small;;low;latitude;1600;new-snow;wind-drifted-snow;
;;
Vorarlberg;2024-01-06 17:00:00;R1;3;0;very_poor;some;medium;;high;latitude;1800;new-snow;wind-drifted-snow;2;0;poor;some;medium;;low;latitude;1800;new-snow;wind-drifted-snow;
;;
Vorarlberg;2024-01-07 17:00:00;R1;3;0;very_poor;some;medium;;high;forest;1800;wind-drifted-snow;new-snow;1;0;fair;few;medium;;low;forest;1800;wind-drifted-snow;new-snow;
;;
Vorarlberg;2024-01-08 17:00:00;R1;3;0;poor;many;medium;;high;latitude;2000;wind-drifted-snow;new-snow;1;0;fair;few;medium;;low;latitude;2000;wind-drifted-snow;new-snow;
;;R2;2;0;poor;few;medium;;high;latitude;1600;wind-drifted-snow;;1;0;fair;few;small;;low;latitude;1600;wind-drifted-snow;;
;;
Vorarlberg;2024-01-09 17:00:00;R1;2;0;poor;some;medium;;high;forest;;wind-drifted-snow;gliding-snow;1;0;fair;few;medium;;low;forest;;wind-drifted-snow;gliding-snow;
;;
Vorarlberg;2024-01-10 17:00:00;R1;2;0;fair;some;medium;;high;latitude;1800;wind-drifted-snow;gliding-snow;1;0;fair;few;medium;;low;latitude;1800;wind-drifted-snow;gliding-snow;
;;
Vorarlberg;2024-01-11 17:00:00;R1;2;0;fair;some;medium;;high;latitude;1800;wind-drifted-snow;gliding-snow;1;0;fair;few;medium;;low;latitude;1800;wind-drifted-snow;gliding-snow;
;;
Vorarlberg;2024-01-12 17:00:00;R1;2;0;fair;some;medium;;high;latitude;1800;wind-drifted-snow;gliding-snow;1;0;fair;few;medium;;low;latitude;1800;wind-drifted-snow;gliding-snow;
;;
Vorarlberg;2024-01-13 17:00:00;R1;1;0;fair;few;medium;;;;;wind-drifted-snow;gliding-snow;
;;
Vorarlberg;2024-01-14 17:00:00;R1;3;0;very_poor;some;medium;;high;forest;;wind-drifted-snow;gliding-snow;1;0;fair;few;medium;;low;forest;;wind-drifted-snow;gliding-snow;
;;R2;2;0;poor;some;medium;;high;forest;;wind-drifted-snow;gliding-snow;1;0;fair;few;medium;;low;forest;;wind-drifted-snow;gliding-snow;
;;
Vorarlberg;2024-01-15 07:00:00;R1;2;0;poor;some;medium;;high;forest;;wind-drifted-snow;gliding-snow;1;0;fair;few;medium;;low;forest;;wind-drifted-snow;gliding-snow;
;;
Vorarlberg;2024-01-15 08:48:55;R1;2;0;poor;some;medium;;high;forest;;wind-drifted-snow;gliding-snow;1;0;fair;few;medium;;low;forest;;wind-drifted-snow;gliding-snow;
;;
Vorarlberg;2024-01-15 17:00:00;R1;3;0;very_poor;some;medium;;high;forest;;wind-drifted-snow;gliding-snow;2;0;fair;some;medium;;low;forest;;wind-drifted-snow;gliding-snow;
;;R2;2;0;poor;some;medium;;high;forest;;wind-drifted-snow;gliding-snow;1;0;fair;few;small;;low;forest;;wind-drifted-snow;gliding-snow;
;;
Vorarlberg;2024-01-16 17:00:00;R1;3;0;very_poor;some;medium;;high;latitude;1800;wind-drifted-snow;wet-snow;2;0;poor;some;medium;;low;latitude;1800;wind-drifted-snow;wet-snow;
;;R2;2;0;poor;some;medium;;;;;wind-drifted-snow;wet-snow;
;;
Vorarlberg;2024-01-17 17:00:00;R1;3;0;very_poor;some;medium;;high;latitude;2000;wind-drifted-snow;wet-snow;2;0;poor;some;medium;;low;latitude;2000;wind-drifted-snow;wet-snow;
;;R2;2;0;poor;some;medium;;;;;wind-drifted-snow;wet-snow;
;;
Vorarlberg;2024-01-18 17:00:00;R1;3;0;very_poor;some;medium;;high;latitude;2000;wind-drifted-snow;gliding-snow;2;0;poor;some;medium;;low;latitude;2000;wind-drifted-snow;gliding-snow;
;;R2;2;0;poor;some;medium;;high;latitude;1600;wind-drifted-snow;gliding-snow;1;0;fair;few;small;;low;latitude;1600;wind-drifted-snow;gliding-snow;
;;
Vorarlberg;2024-01-19 17:00:00;R1;2;0;poor;some;medium;;high;latitude;1800;wind-drifted-snow;gliding-snow;1;0;poor;few;small;;low;latitude;1800;wind-drifted-snow;gliding-snow;
;;
Vorarlberg;2024-01-20 17:00:00;R1;2;0;poor;some;medium;;high;latitude;1800;wind-drifted-snow;gliding-snow;1;0;poor;few;small;;low;latitude;1800;wind-drifted-snow;gliding-snow;
;;
Vorarlberg;2024-01-21 17:00:00;R1;2;0;poor;some;medium;;high;forest;1800;wind-drifted-snow;gliding-snow;1;0;poor;few;small;;low;forest;1800;wind-drifted-snow;gliding-snow;
;;
Vorarlberg;2024-01-22 17:00:00;R1;3;0;very_poor;some;medium;;high;latitude;1800;wind-drifted-snow;gliding-snow;2;0;poor;few;medium;;low;latitude;1800;wind-drifted-snow;gliding-snow;
;;R2;2;0;poor;few;medium;;high;forest;;wind-drifted-snow;gliding-snow;1;0;fair;few;small;;low;forest;;wind-drifted-snow;gliding-snow;
;;
Vorarlberg;2024-01-23 07:00:00;R1;3;0;very_poor;some;medium;;high;latitude;2000;wind-drifted-snow;gliding-snow;2;0;poor;few;medium;;low;latitude;2000;wind-drifted-snow;gliding-snow;
;;R2;2;0;poor;few;medium;;high;forest;;wind-drifted-snow;gliding-snow;1;0;fair;few;small;;low;forest;;wind-drifted-snow;gliding-snow;
;;
Vorarlberg;2024-01-23 17:00:00;R1;2;0;poor;some;medium;;;;;wind-drifted-snow;gliding-snow;
;;R2;2;0;poor;few;medium;;high;latitude;1800;wind-drifted-snow;gliding-snow;1;0;fair;few;small;;low;latitude;1800;wind-drifted-snow;gliding-snow;
;;
Vorarlberg;2024-01-24 17:00:00;R1;3;0;poor;some;large;;high;latitude;2200;wind-drifted-snow;wet-snow;2;0;poor;some;medium;;low;latitude;2200;wind-drifted-snow;wet-snow;
;;R2;2;0;fair;some;medium;;;;;wet-snow;wind-drifted-snow;
;;
Vorarlberg;2024-01-25 07:00:00;R1;3;0;very_poor;some;medium;;;;;wet-snow;wind-drifted-snow;
;;R2;2;0;fair;some;medium;;;;;wet-snow;wind-drifted-snow;
;;
Vorarlberg;2024-01-25 17:00:00;R1;3;0;poor;some;large;;high;latitude;2200;wind-drifted-snow;wet-snow;2;0;poor;some;medium;;low;latitude;2200;wind-drifted-snow;wet-snow;
;;R2;2;0;poor;few;medium;;high;latitude;1500;wet-snow;wind-drifted-snow;1;0;fair;few;small;;low;latitude;1500;wet-snow;wind-drifted-snow;
;;
Vorarlberg;2024-01-26 17:00:00;R1;3;0;poor;some;large;;high;latitude;2200;wind-drifted-snow;wet-snow;2;0;poor;some;medium;;low;latitude;2200;wind-drifted-snow;wet-snow;
;;R2;2;0;poor;few;medium;;high;latitude;1500;wet-snow;wind-drifted-snow;1;0;fair;few;small;;low;latitude;1500;wet-snow;wind-drifted-snow;
;;
Vorarlberg;2024-01-27 17:00:00;R1;2;0;poor;few;medium;;;;;wind-drifted-snow;gliding-snow;
;;R2;2;0;poor;few;medium;;high;latitude;1500;wet-snow;wind-drifted-snow;1;0;fair;few;small;;low;latitude;1500;wet-snow;wind-drifted-snow;
;;
Vorarlberg;2024-01-28 17:00:00;R1;2;0;poor;few;medium;;;;;persistant-weak-layer;gliding-snow;
;;R2;2;0;poor;few;medium;;high;latitude;1500;gliding-snow;persistant-weak-layer;1;0;fair;few;small;;low;latitude;1500;gliding-snow;persistant-weak-layer;
;;
Vorarlberg;2024-01-29 17:00:00;R1;2;0;poor;few;medium;;;;;persistant-weak-layer;gliding-snow;
;;R2;1;0;fair;few;medium;;;;;gliding-snow;no-problem;
;;
Vorarlberg;2024-01-30 17:00:00;R1;2;0;poor;few;medium;;;;;persistant-weak-layer;gliding-snow;
;;R2;1;0;fair;few;medium;;;;;gliding-snow;no-problem;
;;
Vorarlberg;2024-01-31 17:00:00;R1;2;0;poor;few;medium;;;;;wind-drifted-snow;gliding-snow;
;;R2;1;0;fair;few;medium;;;;;gliding-snow;wind-drifted-snow;
;;
Vorarlberg;2024-02-01 17:00:00;R1;2;0;poor;few;medium;;;;;wind-drifted-snow;gliding-snow;
;;R2;1;0;fair;few;medium;;;;;gliding-snow;wind-drifted-snow;
;;
Vorarlberg;2024-02-02 17:00:00;R1;2;0;poor;some;small;;high;latitude;2000;wind-drifted-snow;gliding-snow;1;0;fair;few;small;;low;latitude;2000;wind-drifted-snow;gliding-snow;
;;R2;1;0;poor;few;small;;;;;gliding-snow;wind-drifted-snow;
;;
Vorarlberg;2024-02-03 17:00:00;R1;2;0;poor;some;small;;high;latitude;2200;wind-drifted-snow;gliding-snow;1;0;fair;few;small;;low;latitude;2200;wind-drifted-snow;gliding-snow;
;;R2;1;0;poor;few;small;;;;;wind-drifted-snow;gliding-snow;
;;
Vorarlberg;2024-02-04 17:00:00;R1;1;0;fair;some;small;;high;latitude;2200;wind-drifted-snow;gliding-snow;1;1;poor;few;medium;;low;latitude;2200;wind-drifted-snow;gliding-snow;
;;
Vorarlberg;2024-02-05 17:00:00;R1;1;0;fair;some;small;;;;;wind-drifted-snow;gliding-snow;
;;
Vorarlberg;2024-02-06 17:00:00;R1;1;0;fair;some;small;;;;;gliding-snow;no-problem;
;;
Vorarlberg;2024-02-07 17:00:00;R1;1;0;fair;some;small;;;;;gliding-snow;wind-drifted-snow;
;;
Vorarlberg;2024-02-08 17:00:00;R1;2;0;fair;some;medium;;high;latitude;1200;gliding-snow;wind-drifted-snow;1;0;fair;few;small;;low;latitude;1200;gliding-snow;wind-drifted-snow;
;;
Vorarlberg;2024-02-09 17:00:00;R1;2;0;fair;some;medium;;high;latitude;1200;gliding-snow;wind-drifted-snow;1;0;fair;few;small;;low;latitude;1200;gliding-snow;wind-drifted-snow;
;;
Vorarlberg;2024-02-10 17:00:00;R1;2;0;fair;some;medium;;high;latitude;1400;gliding-snow;wind-drifted-snow;1;0;poor;few;small;;low;latitude;1400;gliding-snow;wind-drifted-snow;
;;
Vorarlberg;2024-02-11 07:00:00;R1;2;0;fair;some;medium;;high;latitude;1400;gliding-snow;wind-drifted-snow;1;0;poor;few;small;;low;latitude;1400;gliding-snow;wind-drifted-snow;
;;
Vorarlberg;2024-02-11 17:00:00;R1;2;0;fair;some;medium;;high;latitude;1400;wind-drifted-snow;gliding-snow;1;0;poor;few;small;;low;latitude;1400;wind-drifted-snow;gliding-snow;
;;
Vorarlberg;2024-02-12 17:00:00;R1;2;0;fair;some;medium;;high;latitude;1500;wind-drifted-snow;gliding-snow;1;0;poor;few;small;;low;latitude;1500;wind-drifted-snow;gliding-snow;
;;
Vorarlberg;2024-02-13 17:00:00;R1;2;0;fair;some;medium;;high;latitude;2000;wind-drifted-snow;gliding-snow;1;0;good;none;small;;low;latitude;2000;wind-drifted-snow;gliding-snow;
;;
Vorarlberg;2024-02-14 17:00:00;R1;2;0;fair;some;medium;;high;latitude;1400;wind-drifted-snow;gliding-snow;1;0;good;none;small;;low;latitude;1400;wind-drifted-snow;gliding-snow;
;;
Vorarlberg;2024-02-15 17:00:00;R1;2;0;fair;some;medium;;high;latitude;1400;wind-drifted-snow;gliding-snow;1;0;good;none;small;;low;latitude;1400;wind-drifted-snow;gliding-snow;
;;
Vorarlberg;2024-02-16 17:00:00;R1;2;0;fair;some;medium;;high;latitude;1400;wind-drifted-snow;gliding-snow;1;0;good;none;small;;low;latitude;1400;wind-drifted-snow;gliding-snow;
;;
Vorarlberg;2024-02-17 17:00:00;R1;2;0;very_poor;few;medium;;high;latitude;1800;wet-snow;gliding-snow;1;0;poor;few;small;;low;latitude;1800;wet-snow;gliding-snow;
;;
Vorarlberg;2024-02-18 17:00:00;R1;2;0;poor;some;medium;;high;forest;2400;wind-drifted-snow;gliding-snow;1;0;poor;few;small;;low;forest;2400;wind-drifted-snow;gliding-snow;
;;
Vorarlberg;2024-02-19 17:00:00;R1;2;0;poor;some;medium;;high;latitude;1800;wind-drifted-snow;gliding-snow;1;0;poor;few;small;;low;latitude;1800;wind-drifted-snow;gliding-snow;
;;
Vorarlberg;2024-02-20 07:00:00;R1;2;0;poor;some;medium;;high;latitude;1800;wind-drifted-snow;gliding-snow;1;0;poor;few;small;;low;latitude;1800;wind-drifted-snow;gliding-snow;
;;R2;3;0;poor;some;large;;high;latitude;1600;wind-drifted-snow;gliding-snow;1;0;fair;few;medium;;low;latitude;1600;wind-drifted-snow;gliding-snow;
;;
Vorarlberg;2024-02-20 17:00:00;R1;2;0;fair;some;medium;;high;latitude;1800;wind-drifted-snow;gliding-snow;1;0;fair;few;small;;low;latitude;1800;wind-drifted-snow;gliding-snow;
;;
Vorarlberg;2024-02-21 17:00:00;R1;2;0;fair;some;medium;;high;latitude;2000;wind-drifted-snow;wet-snow;1;0;fair;few;small;;low;latitude;2000;wind-drifted-snow;wet-snow;
;;
Vorarlberg;2024-02-22 17:00:00;R1;3;0;poor;some;large;;high;forest;2000;new-snow;wet-snow;2;0;poor;few;medium;;low;forest;2000;new-snow;wet-snow;
;;R2;2;0;poor;some;small;;high;forest;;wind-drifted-snow;gliding-snow;1;0;fair;few;small;;low;forest;;wind-drifted-snow;gliding-snow;
;;
Vorarlberg;2024-02-23 17:00:00;R1;3;0;poor;some;large;;high;latitude;1800;;gliding-snow;2;0;poor;few;medium;;low;latitude;1800;;gliding-snow;
;;R2;2;0;poor;few;medium;;high;forest;;wind-drifted-snow;gliding-snow;1;0;fair;few;small;;low;forest;;wind-drifted-snow;gliding-snow;
;;
Vorarlberg;2024-02-24 17:00:00;R1;3;0;poor;some;large;;high;latitude;2000;wind-drifted-snow;gliding-snow;2;0;poor;few;medium;;low;latitude;2000;wind-drifted-snow;gliding-snow;
;;R2;2;0;poor;few;medium;;high;latitude;1800;wind-drifted-snow;gliding-snow;1;0;fair;few;small;;low;latitude;1800;wind-drifted-snow;gliding-snow;
;;
Vorarlberg;2024-02-25 17:00:00;R1;3;0;poor;some;large;;high;latitude;2000;wind-drifted-snow;gliding-snow;2;0;poor;few;medium;;low;latitude;2000;wind-drifted-snow;gliding-snow;
;;R2;2;0;poor;some;medium;;high;forest;1800;wind-drifted-snow;gliding-snow;1;0;fair;few;small;;low;forest;1800;wind-drifted-snow;gliding-snow;
;;
Vorarlberg;2024-02-26 17:00:00;R1;3;0;poor;some;large;;high;latitude;2000;wind-drifted-snow;gliding-snow;2;0;poor;some;medium;;low;latitude;2000;wind-drifted-snow;gliding-snow;
;;R2;2;0;poor;some;medium;;high;forest;1800;wind-drifted-snow;gliding-snow;1;0;fair;few;small;;low;forest;1800;wind-drifted-snow;gliding-snow;
;;
Vorarlberg;2024-02-27 17:00:00;R1;2;0;poor;some;medium;;high;latitude;2000;wind-drifted-snow;gliding-snow;2;0;poor;few;medium;;low;latitude;2000;wind-drifted-snow;gliding-snow;
;;R2;2;0;poor;some;medium;;high;latitude;2000;wind-drifted-snow;gliding-snow;1;0;fair;few;small;;low;latitude;2000;wind-drifted-snow;gliding-snow;
;;
Vorarlberg;2024-02-28 17:00:00;R1;2;0;poor;some;medium;;high;latitude;2200;no-problem;gliding-snow;2;0;poor;few;medium;;low;latitude;2200;no-problem;gliding-snow;
;;R2;1;0;poor;few;small;;high;latitude;2200;no-problem;gliding-snow;1;0;poor;few;small;;low;latitude;2200;no-problem;gliding-snow;
;;
Vorarlberg;2024-02-29 17:00:00;R1;2;0;poor;some;medium;;high;latitude;2200;no-problem;gliding-snow;2;0;poor;few;medium;;low;latitude;2200;no-problem;gliding-snow;
;;R2;1;0;poor;few;small;;high;latitude;2200;no-problem;gliding-snow;1;0;poor;few;small;;low;latitude;2200;no-problem;gliding-snow;
;;
Vorarlberg;2024-03-01 17:00:00;R1;2;0;poor;some;medium;;high;latitude;2000;wind-drifted-snow;gliding-snow;2;0;poor;few;medium;;low;latitude;2000;wind-drifted-snow;gliding-snow;
;;R2;1;0;poor;few;small;;high;latitude;2200;wind-drifted-snow;gliding-snow;1;0;poor;few;small;;low;latitude;2200;wind-drifted-snow;gliding-snow;
;;
Vorarlberg;2024-03-02 17:00:00;R1;2;0;poor;some;medium;;high;latitude;2000;wind-drifted-snow;gliding-snow;2;0;poor;few;medium;;low;latitude;2000;wind-drifted-snow;gliding-snow;
;;R2;1;0;poor;few;small;;high;latitude;2200;wet-snow;gliding-snow;1;0;poor;few;small;;low;latitude;2200;wet-snow;gliding-snow;
;;R3;3;0;very_poor;some;medium;;high;latitude;2200;wind-drifted-snow;gliding-snow;2;0;poor;some;medium;;low;latitude;2200;wind-drifted-snow;gliding-snow;
;;
Vorarlberg;2024-03-03 17:00:00;R1;2;0;poor;some;medium;;high;latitude;2000;wind-drifted-snow;gliding-snow;2;0;poor;few;medium;;low;latitude;2000;wind-drifted-snow;gliding-snow;
;;R2;1;0;fair;few;small;;;;;wet-snow;gliding-snow;
;;R3;3;0;very_poor;some;medium;;high;latitude;2200;wind-drifted-snow;gliding-snow;2;0;poor;some;medium;;low;latitude;2200;wind-drifted-snow;gliding-snow;
;;
Vorarlberg;2024-03-04 17:00:00;R1;2;0;poor;some;medium;;high;latitude;2000;wind-drifted-snow;gliding-snow;2;0;poor;few;medium;;low;latitude;2000;wind-drifted-snow;gliding-snow;
;;R2;1;0;fair;few;small;;;;;gliding-snow;;
;;R3;2;0;poor;few;medium;;high;latitude;2200;wind-drifted-snow;gliding-snow;2;0;fair;some;medium;;low;latitude;2200;wind-drifted-snow;gliding-snow;
;;
Vorarlberg;2024-03-05 17:00:00;R1;3;0;poor;many;medium;;high;latitude;2000;new-snow;gliding-snow;2;0;poor;some;medium;;low;latitude;2000;new-snow;gliding-snow;
;;R2;2;0;poor;some;small;;high;forest;;gliding-snow;new-snow;1;0;fair;few;small;;low;forest;;gliding-snow;new-snow;
;;R3;2;0;poor;few;medium;;high;latitude;2200;new-snow;gliding-snow;2;0;fair;some;medium;;low;latitude;2200;new-snow;gliding-snow;
;;
Vorarlberg;2024-03-06 17:00:00;R1;3;0;poor;many;medium;;high;latitude;2000;new-snow;gliding-snow;2;0;poor;some;medium;;low;latitude;2000;new-snow;gliding-snow;
;;R2;2;0;poor;some;small;;high;forest;;gliding-snow;new-snow;1;0;fair;few;small;;low;forest;;gliding-snow;new-snow;
;;
Vorarlberg;2024-03-07 17:00:00;R1;2;0;poor;some;medium;;high;latitude;2000;wind-drifted-snow;gliding-snow;2;0;poor;some;medium;;low;latitude;2000;wind-drifted-snow;gliding-snow;
;;R2;2;0;fair;some;medium;;high;latitude;1400;wet-snow;wind-drifted-snow;1;0;fair;few;small;;low;latitude;1400;wet-snow;wind-drifted-snow;
;;
Vorarlberg;2024-03-08 17:00:00;R1;2;0;fair;some;medium;;high;latitude;2000;wind-drifted-snow;gliding-snow;2;0;poor;some;medium;;low;latitude;2000;wind-drifted-snow;gliding-snow;
;;R2;1;0;fair;few;small;;;;;wet-snow;wind-drifted-snow;
;;R3;3;0;very_poor;some;medium;;high;latitude;2200;wind-drifted-snow;gliding-snow;2;0;poor;some;medium;;low;latitude;2200;wind-drifted-snow;gliding-snow;
;;
Vorarlberg;2024-03-09 07:00:00;R1;2;0;fair;some;medium;;high;latitude;2000;wind-drifted-snow;gliding-snow;2;0;poor;some;medium;;low;latitude;2000;wind-drifted-snow;gliding-snow;
;;R2;1;0;fair;few;small;;;;;wet-snow;wind-drifted-snow;
;;R3;3;0;very_poor;some;medium;;high;latitude;2000;wind-drifted-snow;gliding-snow;2;0;poor;some;medium;;low;latitude;2000;wind-drifted-snow;gliding-snow;
;;
Vorarlberg;2024-03-09 17:00:00;R1;2;0;poor;some;medium;;;;;wind-drifted-snow;gliding-snow;
;;R2;1;0;fair;few;small;;;;;wet-snow;wind-drifted-snow;
;;R3;3;0;poor;many;medium;;high;latitude;2000;wind-drifted-snow;gliding-snow;2;0;poor;some;medium;;low;latitude;2000;wind-drifted-snow;gliding-snow;
;;
Vorarlberg;2024-03-10 17:00:00;R1;2;0;poor;some;medium;;;;;wind-drifted-snow;gliding-snow;
;;R2;1;0;fair;few;small;;;;;wind-drifted-snow;wet-snow;
;;R3;3;0;poor;many;medium;;high;latitude;2000;wind-drifted-snow;gliding-snow;2;0;poor;some;medium;;low;latitude;2000;wind-drifted-snow;gliding-snow;
;;
Vorarlberg;2024-03-11 17:00:00;R1;2;0;poor;some;medium;;;;;wind-drifted-snow;gliding-snow;
;;R2;1;0;fair;few;small;;;;;wind-drifted-snow;gliding-snow;
;;
Vorarlberg;2024-03-12 17:00:00;R1;2;0;fair;some;medium;;high;latitude;1800;new-snow;wet-snow;2;0;poor;few;medium;;low;latitude;1800;new-snow;wet-snow;
;;R2;2;0;fair;some;medium;;high;latitude;1600;new-snow;wet-snow;1;0;fair;few;small;;low;latitude;1600;new-snow;wet-snow;
;;
Vorarlberg;2024-03-13 17:00:00;R1;2;0;fair;some;medium;;high;latitude;1800;wind-drifted-snow;wet-snow;2;0;poor;few;medium;;low;latitude;1800;wind-drifted-snow;wet-snow;
;;R2;1;0;fair;few;medium;;;;;wet-snow;;
;;R3;3;0;very_poor;some;medium;;high;latitude;2100;wind-drifted-snow;wet-snow;2;0;poor;few;medium;;low;latitude;2100;wind-drifted-snow;wet-snow;
;;
Vorarlberg;2024-03-14 17:00:00;R1;2;0;fair;some;medium;;high;latitude;1800;wind-drifted-snow;wet-snow;2;0;poor;few;medium;;low;latitude;1800;wind-drifted-snow;wet-snow;
;;R2;1;0;fair;few;medium;;;;;wet-snow;;
;;
Vorarlberg;2024-03-15 07:00:00;R1;2;0;fair;some;medium;;high;latitude;1800;wind-drifted-snow;wet-snow;2;0;poor;few;medium;;low;latitude;1800;wind-drifted-snow;wet-snow;
;;R2;1;0;fair;few;medium;;;;;wet-snow;;
;;
Vorarlberg;2024-03-15 17:00:00;R1;2;0;fair;some;medium;;high;latitude;1500;wind-drifted-snow;wet-snow;1;0;fair;few;small;;low;latitude;1500;wind-drifted-snow;wet-snow;
;;R2;1;0;fair;few;medium;;;;;wet-snow;;
;;
Vorarlberg;2024-03-16 17:00:00;R1;2;0;fair;some;medium;;high;latitude;1500;wind-drifted-snow;wet-snow;1;0;fair;few;small;;low;latitude;1500;wind-drifted-snow;wet-snow;
;;R2;1;0;fair;few;medium;;;;;wet-snow;;
;;
Vorarlberg;2024-03-17 17:00:00;R1;2;0;fair;some;medium;;high;latitude;1500;wind-drifted-snow;wet-snow;1;0;fair;few;small;;low;latitude;1500;wind-drifted-snow;wet-snow;
;;R2;1;0;fair;few;medium;;;;;wet-snow;wind-drifted-snow;
;;
Vorarlberg;2024-03-18 17:00:00;R1;2;0;fair;some;medium;;high;latitude;1500;wet-snow;wind-drifted-snow;1;0;fair;few;small;;low;latitude;1500;wet-snow;wind-drifted-snow;
;;R2;1;0;fair;few;medium;;;;;wet-snow;wind-drifted-snow;
;;
Vorarlberg;2024-03-19 07:00:00;R1;2;0;fair;some;medium;;high;latitude;2200;wet-snow;wind-drifted-snow;3;0;poor;some;large;;low;latitude;2200;wet-snow;wind-drifted-snow;
;;R2;1;0;fair;few;medium;;;;;wet-snow;;
;;R3;3;0;poor;some;large;;high;latitude;1500;wet-snow;wind-drifted-snow;1;0;poor;few;small;;low;latitude;1500;wet-snow;wind-drifted-snow;
;;
Vorarlberg;2024-03-19 17:00:00;R1;2;0;fair;some;medium;;high;latitude;2200;wet-snow;wind-drifted-snow;2;0;poor;few;large;;low;latitude;2200;wet-snow;wind-drifted-snow;
;;R2;1;0;fair;few;medium;;;;;wet-snow;;
;;
Vorarlberg;2024-03-20 17:00:00;R1;2;0;poor;some;medium;;high;latitude;2200;wet-snow;wind-drifted-snow;3;0;poor;some;large;;low;latitude;2200;wet-snow;wind-drifted-snow;
;;R2;2;0;poor;some;medium;;;;;wet-snow;;
;;
Vorarlberg;2024-03-21 17:00:00;R1;2;0;poor;some;medium;;;;;wet-snow;wind-drifted-snow;
;;R2;1;0;poor;few;small;;;;;wet-snow;;
;;
Vorarlberg;2024-03-22 17:00:00;R1;2;0;poor;few;medium;;high;latitude;1500;wind-drifted-snow;gliding-snow;1;0;fair;few;small;;low;latitude;1500;wind-drifted-snow;gliding-snow;
;;R2;1;0;fair;few;small;;;;;gliding-snow;;
;;
Vorarlberg;2024-03-23 17:00:00;R1;3;0;very_poor;some;medium;;high;latitude;2000;wind-drifted-snow;gliding-snow;2;0;poor;some;medium;;low;latitude;2000;wind-drifted-snow;gliding-snow;
;;R2;2;0;poor;some;medium;;high;forest;;wind-drifted-snow;gliding-snow;1;0;fair;few;small;;low;forest;;wind-drifted-snow;gliding-snow;
;;
Vorarlberg;2024-03-24 17:00:00;R1;3;0;very_poor;some;medium;;high;latitude;2000;wind-drifted-snow;wet-snow;2;0;poor;some;medium;;low;latitude;2000;wind-drifted-snow;wet-snow;
;;R2;2;0;poor;some;medium;;high;forest;;wind-drifted-snow;wet-snow;1;0;fair;few;small;;low;forest;;wind-drifted-snow;wet-snow;
;;
Vorarlberg;2024-03-25 17:00:00;R1;3;0;very_poor;some;medium;;high;latitude;2200;wind-drifted-snow;gliding-snow;2;0;poor;some;medium;;low;latitude;2200;wind-drifted-snow;gliding-snow;
;;R2;2;0;poor;few;medium;;high;latitude;1600;wind-drifted-snow;gliding-snow;1;0;fair;few;small;;low;latitude;1600;wind-drifted-snow;gliding-snow;
;;
Vorarlberg;2024-03-26 05:59:51;R1;3;0;very_poor;some;medium;;high;latitude;2000;wind-drifted-snow;gliding-snow;2;0;poor;some;medium;;low;latitude;2000;wind-drifted-snow;gliding-snow;
;;R2;2;0;poor;few;medium;;high;latitude;1600;wind-drifted-snow;gliding-snow;1;0;fair;few;small;;low;latitude;1600;wind-drifted-snow;gliding-snow;
;;
Vorarlberg;2024-03-26 17:00:00;R1;3;0;very_poor;some;medium;;high;latitude;2200;wind-drifted-snow;wet-snow;2;0;poor;some;medium;;low;latitude;2200;wind-drifted-snow;wet-snow;
;;R2;2;0;poor;few;medium;;high;latitude;1600;wind-drifted-snow;wet-snow;1;0;fair;few;small;;low;latitude;1600;wind-drifted-snow;wet-snow;
;;
Vorarlberg;2024-03-27 17:00:00;R1;2;0;poor;some;medium;;high;latitude;1600;wind-drifted-snow;gliding-snow;1;0;poor;few;small;;low;latitude;1600;wind-drifted-snow;gliding-snow;
;;R2;1;0;fair;few;small;;;;;wind-drifted-snow;gliding-snow;
;;
Vorarlberg;2024-03-28 17:00:00;R1;2;0;poor;some;medium;;high;latitude;1600;wind-drifted-snow;gliding-snow;1;0;poor;few;small;;low;latitude;1600;wind-drifted-snow;gliding-snow;
;;R2;1;0;fair;few;small;;;;;wind-drifted-snow;gliding-snow;
;;
Vorarlberg;2024-03-29 17:00:00;R1;2;0;poor;some;medium;;high;latitude;1600;wind-drifted-snow;gliding-snow;1;0;poor;few;small;;low;latitude;1600;wind-drifted-snow;gliding-snow;
;;R2;1;0;fair;few;medium;;;;;gliding-snow;;
;;
Vorarlberg;2024-03-30 17:00:00;R1;2;0;poor;some;medium;;high;latitude;1600;wind-drifted-snow;gliding-snow;1;0;poor;few;small;;low;latitude;1600;wind-drifted-snow;gliding-snow;
;;R2;1;0;fair;few;medium;;;;;gliding-snow;wet-snow;
;;
Vorarlberg;2024-03-31 16:00:00;R1;2;0;poor;some;medium;;high;latitude;1600;wind-drifted-snow;gliding-snow;1;0;poor;few;small;;low;latitude;1600;wind-drifted-snow;gliding-snow;
;;R2;1;0;fair;few;medium;;;;;gliding-snow;wet-snow;
;;
Vorarlberg;2024-04-01 08:52:05;R1;2;0;poor;some;medium;;high;latitude;1600;wind-drifted-snow;gliding-snow;1;0;poor;few;small;;low;latitude;1600;wind-drifted-snow;gliding-snow;
;;R2;1;0;fair;few;medium;;;;;gliding-snow;wet-snow;
;;R3;3;0;very_poor;some;medium;;high;latitude;2200;wind-drifted-snow;gliding-snow;2;0;poor;some;medium;;low;latitude;2200;wind-drifted-snow;gliding-snow;
;;
Vorarlberg;2024-04-02 06:00:00;R1;2;0;poor;some;medium;;high;latitude;1600;wind-drifted-snow;gliding-snow;1;0;poor;few;small;;low;latitude;1600;wind-drifted-snow;gliding-snow;
;;R2;1;0;fair;few;medium;;;;;gliding-snow;;
;;R3;3;0;very_poor;some;medium;;high;latitude;2000;wind-drifted-snow;gliding-snow;2;0;poor;some;medium;;low;latitude;2000;wind-drifted-snow;gliding-snow;
;;
Vorarlberg;2024-04-02 16:00:00;R1;2;0;poor;some;medium;;high;latitude;1600;wind-drifted-snow;gliding-snow;1;0;poor;few;small;;low;latitude;1600;wind-drifted-snow;gliding-snow;
;;R2;1;0;fair;few;medium;;;;;gliding-snow;;
;;
Vorarlberg;2024-04-03 16:00:00;R1;2;0;poor;some;medium;;high;latitude;1600;wind-drifted-snow;gliding-snow;1;0;poor;few;small;;low;latitude;1600;wind-drifted-snow;gliding-snow;
;;R2;2;0;poor;few;medium;;high;latitude;1600;gliding-snow;no-problem;1;0;fair;few;small;;low;latitude;1600;gliding-snow;no-problem;
;;
Vorarlberg;2024-04-04 16:00:00;R1;2;0;poor;some;medium;;high;latitude;2600;wet-snow;wind-drifted-snow;3;0;poor;some;large;;low;latitude;2600;wet-snow;wind-drifted-snow;
;;R2;3;0;poor;some;large;;high;latitude;1600;wet-snow;;1;0;fair;few;small;;low;latitude;1600;wet-snow;;
;;
Vorarlberg;2024-04-05 16:00:00;R1;3;0;very_poor;some;large;;;;;wet-snow;gliding-snow;
;;R2;2;0;poor;some;medium;;high;latitude;1600;wet-snow;gliding-snow;1;0;fair;few;small;;low;latitude;1600;wet-snow;gliding-snow;
;;
Vorarlberg;2024-04-06 05:32:32;R1;3;0;very_poor;some;large;;;;;wet-snow;gliding-snow;
;;R2;2;0;poor;some;medium;;high;latitude;1600;wet-snow;gliding-snow;1;0;fair;few;small;;low;latitude;1600;wet-snow;gliding-snow;
;;
Vorarlberg;2024-04-06 16:00:00;R1;2;0;poor;some;medium;morning;;;;gliding-snow;wet-snow;3;0;poor;some;large;afternoon;;;;wet-snow;gliding-snow;
;;R2;2;0;poor;some;medium;;high;latitude;1500;wet-snow;gliding-snow;1;0;fair;few;small;;low;latitude;1500;wet-snow;gliding-snow;
;;
Vorarlberg;2024-04-07 16:00:00;R1;2;0;poor;some;medium;morning;;;;gliding-snow;wet-snow;3;0;poor;some;large;afternoon;;;;wet-snow;gliding-snow;
;;R2;2;0;poor;some;medium;;high;latitude;1500;wet-snow;gliding-snow;1;0;fair;few;small;;low;latitude;1500;wet-snow;gliding-snow;
;;
Vorarlberg;2024-04-08 16:00:00;R1;2;0;poor;some;medium;morning;;;;gliding-snow;wet-snow;2;0;fair;some;medium;afternoon;;;;wind-drifted-snow;gliding-snow;
;;R2;2;0;poor;few;medium;;high;latitude;1500;wet-snow;wind-drifted-snow;1;0;fair;few;small;;low;latitude;1500;wet-snow;wind-drifted-snow;
;;
Vorarlberg;2024-04-09 16:00:00;R1;2;0;poor;few;medium;;high;latitude;1600;wind-drifted-snow;gliding-snow;1;0;fair;few;small;;low;latitude;1600;wind-drifted-snow;gliding-snow;
;;R2;2;0;poor;few;medium;;high;latitude;1600;gliding-snow;wind-drifted-snow;1;0;fair;few;small;;low;latitude;1600;gliding-snow;wind-drifted-snow;
;;
Vorarlberg;2024-04-10 16:00:00;R1;2;0;poor;some;medium;;high;latitude;1600;wind-drifted-snow;gliding-snow;1;0;fair;few;small;;low;latitude;1600;wind-drifted-snow;gliding-snow;
;;R2;1;0;poor;few;small;;;;;gliding-snow;wet-snow;
;;
Vorarlberg;2024-04-11 16:00:00;R1;2;0;poor;some;medium;morning;;;;wind-drifted-snow;gliding-snow;3;0;poor;some;large;afternoon;;;;gliding-snow;wind-drifted-snow;
;;R2;2;0;poor;some;medium;;;;;wind-drifted-snow;gliding-snow;
;;R3;1;0;fair;few;small;;;;;gliding-snow;wet-snow;
;;
Vorarlberg;2024-04-12 05:14:03;R1;2;0;poor;some;medium;morning;;;;wind-drifted-snow;gliding-snow;3;0;poor;some;large;afternoon;;;;gliding-snow;wind-drifted-snow;
;;R2;2;0;poor;some;medium;;;;;wind-drifted-snow;gliding-snow;
;;R3;1;0;fair;few;small;;;;;gliding-snow;wet-snow;
;;
Vorarlberg;2024-04-12 16:00:00;R1;2;0;poor;some;medium;morning;;;;gliding-snow;no-problem;3;0;poor;some;large;afternoon;;;;wet-snow;gliding-snow;
;;R2;2;0;poor;some;medium;;;;;gliding-snow;wet-snow;
;;R3;1;0;poor;few;small;;;;;gliding-snow;wet-snow;
;;
Vorarlberg;2024-04-13 16:00:00;R1;1;0;fair;few;medium;morning;high;latitude;2500;gliding-snow;no-problem;3;0;very_poor;some;medium;afternoon;high;latitude;2500;wet-snow;gliding-snow;1;0;fair;few;medium;morning;low;latitude;2500;gliding-snow;no-problem;3;0;very_poor;some;medium;afternoon;low;latitude;2500;wet-snow;gliding-snow;
;;R2;1;0;fair;few;medium;morning;high;latitude;2600;gliding-snow;;2;0;very_poor;few;medium;afternoon;high;latitude;1600;wet-snow;gliding-snow;1;0;fair;few;medium;morning;low;latitude;2600;gliding-snow;;2;0;very_poor;few;medium;afternoon;low;latitude;1600;wet-snow;gliding-snow;
;;R3;1;0;poor;few;small;;;;;gliding-snow;wet-snow;
;;
Vorarlberg;2024-04-14 16:00:00;R1;3;0;very_poor;some;large;;high;latitude;2000;gliding-snow;wet-snow;3;0;very_poor;some;medium;;low;latitude;2000;gliding-snow;wet-snow;
;;R2;2;0;very_poor;few;medium;;high;latitude;1600;gliding-snow;wet-snow;1;0;poor;few;small;;low;latitude;1600;gliding-snow;wet-snow;
;;R3;1;0;very_poor;few;small;;;;;gliding-snow;wet-snow;
;;
Vorarlberg;2024-04-15 16:00:00;R1;2;0;very_poor;few;medium;;high;latitude;2000;wind-drifted-snow;gliding-snow;2;0;very_poor;few;medium;;low;latitude;2000;wind-drifted-snow;gliding-snow;
;;R2;2;0;very_poor;few;medium;;high;latitude;1600;wind-drifted-snow;gliding-snow;1;0;poor;few;small;;low;latitude;1600;wind-drifted-snow;gliding-snow;
;;R3;1;0;very_poor;few;small;;;;;wind-drifted-snow;gliding-snow;
;;
Vorarlberg;2024-04-16 16:00:00;R1;2;0;poor;some;medium;;high;latitude;1600;wind-drifted-snow;gliding-snow;1;0;poor;few;small;;low;latitude;1600;wind-drifted-snow;gliding-snow;
;;
Vorarlberg;2024-04-17 16:00:00;R1;3;0;very_poor;some;medium;;high;latitude;2200;wind-drifted-snow;gliding-snow;2;0;poor;some;medium;;low;latitude;2200;wind-drifted-snow;gliding-snow;
;;R2;3;0;poor;many;medium;;high;latitude;2000;new-snow;gliding-snow;2;0;poor;some;small;;low;latitude;2000;new-snow;gliding-snow;
;;R3;2;0;poor;some;medium;;high;latitude;1600;new-snow;gliding-snow;1;0;poor;few;small;;low;latitude;1600;new-snow;gliding-snow;
;;
Vorarlberg;2024-04-18 05:23:12;R1;3;0;very_poor;some;medium;;high;latitude;2000;wind-drifted-snow;gliding-snow;2;0;poor;some;medium;;low;latitude;2000;wind-drifted-snow;gliding-snow;
;;R2;3;0;poor;many;medium;;high;latitude;2000;new-snow;gliding-snow;2;0;poor;some;small;;low;latitude;2000;new-snow;gliding-snow;
;;R3;3;0;poor;many;medium;;high;latitude;1800;new-snow;gliding-snow;2;0;poor;few;medium;;low;latitude;1800;new-snow;gliding-snow;
;;
Vorarlberg;2024-04-18 06:50:06;R1;3;0;very_poor;some;medium;;high;latitude;2000;wind-drifted-snow;gliding-snow;2;0;poor;some;medium;;low;latitude;2000;wind-drifted-snow;gliding-snow;
;;R2;3;0;poor;many;medium;;high;latitude;2000;new-snow;gliding-snow;2;0;poor;some;small;;low;latitude;2000;new-snow;gliding-snow;
;;R3;3;0;poor;many;medium;;high;latitude;1800;new-snow;gliding-snow;2;0;poor;few;medium;;low;latitude;1800;new-snow;gliding-snow;
;;
Vorarlberg;2024-04-18 16:00:00;R1;3;0;poor;many;medium;;high;latitude;2000;wind-drifted-snow;gliding-snow;2;0;poor;some;medium;;low;latitude;2000;wind-drifted-snow;gliding-snow;
;;R2;3;0;poor;many;medium;;high;latitude;2000;new-snow;gliding-snow;2;0;poor;some;small;;low;latitude;2000;new-snow;gliding-snow;
;;R3;2;0;poor;some;medium;;high;latitude;1800;wind-drifted-snow;gliding-snow;2;0;poor;some;medium;;low;latitude;1800;wind-drifted-snow;gliding-snow;
;;
Vorarlberg;2024-04-19 16:00:00;R1;3;0;poor;many;medium;;high;latitude;1800;wind-drifted-snow;new-snow;2;0;poor;some;medium;;low;latitude;1800;wind-drifted-snow;new-snow;
;;R2;2;0;poor;some;medium;;high;latitude;1600;wind-drifted-snow;new-snow;2;0;poor;some;medium;;low;latitude;1600;wind-drifted-snow;new-snow;
;;
Vorarlberg;2024-04-20 16:00:00;R1;3;0;poor;many;medium;;high;latitude;1800;new-snow;wind-drifted-snow;2;0;poor;some;medium;;low;latitude;1800;new-snow;wind-drifted-snow;
;;R2;2;0;poor;some;medium;;high;latitude;1600;new-snow;wind-drifted-snow;2;0;poor;some;medium;;low;latitude;1600;new-snow;wind-drifted-snow;
;;
Vorarlberg;2024-04-21 16:00:00;R1;3;0;poor;many;medium;;high;latitude;2000;new-snow;wind-drifted-snow;2;0;poor;some;medium;;low;latitude;2000;new-snow;wind-drifted-snow;
;;R2;2;0;poor;some;medium;;high;latitude;1600;new-snow;wind-drifted-snow;2;0;fair;some;medium;;low;latitude;1600;new-snow;wind-drifted-snow;
;;
Vorarlberg;2024-04-22 16:00:00;R1;3;0;poor;some;large;;high;latitude;2000;new-snow;gliding-snow;2;0;poor;some;medium;;low;latitude;2000;new-snow;gliding-snow;
;;R2;2;0;poor;some;medium;;high;latitude;1600;new-snow;gliding-snow;2;0;fair;some;medium;;low;latitude;1600;new-snow;gliding-snow;
;;
Vorarlberg;2024-04-23 16:00:00;R1;3;0;poor;some;large;;high;latitude;2000;new-snow;gliding-snow;2;0;poor;some;medium;;low;latitude;2000;new-snow;gliding-snow;
;;R2;2;0;poor;some;medium;;high;latitude;1600;gliding-snow;new-snow;2;0;fair;some;medium;;low;latitude;1600;gliding-snow;new-snow;
;;
Vorarlberg;2024-04-24 16:00:00;R1;3;0;poor;some;large;;high;latitude;2200;new-snow;gliding-snow;2;0;poor;some;medium;;low;latitude;2200;new-snow;gliding-snow;
;;R2;2;0;poor;some;medium;;high;latitude;1600;gliding-snow;new-snow;2;0;fair;some;medium;;low;latitude;1600;gliding-snow;new-snow;
;;
Vorarlberg;2024-04-25 16:00:00;R1;3;0;poor;some;large;;high;latitude;2200;wind-drifted-snow;wet-snow;2;0;poor;some;medium;;low;latitude;2200;wind-drifted-snow;wet-snow;
;;R2;2;0;poor;some;medium;;high;latitude;1800;gliding-snow;wind-drifted-snow;2;0;fair;some;medium;;low;latitude;1800;gliding-snow;wind-drifted-snow;
;;
Vorarlberg;2024-04-26 16:00:00;R1;2;0;poor;few;medium;;high;latitude;2200;persistant-weak-layer;wet-snow;2;0;poor;some;medium;;low;latitude;2200;persistant-weak-layer;wet-snow;
;;R2;2;0;poor;some;medium;;high;latitude;1800;wet-snow;wind-drifted-snow;2;0;fair;some;medium;;low;latitude;1800;wet-snow;wind-drifted-snow;
;;
Vorarlberg;2024-04-27 16:00:00;R1;2;0;poor;few;medium;;high;latitude;2200;persistant-weak-layer;wet-snow;2;0;poor;some;medium;;low;latitude;2200;persistant-weak-layer;wet-snow;
;;R2;2;0;poor;some;medium;;high;latitude;1800;wet-snow;wind-drifted-snow;2;0;fair;some;medium;;low;latitude;1800;wet-snow;wind-drifted-snow;
;;
Vorarlberg;2024-04-28 16:00:00;R1;2;0;poor;few;medium;morning;high;latitude;2400;persistant-weak-layer;gliding-snow;2;0;poor;some;medium;afternoon;high;latitude;2400;wet-snow;persistant-weak-layer;1;0;fair;few;small;morning;low;latitude;2400;persistant-weak-layer;gliding-snow;2;0;fair;some;medium;afternoon;low;latitude;2400;wet-snow;persistant-weak-layer;
;;R2;1;0;fair;few;small;morning;high;latitude;2000;gliding-snow;wind-drifted-snow;2;0;poor;few;medium;afternoon;high;latitude;2000;wet-snow;wind-drifted-snow;1;0;fair;few;small;morning;low;latitude;2000;gliding-snow;wind-drifted-snow;2;0;poor;few;medium;afternoon;low;latitude;2000;wet-snow;wind-drifted-snow;
;;
Vorarlberg;2024-04-29 16:00:00;R1;2;0;poor;few;medium;morning;high;latitude;2600;persistant-weak-layer;gliding-snow;2;0;poor;some;medium;afternoon;high;latitude;2400;wet-snow;persistant-weak-layer;1;0;fair;few;small;morning;low;latitude;2600;persistant-weak-layer;gliding-snow;2;0;fair;some;medium;afternoon;low;latitude;2400;wet-snow;persistant-weak-layer;
;;R2;1;0;fair;few;small;morning;high;latitude;2000;gliding-snow;persistant-weak-layer;2;0;poor;few;medium;afternoon;high;latitude;2000;wet-snow;persistant-weak-layer;1;0;fair;few;small;morning;low;latitude;2000;gliding-snow;persistant-weak-layer;2;0;poor;few;medium;afternoon;low;latitude;2000;wet-snow;persistant-weak-layer;
;;
Vorarlberg;2024-04-30 16:00:00;R1;2;0;poor;few;medium;morning;high;latitude;2600;persistant-weak-layer;gliding-snow;2;0;poor;some;medium;afternoon;high;latitude;2400;wet-snow;persistant-weak-layer;1;0;fair;few;small;morning;low;latitude;2600;persistant-weak-layer;gliding-snow;2;0;fair;some;medium;afternoon;low;latitude;2400;wet-snow;persistant-weak-layer;
;;R2;1;0;fair;few;small;morning;high;latitude;2000;gliding-snow;persistant-weak-layer;2;0;poor;few;medium;afternoon;high;latitude;2000;wet-snow;persistant-weak-layer;1;0;fair;few;small;morning;low;latitude;2000;gliding-snow;persistant-weak-layer;2;0;poor;few;medium;afternoon;low;latitude;2000;wet-snow;persistant-weak-layer;
;;