[
  {
    "valid_regions": [
      "AT-05-21",
      "AT-05-14",
      "AT-05-15",
      "AT-05-13",
      "AT-05-12",
      "AT-05-08",
      "AT-05-01"
    ],
    "danger_main": [
      {
        "main_value": 1,
        "valid_elevation": null
      }
    ],
    "dangerpattern": [],
    "problem_list": [
      {
        "problem_type": "wet snow",
        "aspect": [
          "E",
          "SE",
          "S",
          "SW",
          "W"
        ],
        "valid_elevation": null
      }
    ],
    "report_texts": null,
    "report_id": "RID944RGR1",
    "rep_date": "2021-04-25T16:00:00+00:00",
    "validity_begin": "2021-04-25T22:00:00+00:00",
    "validity_end": "2021-04-26T11:00:00+00:00"
  },
  {
    "valid_regions": [
      "AT-05-21",
      "AT-05-14",
      "AT-05-15",
      "AT-05-13",
      "AT-05-12",
      "AT-05-08",
      "AT-05-01"
    ],
    "danger_main": [
      {
        "main_value": 2,
        "valid_elevation": null
      }
    ],
    "dangerpattern": [],
    "problem_list": [
      {
        "problem_type": "wet snow",
        "aspect": [
          "E",
          "SE",
          "S",
          "SW",
          "W"
        ],
        "valid_elevation": null
      }
    ],
    "report_texts": null,
    "report_id": "RID944RGR1_PM",
    "rep_date": "2021-04-25T16:00:00+00:00",
    "validity_begin": "2021-04-26T10:00:00+00:00",
    "validity_end": "2021-04-26T23:00:00+00:00",
    "predecessor_id": "RID944RGR1"
  },
  {
    "valid_regions": [
      "AT-05-17",
      "AT-05-18",
      "AT-05-16",
      "AT-05-04",
      "AT-05-02",
      "AT-05-03",
      "AT-05-09",
      "AT-05-10",
      "AT-05-11",
      "AT-05-07",
      "AT-05-06",
      "AT-05-05"
    ],
    "danger_main": [
      {
        "main_value": 1,
        "valid_elevation": ">2200"
      },
      {
        "main_value": 1,
        "valid_elevation": "<2200"
      }
    ],
    "dangerpattern": [],
    "problem_list": [
      {
        "problem_type": "wet snow",
        "aspect": [
          "E",
          "SE",
          "S",
          "SW",
          "W"
        ],
        "valid_elevation": null
      },
      {
        "problem_type": "old snow",
        "aspect": [
          "N",
          "NE",
          "E",
          "NW"
        ],
        "valid_elevation": null
      }
    ],
    "report_texts": null,
    "report_id": "RID944RGR2",
    "rep_date": "2021-04-25T16:00:00+00:00",
    "validity_begin": "2021-04-25T22:00:00+00:00",
    "validity_end": "2021-04-26T11:00:00+00:00"
  },
  {
    "valid_regions": [
      "AT-05-17",
      "AT-05-18",
      "AT-05-16",
      "AT-05-04",
      "AT-05-02",
      "AT-05-03",
      "AT-05-09",
      "AT-05-10",
      "AT-05-11",
      "AT-05-07",
      "AT-05-06",
      "AT-05-05"
    ],
    "danger_main": [
      {
        "main_value": 1,
        "valid_elevation": ">2200"
      },
      {
        "main_value": 2,
        "valid_elevation": "<2200"
      }
    ],
    "dangerpattern": [],
    "problem_list": [
      {
        "problem_type": "wet snow",
        "aspect": [
          "E",
          "SE",
          "S",
          "SW",
          "W"
        ],
        "valid_elevation": null
      },
      {
        "problem_type": "old snow",
        "aspect": [
          "N",
          "NE",
          "E",
          "NW"
        ],
        "valid_elevation": null
      }
    ],
    "report_texts": null,
    "report_id": "RID944RGR2_PM",
    "rep_date": "2021-04-25T16:00:00+00:00",
    "validity_begin": "2021-04-26T10:00:00+00:00",
    "validity_end": "2021-04-26T23:00:00+00:00",
    "predecessor_id": "RID944RGR2"
  }
]