[
  {
    "valid_regions": [
      "AT-04-05",
      "AT-04-02",
      "AT-04-03",
      "AT-04-01",
      "AT-04-06",
      "AT-04-07",
      "AT-04-08",
      "AT-04-04"
    ],
    "danger_main": [
      {
        "main_value": 2,
        "valid_elevation": ">Treeline"
      },
      {
        "main_value": 1,
        "valid_elevation": "<Treeline"
      }
    ],
    "dangerpattern": [],
    "problem_list": [
      {
        "problem_type": "old snow",
        "aspect": [
          "N",
          "NE",
          "E",
          "W",
          "NW"
        ],
        "valid_elevation": null
      }
    ],
    "report_texts": null,
    "report_id": "RID356RGR1",
    "rep_date": "2021-02-07T17:00:00+00:00",
    "validity_begin": "2021-02-07T23:00:00+00:00",
    "validity_end": "2021-02-08T23:00:00+00:00"
  },
  {
    "valid_regions": [
      "AT-04-09"
    ],
    "danger_main": [
      {
        "main_value": 1,
        "valid_elevation": null
      }
    ],
    "dangerpattern": [],
    "problem_list": [
      {
        "problem_type": "favourable situation",
        "aspect": [],
        "valid_elevation": null
      }
    ],
    "report_texts": null,
    "report_id": "RID356RGR2",
    "rep_date": "2021-02-07T17:00:00+00:00",
    "validity_begin": "2021-02-07T23:00:00+00:00",
    "validity_end": "2021-02-08T23:00:00+00:00"
  }
]