[
  {
    "valid_regions": [
      "AT-04-01",
      "AT-04-03"
    ],
    "danger_main": [
      {
        "main_value": 4,
        "valid_elevation": ">2200"
      },
      {
        "main_value": 3,
        "valid_elevation": "<2200"
      }
    ],
    "dangerpattern": [],
    "problem_list": [
      {
        "problem_type": "drifting snow",
        "aspect": [
          "N",
          "NE",
          "E",
          "SE",
          "S",
          "SW",
          "W",
          "NW"
        ],
        "valid_elevation": null
      },
      {
        "problem_type": "old snow",
        "aspect": [
          "N",
          "NE",
          "E",
          "W",
          "NW"
        ],
        "valid_elevation": null
      }
    ],
    "report_texts": null,
    "report_id": "RID220RGR1",
    "rep_date": "2021-01-19T17:00:00+00:00",
    "validity_begin": "2021-01-19T23:00:00+00:00",
    "validity_end": "2021-01-20T23:00:00+00:00"
  },
  {
    "valid_regions": [
      "AT-04-02",
      "AT-04-04"
    ],
    "danger_main": [
      {
        "main_value": 3,
        "valid_elevation": null
      }
    ],
    "dangerpattern": [],
    "problem_list": [
      {
        "problem_type": "drifting snow",
        "aspect": [
          "N",
          "NE",
          "E",
          "SE",
          "S",
          "SW",
          "W",
          "NW"
        ],
        "valid_elevation": null
      },
      {
        "problem_type": "old snow",
        "aspect": [
          "N",
          "NE",
          "E",
          "W",
          "NW"
        ],
        "valid_elevation": null
      }
    ],
    "report_texts": null,
    "report_id": "RID220RGR2",
    "rep_date": "2021-01-19T17:00:00+00:00",
    "validity_begin": "2021-01-19T23:00:00+00:00",
    "validity_end": "2021-01-20T23:00:00+00:00"
  },
  {
    "valid_regions": [
      "AT-04-06",
      "AT-04-07",
      "AT-04-08",
      "AT-04-09",
      "AT-04-05"
    ],
    "danger_main": [
      {
        "main_value": 3,
        "valid_elevation": ">1200"
      },
      {
        "main_value": 2,
        "valid_elevation": "<1200"
      }
    ],
    "dangerpattern": [],
    "problem_list": [
      {
        "problem_type": "drifting snow",
        "aspect": [
          "N",
          "NE",
          "E",
          "SE",
          "S",
          "SW",
          "W",
          "NW"
        ],
        "valid_elevation": null
      },
      {
        "problem_type": "old snow",
        "aspect": [
          "N",
          "NE",
          "E",
          "W",
          "NW"
        ],
        "valid_elevation": null
      }
    ],
    "report_texts": null,
    "report_id": "RID220RGR3",
    "rep_date": "2021-01-19T17:00:00+00:00",
    "validity_begin": "2021-01-19T23:00:00+00:00",
    "validity_end": "2021-01-20T23:00:00+00:00"
  }
]