[
  {
    "valid_regions": [
      "AT-04-01"
    ],
    "danger_main": [
      {
        "main_value": 3,
        "valid_elevation": ">2200"
      },
      {
        "main_value": 1,
        "valid_elevation": "<2200"
      }
    ],
    "dangerpattern": [],
    "problem_list": [
      {
        "problem_type": "drifting snow",
        "aspect": [
          "N",
          "NE",
          "E",
          "NW"
        ],
        "valid_elevation": null
      }
    ],
    "report_texts": null,
    "report_id": "RID134RGR1",
    "rep_date": "2021-01-02T17:00:00+00:00",
    "validity_begin": "2021-01-02T23:00:00+00:00",
    "validity_end": "2021-01-03T23:00:00+00:00"
  },
  {
    "valid_regions": [
      "AT-04-02",
      "AT-04-03",
      "AT-04-05",
      "AT-04-06",
      "AT-04-07",
      "AT-04-08",
      "AT-04-04"
    ],
    "danger_main": [
      {
        "main_value": 2,
        "valid_elevation": ">1800"
      },
      {
        "main_value": 1,
        "valid_elevation": "<1800"
      }
    ],
    "dangerpattern": [],
    "problem_list": [
      {
        "problem_type": "drifting snow",
        "aspect": [
          "N",
          "NE",
          "NW"
        ],
        "valid_elevation": null
      }
    ],
    "report_texts": null,
    "report_id": "RID134RGR2",
    "rep_date": "2021-01-02T17:00:00+00:00",
    "validity_begin": "2021-01-02T23:00:00+00:00",
    "validity_end": "2021-01-03T23:00:00+00:00"
  },
  {
    "valid_regions": [
      "AT-04-09"
    ],
    "danger_main": [
      {
        "main_value": 1,
        "valid_elevation": null
      }
    ],
    "dangerpattern": [],
    "problem_list": [
      {
        "problem_type": "drifting snow",
        "aspect": [
          "N",
          "NE",
          "NW"
        ],
        "valid_elevation": null
      }
    ],
    "report_texts": null,
    "report_id": "RID134RGR3",
    "rep_date": "2021-01-02T17:00:00+00:00",
    "validity_begin": "2021-01-02T23:00:00+00:00",
    "validity_end": "2021-01-03T23:00:00+00:00"
  }
]