[
  {
    "valid_regions": [
      "AT-06-02",
      "AT-06-01",
      "AT-06-03",
      "AT-06-06",
      "AT-06-09",
      "AT-06-10",
      "AT-06-11",
      "AT-06-05",
      "AT-06-04",
      "AT-06-08",
      "AT-06-07"
    ],
    "danger_main": [
      {
        "main_value": 2,
        "valid_elevation": ">1900"
      },
      {
        "main_value": 1,
        "valid_elevation": "<1900"
      }
    ],
    "dangerpattern": [],
    "problem_list": [
      {
        "problem_type": "drifting snow",
        "aspect": [
          "N",
          "NE",
          "E",
          "SE",
          "S"
        ],
        "valid_elevation": null
      }
    ],
    "report_texts": null,
    "report_id": "RID588RGR1",
    "rep_date": "2021-03-10T17:00:00+00:00",
    "validity_begin": "2021-03-10T23:00:00+00:00",
    "validity_end": "2021-03-11T23:00:00+00:00"
  },
  {
    "valid_regions": [
      "AT-06-18",
      "AT-06-17",
      "AT-06-15",
      "AT-06-14",
      "AT-06-13",
      "AT-06-12",
      "AT-06-16"
    ],
    "danger_main": [
      {
        "main_value": 1,
        "valid_elevation": null
      }
    ],
    "dangerpattern": [],
    "problem_list": [
      {
        "problem_type": "drifting snow",
        "aspect": [
          "N",
          "NE",
          "E",
          "SE",
          "S"
        ],
        "valid_elevation": null
      }
    ],
    "report_texts": null,
    "report_id": "RID588RGR2",
    "rep_date": "2021-03-10T17:00:00+00:00",
    "validity_begin": "2021-03-10T23:00:00+00:00",
    "validity_end": "2021-03-11T23:00:00+00:00"
  }
]