[
  {
    "valid_regions": [
      "AT-06-04",
      "AT-06-18",
      "AT-06-17"
    ],
    "danger_main": [
      {
        "main_value": 3,
        "valid_elevation": null
      },
      {
        "main_value": 2,
        "valid_elevation": null
      }
    ],
    "dangerpattern": [],
    "problem_list": [
      {
        "problem_type": "drifting snow",
        "aspect": [
          "N",
          "NE",
          "NW"
        ],
        "valid_elevation": null
      },
      {
        "problem_type": "gliding snow",
        "aspect": [
          "N",
          "NE",
          "E",
          "SE",
          "S",
          "SW",
          "W",
          "NW"
        ],
        "valid_elevation": null
      }
    ],
    "report_texts": null,
    "report_id": "RID25RGR1",
    "rep_date": "2020-12-08T17:00:00+00:00",
    "validity_begin": "2020-12-08T23:00:00+00:00",
    "validity_end": "2020-12-09T23:00:00+00:00"
  },
  {
    "valid_regions": [
      "AT-06-05",
      "AT-06-07",
      "AT-06-08",
      "AT-06-15",
      "AT-06-16",
      "AT-06-14",
      "AT-06-13",
      "AT-06-06"
    ],
    "danger_main": [
      {
        "main_value": 2,
        "valid_elevation": null
      },
      {
        "main_value": 1,
        "valid_elevation": null
      }
    ],
    "dangerpattern": [],
    "problem_list": [
      {
        "problem_type": "drifting snow",
        "aspect": [
          "N",
          "NE",
          "NW"
        ],
        "valid_elevation": null
      }
    ],
    "report_texts": null,
    "report_id": "RID25RGR2",
    "rep_date": "2020-12-08T17:00:00+00:00",
    "validity_begin": "2020-12-08T23:00:00+00:00",
    "validity_end": "2020-12-09T23:00:00+00:00"
  }
]