[
  {
    "valid_regions": [
      "AT-03-01",
      "AT-03-06",
      "AT-03-04",
      "AT-03-05"
    ],
    "danger_main": [
      {
        "main_value": 1,
        "valid_elevation": null
      }
    ],
    "dangerpattern": [],
    "problem_list": [
      {
        "problem_type": "favourable situation",
        "aspect": [],
        "valid_elevation": null
      }
    ],
    "report_texts": null,
    "report_id": "RID533RGR1",
    "rep_date": "2021-03-03T17:00:00+00:00",
    "validity_begin": "2021-03-03T23:00:00+00:00",
    "validity_end": "2021-03-04T23:00:00+00:00"
  }
]