[
  {
    "valid_regions": [
      "AT-03-01",
      "AT-03-02",
      "AT-03-04",
      "AT-03-06",
      "AT-03-05"
    ],
    "danger_main": [
      {
        "main_value": 1,
        "valid_elevation": null
      }
    ],
    "dangerpattern": [],
    "problem_list": [
      {
        "problem_type": "wet snow",
        "aspect": [
          "E",
          "SE",
          "S",
          "SW",
          "W"
        ],
        "valid_elevation": null
      },
      {
        "problem_type": "old snow",
        "aspect": [
          "N",
          "NE",
          "NW"
        ],
        "valid_elevation": null
      }
    ],
    "report_texts": null,
    "report_id": "RID344RGR1",
    "rep_date": "2021-02-05T17:00:00+00:00",
    "validity_begin": "2021-02-05T23:00:00+00:00",
    "validity_end": "2021-02-06T23:00:00+00:00"
  }
]