[
  {
    "valid_regions": [
      "AT-05-18",
      "AT-05-14",
      "AT-05-13",
      "AT-05-17",
      "AT-05-08",
      "AT-05-09"
    ],
    "danger_main": [
      {
        "main_value": 1,
        "valid_elevation": null
      }
    ],
    "dangerpattern": [],
    "problem_list": [
      {
        "problem_type": "old snow",
        "aspect": [
          "N",
          "NE",
          "NW"
        ],
        "valid_elevation": null
      }
    ],
    "report_texts": null,
    "report_id": "RID71RGR1",
    "rep_date": "2020-12-20T17:00:00+00:00",
    "validity_begin": "2020-12-20T23:00:00+00:00",
    "validity_end": "2020-12-21T23:00:00+00:00"
  },
  {
    "valid_regions": [
      "AT-05-07",
      "AT-05-06",
      "AT-05-05",
      "AT-05-03"
    ],
    "danger_main": [
      {
        "main_value": 1,
        "valid_elevation": null
      }
    ],
    "dangerpattern": [],
    "problem_list": [
      {
        "problem_type": "old snow",
        "aspect": [
          "N",
          "NE",
          "NW"
        ],
        "valid_elevation": null
      },
      {
        "problem_type": "gliding snow",
        "aspect": [
          "E",
          "SE",
          "S",
          "SW",
          "W"
        ],
        "valid_elevation": null
      }
    ],
    "report_texts": null,
    "report_id": "RID71RGR2",
    "rep_date": "2020-12-20T17:00:00+00:00",
    "validity_begin": "2020-12-20T23:00:00+00:00",
    "validity_end": "2020-12-21T23:00:00+00:00"
  },
  {
    "valid_regions": [
      "AT-05-15",
      "AT-05-11",
      "AT-05-10",
      "AT-05-04",
      "AT-05-02",
      "AT-05-01"
    ],
    "danger_main": [
      {
        "main_value": 1,
        "valid_elevation": null
      }
    ],
    "dangerpattern": [],
    "problem_list": [
      {
        "problem_type": "old snow",
        "aspect": [
          "N",
          "NE",
          "NW"
        ],
        "valid_elevation": null
      },
      {
        "problem_type": "gliding snow",
        "aspect": [
          "E",
          "SE",
          "S",
          "SW",
          "W"
        ],
        "valid_elevation": null
      }
    ],
    "report_texts": null,
    "report_id": "RID71RGR3",
    "rep_date": "2020-12-20T17:00:00+00:00",
    "validity_begin": "2020-12-20T23:00:00+00:00",
    "validity_end": "2020-12-21T23:00:00+00:00"
  }
]