[
  {
    "valid_regions": [
      "AT-03-01",
      "AT-03-06",
      "AT-03-04"
    ],
    "danger_main": [
      {
        "main_value": 3,
        "valid_elevation": null
      }
    ],
    "dangerpattern": [],
    "problem_list": [
      {
        "problem_type": "drifting snow",
        "aspect": [
          "N",
          "NE",
          "E",
          "SE",
          "S"
        ],
        "valid_elevation": null
      },
      {
        "problem_type": "old snow",
        "aspect": [
          "N",
          "NE",
          "E",
          "NW"
        ],
        "valid_elevation": null
      }
    ],
    "report_texts": null,
    "report_id": "RID202RGR1",
    "rep_date": "2021-01-15T17:16:38+00:00",
    "validity_begin": "2021-01-15T17:16:38+00:00",
    "validity_end": "2021-01-16T18:00:00+00:00"
  },
  {
    "valid_regions": [
      "AT-03-02",
      "AT-03-03",
      "AT-03-05"
    ],
    "danger_main": [
      {
        "main_value": 2,
        "valid_elevation": null
      }
    ],
    "dangerpattern": [],
    "problem_list": [
      {
        "problem_type": "drifting snow",
        "aspect": [
          "N",
          "NE",
          "E",
          "SE",
          "S"
        ],
        "valid_elevation": null
      },
      {
        "problem_type": "old snow",
        "aspect": [
          "N",
          "NE",
          "E",
          "NW"
        ],
        "valid_elevation": null
      }
    ],
    "report_texts": null,
    "report_id": "RID202RGR2",
    "rep_date": "2021-01-15T17:16:38+00:00",
    "validity_begin": "2021-01-15T17:16:38+00:00",
    "validity_end": "2021-01-16T18:00:00+00:00"
  }
]