[
  {
    "valid_regions": [
      "AT-02-01",
      "AT-02-03"
    ],
    "danger_main": [
      {
        "main_value": 2,
        "valid_elevation": null
      }
    ],
    "dangerpattern": [],
    "problem_list": [
      {
        "problem_type": "drifting snow",
        "aspect": [
          "NE",
          "E",
          "SE",
          "S",
          "SW",
          "W"
        ],
        "valid_elevation": null
      }
    ],
    "report_texts": null,
    "report_id": "RID686RGR1",
    "rep_date": "2021-03-24T17:00:00+00:00",
    "validity_begin": "2021-03-24T23:00:00+00:00",
    "validity_end": "2021-03-25T23:00:00+00:00"
  },
  {
    "valid_regions": [
      "AT-02-09",
      "AT-02-02",
      "AT-02-10",
      "AT-02-12",
      "AT-02-13",
      "AT-02-04",
      "AT-02-14",
      "AT-02-11",
      "AT-02-15",
      "AT-02-16",
      "AT-02-17",
      "AT-02-19",
      "AT-02-18"
    ],
    "danger_main": [
      {
        "main_value": 2,
        "valid_elevation": ">2000"
      },
      {
        "main_value": 1,
        "valid_elevation": "<2000"
      }
    ],
    "dangerpattern": [],
    "problem_list": [
      {
        "problem_type": "drifting snow",
        "aspect": [
          "N",
          "NE",
          "E",
          "SE",
          "S",
          "SW"
        ],
        "valid_elevation": null
      }
    ],
    "report_texts": null,
    "report_id": "RID686RGR2",
    "rep_date": "2021-03-24T17:00:00+00:00",
    "validity_begin": "2021-03-24T23:00:00+00:00",
    "validity_end": "2021-03-25T23:00:00+00:00"
  },
  {
    "valid_regions": [
      "AT-02-06",
      "AT-02-05",
      "AT-02-07",
      "AT-02-08"
    ],
    "danger_main": [
      {
        "main_value": 2,
        "valid_elevation": ">1800"
      },
      {
        "main_value": 1,
        "valid_elevation": "<1800"
      }
    ],
    "dangerpattern": [],
    "problem_list": [
      {
        "problem_type": "drifting snow",
        "aspect": [
          "E",
          "SE",
          "S",
          "SW"
        ],
        "valid_elevation": null
      }
    ],
    "report_texts": null,
    "report_id": "RID686RGR3",
    "rep_date": "2021-03-24T17:00:00+00:00",
    "validity_begin": "2021-03-24T23:00:00+00:00",
    "validity_end": "2021-03-25T23:00:00+00:00"
  }
]