Date,Daytime,Subregion,DangerRatingAbove,DangerRatingBelow,DangerRatingElevation
01.12.2017,AM,BYALL,3,2,
01.12.2017,AM,BYAMM,2,2,nan
01.12.2017,AM,BYWFK,3,2,
01.12.2017,AM,BYBVA,2,2,nan
01.12.2017,AM,BYCHG,2,2,nan
01.12.2017,AM,BYBGD,3,2,
02.12.2017,AM,BYALL,2,1,
02.12.2017,AM,BYAMM,2,1,
02.12.2017,AM,BYWFK,2,1,
02.12.2017,AM,BYBVA,2,1,
02.12.2017,AM,BYCHG,2,1,
02.12.2017,AM,BYBGD,2,1,
03.12.2017,AM,BYALL,2,1,
03.12.2017,AM,BYAMM,2,1,
03.12.2017,AM,BYWFK,2,1,
03.12.2017,AM,BYBVA,2,1,
03.12.2017,AM,BYCHG,2,1,
03.12.2017,AM,BYBGD,2,1,
04.12.2017,AM,BYALL,2,1,
04.12.2017,AM,BYAMM,2,1,
04.12.2017,AM,BYWFK,2,1,
04.12.2017,AM,BYBVA,2,1,
04.12.2017,AM,BYCHG,2,1,
04.12.2017,AM,BYBGD,2,1,
04.12.2017,PM,BYALL,3,1,
04.12.2017,PM,BYAMM,3,1,
04.12.2017,PM,BYWFK,3,1,
04.12.2017,PM,BYBVA,3,1,
04.12.2017,PM,BYCHG,3,1,
04.12.2017,PM,BYBGD,3,1,
05.12.2017,AM,BYALL,3,2,
05.12.2017,AM,BYAMM,2,2,nan
05.12.2017,AM,BYWFK,3,2,
05.12.2017,AM,BYBVA,3,2,
05.12.2017,AM,BYCHG,3,2,
05.12.2017,AM,BYBGD,3,2,
06.12.2017,AM,BYALL,3,2,
06.12.2017,AM,BYAMM,2,2,nan
06.12.2017,AM,BYWFK,3,2,
06.12.2017,AM,BYBVA,3,2,
06.12.2017,AM,BYCHG,3,2,
06.12.2017,AM,BYBGD,3,2,
07.12.2017,AM,BYALL,2,1,
07.12.2017,AM,BYAMM,2,1,
07.12.2017,AM,BYWFK,2,1,
07.12.2017,AM,BYBVA,2,1,
07.12.2017,AM,BYCHG,3,2,
07.12.2017,AM,BYBGD,3,2,
08.12.2017,AM,BYALL,2,1,
08.12.2017,AM,BYAMM,2,1,
08.12.2017,AM,BYWFK,2,1,
08.12.2017,AM,BYBVA,2,1,
08.12.2017,AM,BYCHG,2,1,
08.12.2017,AM,BYBGD,2,1,
09.12.2017,AM,BYALL,3,2,
09.12.2017,AM,BYAMM,2,1,
09.12.2017,AM,BYWFK,2,1,
09.12.2017,AM,BYBVA,2,1,
09.12.2017,AM,BYCHG,2,1,
09.12.2017,AM,BYBGD,2,1,
10.12.2017,AM,BYALL,3,2,
10.12.2017,AM,BYAMM,3,1,
10.12.2017,AM,BYWFK,3,1,
10.12.2017,AM,BYBVA,3,1,
10.12.2017,AM,BYCHG,3,1,
10.12.2017,AM,BYBGD,3,2,
11.12.2017,AM,BYALL,3,2,
11.12.2017,AM,BYAMM,3,2,
11.12.2017,AM,BYWFK,3,2,
11.12.2017,AM,BYBVA,3,2,
11.12.2017,AM,BYCHG,3,2,
11.12.2017,AM,BYBGD,3,2,
12.12.2017,AM,BYALL,3,2,
12.12.2017,AM,BYAMM,3,2,
12.12.2017,AM,BYWFK,2,2,nan
12.12.2017,AM,BYBVA,2,1,
12.12.2017,AM,BYCHG,2,1,
12.12.2017,AM,BYBGD,2,1,
13.12.2017,AM,BYALL,2,2,nan
13.12.2017,AM,BYAMM,2,1,
13.12.2017,AM,BYWFK,2,1,
13.12.2017,AM,BYBVA,2,1,
13.12.2017,AM,BYCHG,2,1,
13.12.2017,AM,BYBGD,2,1,
14.12.2017,AM,BYALL,3,2,
14.12.2017,AM,BYAMM,3,2,
14.12.2017,AM,BYWFK,3,2,
14.12.2017,AM,BYBVA,3,2,
14.12.2017,AM,BYCHG,3,2,
14.12.2017,AM,BYBGD,3,2,
15.12.2017,AM,BYALL,3,3,nan
15.12.2017,AM,BYAMM,3,2,
15.12.2017,AM,BYWFK,3,2,
15.12.2017,AM,BYBVA,3,2,
15.12.2017,AM,BYCHG,3,2,
15.12.2017,AM,BYBGD,3,2,
16.12.2017,AM,BYALL,3,2,
16.12.2017,AM,BYAMM,2,2,nan
16.12.2017,AM,BYWFK,2,1,
16.12.2017,AM,BYBVA,2,1,
16.12.2017,AM,BYCHG,2,1,
16.12.2017,AM,BYBGD,2,1,
17.12.2017,AM,BYALL,3,2,
17.12.2017,AM,BYAMM,2,2,nan
17.12.2017,AM,BYWFK,3,2,
17.12.2017,AM,BYBVA,2,2,nan
17.12.2017,AM,BYCHG,2,2,nan
17.12.2017,AM,BYBGD,3,2,
18.12.2017,AM,BYALL,3,3,nan
18.12.2017,AM,BYAMM,3,2,
18.12.2017,AM,BYWFK,3,2,
18.12.2017,AM,BYBVA,3,2,
18.12.2017,AM,BYCHG,3,2,
18.12.2017,AM,BYBGD,3,2,
19.12.2017,AM,BYALL,3,2,
19.12.2017,AM,BYAMM,2,2,nan
19.12.2017,AM,BYWFK,2,2,nan
19.12.2017,AM,BYBVA,2,1,
19.12.2017,AM,BYCHG,2,1,
19.12.2017,AM,BYBGD,2,1,
20.12.2017,AM,BYALL,2,2,nan
20.12.2017,AM,BYAMM,2,1,
20.12.2017,AM,BYWFK,2,1,
20.12.2017,AM,BYBVA,2,1,
20.12.2017,AM,BYCHG,2,1,
20.12.2017,AM,BYBGD,2,1,
21.12.2017,AM,BYALL,2,2,nan
21.12.2017,AM,BYAMM,2,1,
21.12.2017,AM,BYWFK,2,1,
21.12.2017,AM,BYBVA,2,1,
21.12.2017,AM,BYCHG,2,1,
21.12.2017,AM,BYBGD,2,1,
22.12.2017,AM,BYALL,2,3,
22.12.2017,AM,BYAMM,2,3,
22.12.2017,AM,BYWFK,2,3,
22.12.2017,AM,BYBVA,2,3,
22.12.2017,AM,BYCHG,2,3,
22.12.2017,AM,BYBGD,2,3,
23.12.2017,AM,BYALL,2,2,
23.12.2017,AM,BYAMM,2,2,
23.12.2017,AM,BYWFK,2,2,
23.12.2017,AM,BYBVA,2,2,
23.12.2017,AM,BYCHG,2,2,
23.12.2017,AM,BYBGD,2,2,
24.12.2017,AM,BYALL,2,2,
24.12.2017,AM,BYAMM,2,2,
24.12.2017,AM,BYWFK,2,2,
24.12.2017,AM,BYBVA,2,2,
24.12.2017,AM,BYCHG,2,2,
24.12.2017,AM,BYBGD,2,2,
25.12.2017,AM,BYALL,2,2,
25.12.2017,AM,BYAMM,2,2,
25.12.2017,AM,BYWFK,2,2,
25.12.2017,AM,BYBVA,2,2,
25.12.2017,AM,BYCHG,2,2,
25.12.2017,AM,BYBGD,2,2,
26.12.2017,AM,BYALL,2,2,
26.12.2017,AM,BYAMM,2,2,
26.12.2017,AM,BYWFK,2,2,
26.12.2017,AM,BYBVA,2,2,
26.12.2017,AM,BYCHG,2,2,
26.12.2017,AM,BYBGD,2,2,
27.12.2017,AM,BYALL,1,1,
27.12.2017,AM,BYAMM,1,1,
27.12.2017,AM,BYWFK,1,1,
27.12.2017,AM,BYBVA,1,1,
27.12.2017,AM,BYCHG,1,1,
27.12.2017,AM,BYBGD,1,1,
28.12.2017,AM,BYALL,3,2,
28.12.2017,AM,BYAMM,3,2,
28.12.2017,AM,BYWFK,3,2,
28.12.2017,AM,BYBVA,3,2,
28.12.2017,AM,BYCHG,3,2,
28.12.2017,AM,BYBGD,3,2,
29.12.2017,AM,BYALL,3,3,
29.12.2017,AM,BYAMM,3,3,
29.12.2017,AM,BYWFK,3,3,
29.12.2017,AM,BYBVA,3,3,
29.12.2017,AM,BYCHG,3,3,
29.12.2017,AM,BYBGD,3,3,
30.12.2017,AM,BYALL,3,2,
30.12.2017,AM,BYAMM,3,2,
30.12.2017,AM,BYWFK,3,2,
30.12.2017,AM,BYBVA,3,2,
30.12.2017,AM,BYCHG,3,2,
30.12.2017,AM,BYBGD,3,2,
30.12.2017,PM,BYALL,3,3,nan
30.12.2017,PM,BYAMM,3,3,nan
31.12.2017,AM,BYALL,3,3,
31.12.2017,AM,BYAMM,3,3,
31.12.2017,AM,BYWFK,3,3,
31.12.2017,AM,BYBVA,3,3,
31.12.2017,AM,BYCHG,3,3,
31.12.2017,AM,BYBGD,3,3,
01.01.2018,AM,BYALL,3,2,
01.01.2018,AM,BYAMM,2,2,nan
01.01.2018,AM,BYWFK,3,2,
01.01.2018,AM,BYBVA,2,2,nan
01.01.2018,AM,BYCHG,2,2,nan
01.01.2018,AM,BYBGD,2,2,nan
02.01.2018,AM,BYALL,2,1,
02.01.2018,AM,BYAMM,2,1,
02.01.2018,AM,BYWFK,2,1,
02.01.2018,AM,BYBVA,2,1,
02.01.2018,AM,BYCHG,2,1,
02.01.2018,AM,BYBGD,2,1,
03.01.2018,AM,BYALL,2,2,nan
03.01.2018,AM,BYAMM,2,2,nan
03.01.2018,AM,BYWFK,2,2,nan
03.01.2018,AM,BYBVA,2,2,nan
03.01.2018,AM,BYCHG,2,2,nan
03.01.2018,AM,BYBGD,2,2,nan
03.01.2018,PM,BYALL,3,2,
03.01.2018,PM,BYAMM,3,2,
03.01.2018,PM,BYWFK,3,2,
03.01.2018,PM,BYBVA,3,2,
03.01.2018,PM,BYCHG,3,2,
03.01.2018,PM,BYBGD,3,2,
04.01.2018,AM,BYALL,3,3,nan
04.01.2018,AM,BYAMM,3,3,nan
04.01.2018,AM,BYWFK,3,2,
04.01.2018,AM,BYBVA,3,2,
04.01.2018,AM,BYCHG,3,2,
04.01.2018,AM,BYBGD,3,2,
04.01.2018,PM,BYWFK,3,3,nan
04.01.2018,PM,BYBVA,3,3,nan
04.01.2018,PM,BYCHG,3,3,nan
04.01.2018,PM,BYBGD,3,3,nan
05.01.2018,AM,BYALL,3,3,
05.01.2018,AM,BYAMM,3,3,
05.01.2018,AM,BYWFK,3,3,
05.01.2018,AM,BYBVA,3,3,
05.01.2018,AM,BYCHG,3,3,
05.01.2018,AM,BYBGD,3,3,
06.01.2018,AM,BYALL,3,2,
06.01.2018,AM,BYAMM,2,2,nan
06.01.2018,AM,BYWFK,3,2,
06.01.2018,AM,BYBVA,2,2,nan
06.01.2018,AM,BYCHG,2,2,nan
06.01.2018,AM,BYBGD,3,2,
07.01.2018,AM,BYALL,2,2,
07.01.2018,AM,BYAMM,2,2,
07.01.2018,AM,BYWFK,2,2,
07.01.2018,AM,BYBVA,2,2,
07.01.2018,AM,BYCHG,2,2,
07.01.2018,AM,BYBGD,2,2,
08.01.2018,AM,BYALL,2,2,
08.01.2018,AM,BYAMM,2,2,
08.01.2018,AM,BYWFK,2,2,
08.01.2018,AM,BYBVA,2,2,
08.01.2018,AM,BYCHG,2,2,
08.01.2018,AM,BYBGD,2,2,
09.01.2018,AM,BYALL,1,1,nan
09.01.2018,AM,BYAMM,1,1,nan
09.01.2018,AM,BYWFK,1,1,nan
09.01.2018,AM,BYBVA,1,1,nan
09.01.2018,AM,BYCHG,1,1,nan
09.01.2018,AM,BYBGD,1,1,nan
09.01.2018,PM,BYALL,1,2,
09.01.2018,PM,BYAMM,1,2,
09.01.2018,PM,BYWFK,1,2,
09.01.2018,PM,BYBVA,1,2,
10.01.2018,AM,BYALL,1,1,
10.01.2018,AM,BYAMM,1,1,
10.01.2018,AM,BYWFK,1,1,
10.01.2018,AM,BYBVA,1,1,
10.01.2018,AM,BYCHG,1,1,
10.01.2018,AM,BYBGD,1,1,
11.01.2018,AM,BYALL,1,1,
11.01.2018,AM,BYAMM,1,1,
11.01.2018,AM,BYWFK,1,1,
11.01.2018,AM,BYBVA,1,1,
11.01.2018,AM,BYCHG,1,1,
11.01.2018,AM,BYBGD,1,1,
12.01.2018,AM,BYALL,1,1,
12.01.2018,AM,BYAMM,1,1,
12.01.2018,AM,BYWFK,1,1,
12.01.2018,AM,BYBVA,1,1,
12.01.2018,AM,BYCHG,1,1,
12.01.2018,AM,BYBGD,1,1,
13.01.2018,AM,BYALL,1,1,
13.01.2018,AM,BYAMM,1,1,
13.01.2018,AM,BYWFK,1,1,
13.01.2018,AM,BYBVA,1,1,
13.01.2018,AM,BYCHG,1,1,
13.01.2018,AM,BYBGD,1,1,
14.01.2018,AM,BYALL,1,1,
14.01.2018,AM,BYAMM,1,1,
14.01.2018,AM,BYWFK,1,1,
14.01.2018,AM,BYBVA,1,1,
14.01.2018,AM,BYCHG,1,1,
14.01.2018,AM,BYBGD,1,1,
15.01.2018,AM,BYALL,1,1,nan
15.01.2018,AM,BYAMM,1,1,nan
15.01.2018,AM,BYWFK,2,1,
15.01.2018,AM,BYBVA,1,1,nan
15.01.2018,AM,BYCHG,1,1,nan
15.01.2018,AM,BYBGD,2,1,
16.01.2018,AM,BYALL,3,2,
16.01.2018,AM,BYAMM,2,1,
16.01.2018,AM,BYWFK,2,1,
16.01.2018,AM,BYBVA,2,1,
16.01.2018,AM,BYCHG,2,1,
16.01.2018,AM,BYBGD,2,1,
16.01.2018,PM,BYAMM,3,2,
16.01.2018,PM,BYWFK,3,2,
16.01.2018,PM,BYBVA,3,2,
16.01.2018,PM,BYCHG,3,2,
16.01.2018,PM,BYBGD,3,2,
17.01.2018,AM,BYALL,4,3,
17.01.2018,AM,BYAMM,4,3,
17.01.2018,AM,BYWFK,4,3,
17.01.2018,AM,BYBVA,3,3,nan
17.01.2018,AM,BYCHG,3,3,nan
17.01.2018,AM,BYBGD,3,3,nan
18.01.2018,AM,BYALL,4,3,
18.01.2018,AM,BYAMM,4,3,
18.01.2018,AM,BYWFK,4,3,
18.01.2018,AM,BYBVA,4,3,
18.01.2018,AM,BYCHG,4,3,
18.01.2018,AM,BYBGD,4,3,
19.01.2018,AM,BYALL,3,2,
19.01.2018,AM,BYAMM,3,2,
19.01.2018,AM,BYWFK,3,2,
19.01.2018,AM,BYBVA,3,2,
19.01.2018,AM,BYCHG,3,2,
19.01.2018,AM,BYBGD,3,2,
20.01.2018,AM,BYALL,3,2,
20.01.2018,AM,BYAMM,3,2,
20.01.2018,AM,BYWFK,3,2,
20.01.2018,AM,BYBVA,3,2,
20.01.2018,AM,BYCHG,3,2,
20.01.2018,AM,BYBGD,3,2,
21.01.2018,AM,BYALL,3,3,
21.01.2018,AM,BYAMM,3,3,
21.01.2018,AM,BYWFK,3,3,
21.01.2018,AM,BYBVA,3,3,
21.01.2018,AM,BYCHG,3,3,
21.01.2018,AM,BYBGD,3,3,
22.01.2018,AM,BYALL,4,4,
22.01.2018,AM,BYAMM,4,4,
22.01.2018,AM,BYWFK,4,4,
22.01.2018,AM,BYBVA,4,4,
22.01.2018,AM,BYCHG,4,4,
22.01.2018,AM,BYBGD,4,4,
23.01.2018,AM,BYALL,4,4,nan
23.01.2018,AM,BYAMM,4,4,nan
23.01.2018,AM,BYWFK,4,4,nan
23.01.2018,AM,BYBVA,3,3,nan
23.01.2018,AM,BYCHG,3,3,nan
23.01.2018,AM,BYBGD,4,3,
24.01.2018,AM,BYALL,3,3,nan
24.01.2018,AM,BYAMM,3,2,
24.01.2018,AM,BYWFK,3,2,
24.01.2018,AM,BYBVA,2,2,nan
24.01.2018,AM,BYCHG,2,2,nan
24.01.2018,AM,BYBGD,3,2,
25.01.2018,AM,BYALL,2,2,
25.01.2018,AM,BYAMM,2,2,
25.01.2018,AM,BYWFK,2,2,
25.01.2018,AM,BYBVA,2,2,
25.01.2018,AM,BYCHG,2,2,
25.01.2018,AM,BYBGD,2,2,
26.01.2018,AM,BYALL,2,2,
26.01.2018,AM,BYAMM,2,2,
26.01.2018,AM,BYWFK,2,2,
26.01.2018,AM,BYBVA,2,2,
26.01.2018,AM,BYCHG,2,2,
26.01.2018,AM,BYBGD,2,2,
27.01.2018,AM,BYALL,2,2,
27.01.2018,AM,BYAMM,2,2,
27.01.2018,AM,BYWFK,2,2,
27.01.2018,AM,BYBVA,2,2,
27.01.2018,AM,BYCHG,2,2,
27.01.2018,AM,BYBGD,2,2,
28.01.2018,AM,BYALL,2,1,
28.01.2018,AM,BYAMM,2,1,
28.01.2018,AM,BYWFK,2,1,
28.01.2018,AM,BYBVA,2,1,
28.01.2018,AM,BYCHG,2,1,
28.01.2018,AM,BYBGD,2,1,
29.01.2018,AM,BYALL,2,1,
29.01.2018,AM,BYAMM,2,1,
29.01.2018,AM,BYWFK,2,1,
29.01.2018,AM,BYBVA,2,1,
29.01.2018,AM,BYCHG,2,1,
29.01.2018,AM,BYBGD,2,1,
30.01.2018,AM,BYALL,2,2,
30.01.2018,AM,BYAMM,2,2,
30.01.2018,AM,BYWFK,2,2,
30.01.2018,AM,BYBVA,2,2,
30.01.2018,AM,BYCHG,2,2,
30.01.2018,AM,BYBGD,2,2,
31.01.2018,AM,BYALL,1,1,nan
31.01.2018,AM,BYAMM,1,1,nan
31.01.2018,AM,BYWFK,1,1,nan
31.01.2018,AM,BYBVA,2,2,nan
31.01.2018,AM,BYCHG,2,2,nan
31.01.2018,AM,BYBGD,1,2,
01.02.2018,AM,BYALL,1,1,nan
01.02.2018,AM,BYAMM,1,1,nan
01.02.2018,AM,BYWFK,1,1,nan
01.02.2018,AM,BYBVA,1,2,
01.02.2018,AM,BYCHG,1,2,
01.02.2018,AM,BYBGD,1,1,nan
01.02.2018,PM,BYALL,2,1,
01.02.2018,PM,BYAMM,2,1,
01.02.2018,PM,BYWFK,2,1,
02.02.2018,AM,BYALL,2,2,nan
02.02.2018,AM,BYAMM,2,1,
02.02.2018,AM,BYWFK,2,1,
02.02.2018,AM,BYBVA,2,1,
02.02.2018,AM,BYCHG,2,1,
02.02.2018,AM,BYBGD,2,1,
03.02.2018,AM,BYALL,2,1,
03.02.2018,AM,BYAMM,2,1,
03.02.2018,AM,BYWFK,2,1,
03.02.2018,AM,BYBVA,2,1,
03.02.2018,AM,BYCHG,2,1,
03.02.2018,AM,BYBGD,2,1,
04.02.2018,AM,BYALL,2,1,
04.02.2018,AM,BYAMM,1,1,nan
04.02.2018,AM,BYWFK,2,1,
04.02.2018,AM,BYBVA,1,1,nan
04.02.2018,AM,BYCHG,2,2,nan
04.02.2018,AM,BYBGD,2,2,nan
05.02.2018,AM,BYALL,2,1,
05.02.2018,AM,BYAMM,2,1,
05.02.2018,AM,BYWFK,2,1,
05.02.2018,AM,BYBVA,2,1,
05.02.2018,AM,BYCHG,2,1,
05.02.2018,AM,BYBGD,2,1,
06.02.2018,AM,BYALL,2,1,
06.02.2018,AM,BYAMM,2,1,
06.02.2018,AM,BYWFK,2,1,
06.02.2018,AM,BYBVA,1,1,nan
06.02.2018,AM,BYCHG,1,1,nan
06.02.2018,AM,BYBGD,2,1,
07.02.2018,AM,BYALL,1,1,
07.02.2018,AM,BYAMM,1,1,
07.02.2018,AM,BYWFK,1,1,
07.02.2018,AM,BYBVA,1,1,
07.02.2018,AM,BYCHG,1,1,
07.02.2018,AM,BYBGD,1,1,
08.02.2018,AM,BYALL,1,1,
08.02.2018,AM,BYAMM,1,1,
08.02.2018,AM,BYWFK,1,1,
08.02.2018,AM,BYBVA,1,1,
08.02.2018,AM,BYCHG,1,1,
08.02.2018,AM,BYBGD,1,1,
09.02.2018,AM,BYALL,1,1,
09.02.2018,AM,BYAMM,1,1,
09.02.2018,AM,BYWFK,1,1,
09.02.2018,AM,BYBVA,1,1,
09.02.2018,AM,BYCHG,1,1,
09.02.2018,AM,BYBGD,1,1,
10.02.2018,AM,BYALL,1,1,
10.02.2018,AM,BYAMM,1,1,
10.02.2018,AM,BYWFK,1,1,
10.02.2018,AM,BYBVA,1,1,
10.02.2018,AM,BYCHG,1,1,
10.02.2018,AM,BYBGD,1,1,
11.02.2018,AM,BYALL,1,1,nan
11.02.2018,AM,BYAMM,1,1,nan
11.02.2018,AM,BYWFK,1,1,nan
11.02.2018,AM,BYBVA,1,1,nan
11.02.2018,AM,BYCHG,1,1,nan
11.02.2018,AM,BYBGD,1,1,nan
11.02.2018,PM,BYALL,2,1,
11.02.2018,PM,BYAMM,2,1,
11.02.2018,PM,BYWFK,2,1,
11.02.2018,PM,BYBVA,2,1,
11.02.2018,PM,BYCHG,2,1,
11.02.2018,PM,BYBGD,2,1,
12.02.2018,AM,BYALL,2,1,
12.02.2018,AM,BYAMM,2,1,
12.02.2018,AM,BYWFK,2,1,
12.02.2018,AM,BYBVA,2,1,
12.02.2018,AM,BYCHG,2,1,
12.02.2018,AM,BYBGD,2,1,
12.02.2018,PM,BYALL,3,1,
12.02.2018,PM,BYAMM,3,1,
12.02.2018,PM,BYWFK,3,1,
12.02.2018,PM,BYBVA,3,1,
12.02.2018,PM,BYCHG,3,1,
12.02.2018,PM,BYBGD,3,1,
13.02.2018,AM,BYALL,3,1,
13.02.2018,AM,BYAMM,3,1,
13.02.2018,AM,BYWFK,3,1,
13.02.2018,AM,BYBVA,3,1,
13.02.2018,AM,BYCHG,3,1,
13.02.2018,AM,BYBGD,3,1,
14.02.2018,AM,BYALL,3,2,
14.02.2018,AM,BYAMM,2,2,nan
14.02.2018,AM,BYWFK,2,2,nan
14.02.2018,AM,BYBVA,2,2,nan
14.02.2018,AM,BYCHG,2,2,nan
14.02.2018,AM,BYBGD,2,2,nan
15.02.2018,AM,BYALL,2,1,
15.02.2018,AM,BYAMM,2,1,
15.02.2018,AM,BYWFK,2,1,
15.02.2018,AM,BYBVA,2,1,
15.02.2018,AM,BYCHG,2,1,
15.02.2018,AM,BYBGD,2,1,
15.02.2018,PM,BYALL,2,2,nan
15.02.2018,PM,BYAMM,2,2,nan
15.02.2018,PM,BYWFK,2,2,nan
15.02.2018,PM,BYBVA,2,2,nan
15.02.2018,PM,BYCHG,2,2,nan
15.02.2018,PM,BYBGD,2,2,nan
16.02.2018,AM,BYALL,2,3,
16.02.2018,AM,BYAMM,2,3,
16.02.2018,AM,BYWFK,2,3,
16.02.2018,AM,BYBVA,2,3,
16.02.2018,AM,BYCHG,2,3,
16.02.2018,AM,BYBGD,2,3,
17.02.2018,AM,BYALL,2,2,
17.02.2018,AM,BYAMM,2,2,
17.02.2018,AM,BYWFK,2,2,
17.02.2018,AM,BYBVA,2,2,
17.02.2018,AM,BYCHG,2,2,
17.02.2018,AM,BYBGD,2,2,
18.02.2018,AM,BYALL,2,1,
18.02.2018,AM,BYAMM,2,1,
18.02.2018,AM,BYWFK,2,1,
18.02.2018,AM,BYBVA,2,1,
18.02.2018,AM,BYCHG,2,1,
18.02.2018,AM,BYBGD,2,1,
18.02.2018,PM,BYALL,2,2,nan
18.02.2018,PM,BYAMM,2,2,nan
18.02.2018,PM,BYWFK,2,2,nan
18.02.2018,PM,BYBVA,2,2,nan
18.02.2018,PM,BYCHG,2,2,nan
18.02.2018,PM,BYBGD,2,2,nan
19.02.2018,AM,BYALL,2,1,
19.02.2018,AM,BYAMM,2,1,
19.02.2018,AM,BYWFK,2,1,
19.02.2018,AM,BYBVA,2,1,
19.02.2018,AM,BYCHG,2,1,
19.02.2018,AM,BYBGD,2,1,
20.02.2018,AM,BYALL,2,1,
20.02.2018,AM,BYAMM,2,1,
20.02.2018,AM,BYWFK,2,1,
20.02.2018,AM,BYBVA,2,1,
20.02.2018,AM,BYCHG,2,1,
20.02.2018,AM,BYBGD,2,1,
21.02.2018,AM,BYALL,2,1,
21.02.2018,AM,BYAMM,2,1,
21.02.2018,AM,BYWFK,2,1,
21.02.2018,AM,BYBVA,2,1,
21.02.2018,AM,BYCHG,2,1,
21.02.2018,AM,BYBGD,2,1,
22.02.2018,AM,BYALL,2,1,
22.02.2018,AM,BYAMM,2,1,
22.02.2018,AM,BYWFK,2,1,
22.02.2018,AM,BYBVA,2,1,
22.02.2018,AM,BYCHG,2,1,
22.02.2018,AM,BYBGD,2,1,
23.02.2018,AM,BYALL,2,1,
23.02.2018,AM,BYAMM,2,1,
23.02.2018,AM,BYWFK,2,1,
23.02.2018,AM,BYBVA,2,1,
23.02.2018,AM,BYCHG,2,1,
23.02.2018,AM,BYBGD,2,1,
24.02.2018,AM,BYALL,2,1,
24.02.2018,AM,BYAMM,2,1,
24.02.2018,AM,BYWFK,2,1,
24.02.2018,AM,BYBVA,1,1,nan
24.02.2018,AM,BYCHG,1,1,nan
24.02.2018,AM,BYBGD,2,1,
25.02.2018,AM,BYALL,2,1,
25.02.2018,AM,BYAMM,2,1,
25.02.2018,AM,BYWFK,2,1,
25.02.2018,AM,BYBVA,1,1,nan
25.02.2018,AM,BYCHG,1,1,nan
25.02.2018,AM,BYBGD,2,1,
26.02.2018,AM,BYALL,2,1,
26.02.2018,AM,BYAMM,2,1,
26.02.2018,AM,BYWFK,2,1,
26.02.2018,AM,BYBVA,2,1,
26.02.2018,AM,BYCHG,2,1,
26.02.2018,AM,BYBGD,2,1,
27.02.2018,AM,BYALL,2,1,
27.02.2018,AM,BYAMM,2,1,
27.02.2018,AM,BYWFK,2,1,
27.02.2018,AM,BYBVA,2,1,
27.02.2018,AM,BYCHG,2,1,
27.02.2018,AM,BYBGD,2,1,
28.02.2018,AM,BYALL,2,1,
28.02.2018,AM,BYAMM,2,1,
28.02.2018,AM,BYWFK,2,1,
28.02.2018,AM,BYBVA,2,1,
28.02.2018,AM,BYCHG,2,1,
28.02.2018,AM,BYBGD,2,1,
01.03.2018,AM,BYALL,2,1,
01.03.2018,AM,BYAMM,2,1,
01.03.2018,AM,BYWFK,3,1,
01.03.2018,AM,BYBVA,3,1,
01.03.2018,AM,BYCHG,3,1,
01.03.2018,AM,BYBGD,2,1,
01.03.2018,PM,BYALL,3,1,
01.03.2018,PM,BYAMM,3,1,
01.03.2018,PM,BYBGD,3,1,
02.03.2018,AM,BYALL,2,1,
02.03.2018,AM,BYAMM,2,1,
02.03.2018,AM,BYWFK,2,1,
02.03.2018,AM,BYBVA,2,1,
02.03.2018,AM,BYCHG,2,1,
02.03.2018,AM,BYBGD,2,1,
03.03.2018,AM,BYALL,2,1,
03.03.2018,AM,BYAMM,2,1,
03.03.2018,AM,BYWFK,2,1,
03.03.2018,AM,BYBVA,2,1,
03.03.2018,AM,BYCHG,2,1,
03.03.2018,AM,BYBGD,2,1,
04.03.2018,AM,BYALL,2,1,
04.03.2018,AM,BYAMM,2,1,
04.03.2018,AM,BYWFK,2,1,
04.03.2018,AM,BYBVA,2,1,
04.03.2018,AM,BYCHG,2,1,
04.03.2018,AM,BYBGD,2,1,
05.03.2018,AM,BYALL,1,1,
05.03.2018,AM,BYAMM,1,1,
05.03.2018,AM,BYWFK,1,1,
05.03.2018,AM,BYBVA,1,1,
05.03.2018,AM,BYCHG,1,1,
05.03.2018,AM,BYBGD,1,1,
06.03.2018,AM,BYALL,1,1,
06.03.2018,AM,BYAMM,1,1,
06.03.2018,AM,BYWFK,1,1,
06.03.2018,AM,BYBVA,1,1,
06.03.2018,AM,BYCHG,1,1,
06.03.2018,AM,BYBGD,1,1,
07.03.2018,AM,BYALL,1,1,nan
07.03.2018,AM,BYAMM,1,1,nan
07.03.2018,AM,BYWFK,1,1,nan
07.03.2018,AM,BYBVA,1,1,nan
07.03.2018,AM,BYCHG,1,1,nan
07.03.2018,AM,BYBGD,1,1,nan
07.03.2018,PM,BYALL,2,1,
07.03.2018,PM,BYAMM,2,1,
07.03.2018,PM,BYWFK,2,1,
07.03.2018,PM,BYBVA,2,1,
07.03.2018,PM,BYCHG,2,1,
07.03.2018,PM,BYBGD,2,1,
08.03.2018,AM,BYALL,3,1,
08.03.2018,AM,BYAMM,2,1,
08.03.2018,AM,BYWFK,2,1,
08.03.2018,AM,BYBVA,1,1,nan
08.03.2018,AM,BYCHG,1,1,nan
08.03.2018,AM,BYBGD,2,1,
09.03.2018,AM,BYALL,3,1,
09.03.2018,AM,BYAMM,2,1,
09.03.2018,AM,BYWFK,2,1,
09.03.2018,AM,BYBVA,1,1,nan
09.03.2018,AM,BYCHG,1,1,nan
09.03.2018,AM,BYBGD,2,1,
10.03.2018,AM,BYALL,3,2,
10.03.2018,AM,BYAMM,2,2,nan
10.03.2018,AM,BYWFK,2,2,nan
10.03.2018,AM,BYBVA,2,2,nan
10.03.2018,AM,BYCHG,2,2,nan
10.03.2018,AM,BYBGD,2,2,nan
11.03.2018,AM,BYALL,2,2,
11.03.2018,AM,BYAMM,2,2,
11.03.2018,AM,BYWFK,2,2,
11.03.2018,AM,BYBVA,2,2,
11.03.2018,AM,BYCHG,2,2,
11.03.2018,AM,BYBGD,2,2,
12.03.2018,AM,BYALL,2,2,
12.03.2018,AM,BYAMM,2,2,
12.03.2018,AM,BYWFK,2,2,
12.03.2018,AM,BYBVA,2,2,
12.03.2018,AM,BYCHG,2,2,
12.03.2018,AM,BYBGD,2,2,
13.03.2018,AM,BYALL,2,2,
13.03.2018,AM,BYAMM,2,2,
13.03.2018,AM,BYWFK,2,2,
13.03.2018,AM,BYBVA,2,2,
13.03.2018,AM,BYCHG,2,2,
13.03.2018,AM,BYBGD,2,2,
14.03.2018,AM,BYALL,2,2,
14.03.2018,AM,BYAMM,2,2,
14.03.2018,AM,BYWFK,2,2,
14.03.2018,AM,BYBVA,2,2,
14.03.2018,AM,BYCHG,2,2,
14.03.2018,AM,BYBGD,2,2,
15.03.2018,AM,BYALL,2,2,
15.03.2018,AM,BYAMM,2,2,
15.03.2018,AM,BYWFK,2,2,
15.03.2018,AM,BYBVA,2,2,
15.03.2018,AM,BYCHG,2,2,
15.03.2018,AM,BYBGD,2,2,
16.03.2018,AM,BYALL,2,2,
16.03.2018,AM,BYAMM,2,2,
16.03.2018,AM,BYWFK,2,2,
16.03.2018,AM,BYBVA,2,2,
16.03.2018,AM,BYCHG,2,2,
16.03.2018,AM,BYBGD,2,2,
17.03.2018,AM,BYALL,2,1,
17.03.2018,AM,BYAMM,2,1,
17.03.2018,AM,BYWFK,2,1,
17.03.2018,AM,BYBVA,1,1,nan
17.03.2018,AM,BYCHG,1,1,nan
17.03.2018,AM,BYBGD,2,1,
18.03.2018,AM,BYALL,2,1,
18.03.2018,AM,BYAMM,1,1,nan
18.03.2018,AM,BYWFK,2,1,
18.03.2018,AM,BYBVA,1,1,nan
18.03.2018,AM,BYCHG,1,1,nan
18.03.2018,AM,BYBGD,2,1,
19.03.2018,AM,BYALL,1,1,
19.03.2018,AM,BYAMM,1,1,
19.03.2018,AM,BYWFK,1,1,
19.03.2018,AM,BYBVA,1,1,
19.03.2018,AM,BYCHG,1,1,
19.03.2018,AM,BYBGD,1,1,
20.03.2018,AM,BYALL,1,1,
20.03.2018,AM,BYAMM,1,1,
20.03.2018,AM,BYWFK,1,1,
20.03.2018,AM,BYBVA,1,1,
20.03.2018,AM,BYCHG,1,1,
20.03.2018,AM,BYBGD,1,1,
21.03.2018,AM,BYALL,1,1,
21.03.2018,AM,BYAMM,1,1,
21.03.2018,AM,BYWFK,1,1,
21.03.2018,AM,BYBVA,1,1,
21.03.2018,AM,BYCHG,1,1,
21.03.2018,AM,BYBGD,1,1,
22.03.2018,AM,BYALL,2,1,
22.03.2018,AM,BYAMM,2,1,
22.03.2018,AM,BYWFK,2,1,
22.03.2018,AM,BYBVA,2,1,
22.03.2018,AM,BYCHG,1,1,nan
22.03.2018,AM,BYBGD,1,1,nan
23.03.2018,AM,BYALL,2,1,
23.03.2018,AM,BYAMM,2,1,
23.03.2018,AM,BYWFK,2,1,
23.03.2018,AM,BYBVA,1,1,nan
23.03.2018,AM,BYCHG,1,1,nan
23.03.2018,AM,BYBGD,2,1,
24.03.2018,AM,BYALL,2,1,
24.03.2018,AM,BYAMM,2,1,
24.03.2018,AM,BYWFK,2,1,
24.03.2018,AM,BYBVA,1,1,nan
24.03.2018,AM,BYCHG,1,1,nan
24.03.2018,AM,BYBGD,1,1,nan
25.03.2018,AM,BYALL,2,1,
25.03.2018,AM,BYAMM,2,1,
25.03.2018,AM,BYWFK,2,1,
25.03.2018,AM,BYBVA,1,1,nan
25.03.2018,AM,BYCHG,1,1,nan
25.03.2018,AM,BYBGD,1,1,nan
26.03.2018,AM,BYALL,1,1,
26.03.2018,AM,BYAMM,1,1,
26.03.2018,AM,BYWFK,1,1,
26.03.2018,AM,BYBVA,1,1,
26.03.2018,AM,BYCHG,1,1,
26.03.2018,AM,BYBGD,1,1,
27.03.2018,AM,BYALL,1,1,nan
27.03.2018,AM,BYAMM,1,1,nan
27.03.2018,AM,BYWFK,1,1,nan
27.03.2018,AM,BYBVA,1,1,nan
27.03.2018,AM,BYCHG,2,1,
27.03.2018,AM,BYBGD,2,1,
28.03.2018,AM,BYALL,3,2,
28.03.2018,AM,BYAMM,3,2,
28.03.2018,AM,BYWFK,3,2,
28.03.2018,AM,BYBVA,2,2,nan
28.03.2018,AM,BYCHG,2,2,nan
28.03.2018,AM,BYBGD,3,2,
28.03.2018,PM,BYALL,3,3,nan
28.03.2018,PM,BYAMM,3,3,nan
28.03.2018,PM,BYWFK,3,3,nan
28.03.2018,PM,BYBVA,2,3,
29.03.2018,AM,BYALL,3,3,nan
29.03.2018,AM,BYAMM,3,3,nan
29.03.2018,AM,BYWFK,3,3,nan
29.03.2018,AM,BYBVA,2,3,2000
29.03.2018,AM,BYCHG,2,2,nan
29.03.2018,AM,BYBGD,3,2,2000
30.03.2018,AM,BYALL,3,2,2000
30.03.2018,AM,BYAMM,3,2,2000
30.03.2018,AM,BYWFK,3,2,2000
30.03.2018,AM,BYBVA,2,2,nan
30.03.2018,AM,BYCHG,2,2,nan
30.03.2018,AM,BYBGD,2,2,nan
31.03.2018,AM,BYALL,3,2,2000
31.03.2018,AM,BYAMM,3,2,2000
31.03.2018,AM,BYWFK,3,2,2000
31.03.2018,AM,BYBVA,2,2,nan
31.03.2018,AM,BYCHG,2,2,nan
31.03.2018,AM,BYBGD,3,2,2000
01.04.2018,AM,BYALL,3,2,2000
01.04.2018,AM,BYAMM,3,2,2000
01.04.2018,AM,BYWFK,3,2,2000
01.04.2018,AM,BYBVA,2,2,nan
01.04.2018,AM,BYCHG,2,2,nan
01.04.2018,AM,BYBGD,3,2,2000
02.04.2018,AM,BYALL,3,3,
02.04.2018,AM,BYAMM,3,3,
02.04.2018,AM,BYWFK,3,3,
02.04.2018,AM,BYBVA,3,3,
02.04.2018,AM,BYCHG,3,3,
02.04.2018,AM,BYBGD,3,3,
03.04.2018,AM,BYALL,2,3,2000
03.04.2018,AM,BYAMM,2,3,2000
03.04.2018,AM,BYWFK,2,3,2000
03.04.2018,AM,BYBVA,2,2,nan
03.04.2018,AM,BYCHG,2,2,nan
03.04.2018,AM,BYBGD,2,2,nan
04.04.2018,AM,BYALL,2,2,
04.04.2018,AM,BYAMM,2,2,
04.04.2018,AM,BYWFK,2,2,
04.04.2018,AM,BYBVA,2,2,
04.04.2018,AM,BYCHG,2,2,
04.04.2018,AM,BYBGD,2,2,
05.04.2018,AM,BYALL,2,2,
05.04.2018,AM,BYAMM,2,2,
05.04.2018,AM,BYWFK,2,2,
05.04.2018,AM,BYBVA,2,2,
05.04.2018,AM,BYCHG,2,2,
05.04.2018,AM,BYBGD,2,2,
06.04.2018,AM,BYALL,1,2,2200
06.04.2018,AM,BYAMM,2,2,nan
06.04.2018,AM,BYWFK,1,2,2200
06.04.2018,AM,BYBVA,2,2,nan
06.04.2018,AM,BYCHG,2,2,nan
06.04.2018,AM,BYBGD,1,2,2200
07.04.2018,AM,BYALL,1,1,nan
07.04.2018,AM,BYAMM,1,1,nan
07.04.2018,AM,BYWFK,1,1,nan
07.04.2018,AM,BYBVA,1,1,nan
07.04.2018,AM,BYCHG,1,1,nan
07.04.2018,AM,BYBGD,1,1,nan
07.04.2018,PM,BYALL,1,2,2200
07.04.2018,PM,BYAMM,1,2,2200
07.04.2018,PM,BYWFK,1,2,2200
07.04.2018,PM,BYBVA,1,2,2200
07.04.2018,PM,BYCHG,1,2,2200
07.04.2018,PM,BYBGD,1,2,2200
08.04.2018,AM,BYALL,1,2,2200
08.04.2018,AM,BYAMM,2,2,nan
08.04.2018,AM,BYWFK,1,2,2200
08.04.2018,AM,BYBVA,2,2,nan
08.04.2018,AM,BYCHG,2,2,nan
08.04.2018,AM,BYBGD,1,2,2200
09.04.2018,AM,BYALL,1,2,2200
09.04.2018,AM,BYAMM,2,2,nan
09.04.2018,AM,BYWFK,1,2,2200
09.04.2018,AM,BYBVA,2,2,nan
09.04.2018,AM,BYCHG,2,2,nan
09.04.2018,AM,BYBGD,1,2,2200
