[
  {
    "valid_regions": [
      "AT-04-01",
      "AT-04-02",
      "AT-04-05",
      "AT-04-06",
      "AT-04-03",
      "AT-04-07",
      "AT-04-08",
      "AT-04-04"
    ],
    "danger_main": [
      {
        "main_value": 2,
        "valid_elevation": ">Treeline"
      },
      {
        "main_value": 1,
        "valid_elevation": "<Treeline"
      }
    ],
    "dangerpattern": [],
    "problem_list": [
      {
        "problem_type": "drifting snow",
        "aspect": [
          "E",
          "SE",
          "S",
          "SW"
        ],
        "valid_elevation": null
      }
    ],
    "report_texts": null,
    "report_id": "RID540RGR1",
    "rep_date": "2021-03-04T17:00:00+00:00",
    "validity_begin": "2021-03-04T23:00:00+00:00",
    "validity_end": "2021-03-05T23:00:00+00:00"
  }
]