[
  {
    "valid_regions": [
      "AT-03-01",
      "AT-03-06",
      "AT-03-04"
    ],
    "danger_main": [
      {
        "main_value": 1,
        "valid_elevation": null
      }
    ],
    "dangerpattern": [],
    "problem_list": [
      {
        "problem_type": "wet snow",
        "aspect": [
          "N",
          "NE",
          "E",
          "SE",
          "S",
          "SW",
          "W",
          "NW"
        ],
        "valid_elevation": null
      },
      {
        "problem_type": "gliding snow",
        "aspect": [
          "E",
          "SE",
          "S",
          "SW",
          "W"
        ],
        "valid_elevation": null
      }
    ],
    "report_texts": null,
    "report_id": "RID933RGR1",
    "rep_date": "2021-04-23T16:00:00+00:00",
    "validity_begin": "2021-04-23T22:00:00+00:00",
    "validity_end": "2021-04-24T11:00:00+00:00"
  },
  {
    "valid_regions": [
      "AT-03-01",
      "AT-03-06",
      "AT-03-04"
    ],
    "danger_main": [
      {
        "main_value": 2,
        "valid_elevation": null
      }
    ],
    "dangerpattern": [],
    "problem_list": [
      {
        "problem_type": "wet snow",
        "aspect": [
          "N",
          "NE",
          "E",
          "SE",
          "S",
          "SW",
          "W",
          "NW"
        ],
        "valid_elevation": null
      },
      {
        "problem_type": "gliding snow",
        "aspect": [
          "E",
          "SE",
          "S",
          "SW",
          "W"
        ],
        "valid_elevation": null
      }
    ],
    "report_texts": null,
    "report_id": "RID933RGR1_PM",
    "rep_date": "2021-04-23T16:00:00+00:00",
    "validity_begin": "2021-04-24T10:00:00+00:00",
    "validity_end": "2021-04-24T23:00:00+00:00",
    "predecessor_id": "RID933RGR1"
  },
  {
    "valid_regions": [
      "AT-03-02"
    ],
    "danger_main": [
      {
        "main_value": 1,
        "valid_elevation": null
      }
    ],
    "dangerpattern": [],
    "problem_list": [
      {
        "problem_type": "wet snow",
        "aspect": [
          "N",
          "NE",
          "E",
          "SE",
          "S",
          "SW",
          "W",
          "NW"
        ],
        "valid_elevation": null
      },
      {
        "problem_type": "gliding snow",
        "aspect": [
          "E",
          "SE",
          "S",
          "SW",
          "W"
        ],
        "valid_elevation": null
      }
    ],
    "report_texts": null,
    "report_id": "RID933RGR2",
    "rep_date": "2021-04-23T16:00:00+00:00",
    "validity_begin": "2021-04-23T22:00:00+00:00",
    "validity_end": "2021-04-24T22:00:00+00:00"
  }
]