Date,Daytime,Region,Subregion,DangerRatingBelow,DangerRatingAbove,DangerRatingElevation,AvalancheProblem1,AvalancheProblem1AspectN,AvalancheProblem1AspectNE,AvalancheProblem1AspectE,AvalancheProblem1AspectSE,AvalancheProblem1AspectS,AvalancheProblem1AspectSW,AvalancheProblem1AspectW,AvalancheProblem1AspectNW
12/25/2020,AM,,BYALL,1,3,treeline,wind_drifted_snow,1,1,1,1,1,0,0,1
12/25/2020,AM,,BYAMM,1,2,treeline,wind_drifted_snow,1,1,1,1,1,0,0,1
12/25/2020,AM,,BYWFK,1,3,treeline,wind_drifted_snow,1,1,1,1,1,0,0,1
12/25/2020,AM,,BYBVA,1,2,treeline,wind_drifted_snow,1,1,1,1,1,0,0,1
12/25/2020,AM,,BYCHG,1,2,treeline,wind_drifted_snow,1,1,1,1,1,0,0,1
12/25/2020,AM,,BYBGD,1,2,treeline,wind_drifted_snow,1,1,1,1,1,0,0,1
12/26/2020,AM,,BYALL,2,3,2000,new_snow,1,1,1,1,1,1,1,1
12/26/2020,AM,,BYAMM,1,2,1600,new_snow,1,1,1,1,1,1,1,1
12/26/2020,AM,,BYWFK,2,3,2000,new_snow,1,1,1,1,1,1,1,1
12/26/2020,AM,,BYBVA,1,2,1600,new_snow,1,1,1,1,1,1,1,1
12/26/2020,AM,,BYCHG,1,2,1600,new_snow,1,1,1,1,1,1,1,1
12/26/2020,AM,,BYBGD,1,2,1600,new_snow,1,1,1,1,1,1,1,1
12/27/2020,AM,,BYALL,1,3,treeline,wind_drifted_snow,1,1,1,0,0,0,1,1
12/27/2020,AM,,BYAMM,1,2,treeline,wind_drifted_snow,1,1,1,0,0,0,1,1
12/27/2020,AM,,BYWFK,1,2,treeline,wind_drifted_snow,1,1,1,0,0,0,1,1
12/27/2020,AM,,BYBVA,1,1,treeline,wind_drifted_snow,1,1,1,0,0,0,1,1
12/27/2020,AM,,BYCHG,1,1,treeline,wind_drifted_snow,1,1,1,0,0,0,1,1
12/27/2020,AM,,BYBGD,1,2,2000,wind_drifted_snow,1,1,1,0,0,0,1,1
12/27/2020,PM,,BYALL,1,3,treeline,wind_drifted_snow,1,1,1,0,0,0,1,1
12/27/2020,PM,,BYAMM,1,2,treeline,wind_drifted_snow,1,1,1,0,0,0,1,1
12/27/2020,PM,,BYWFK,1,3,treeline,wind_drifted_snow,1,1,1,0,0,0,1,1
12/27/2020,PM,,BYBVA,1,2,treeline,wind_drifted_snow,1,1,1,0,0,0,1,1
12/27/2020,PM,,BYCHG,1,2,treeline,wind_drifted_snow,1,1,1,0,0,0,1,1
12/27/2020,PM,,BYBGD,1,2,2000,wind_drifted_snow,1,1,1,0,0,0,1,1
12/28/2020,AM,,BYALL,1,3,treeline,wind_drifted_snow,1,1,1,1,0,0,1,1
12/28/2020,AM,,BYAMM,1,2,treeline,wind_drifted_snow,1,1,1,1,0,0,1,1
12/28/2020,AM,,BYWFK,1,3,treeline,wind_drifted_snow,1,1,1,1,0,0,1,1
12/28/2020,AM,,BYBVA,1,2,treeline,wind_drifted_snow,1,1,1,1,0,0,1,1
12/28/2020,AM,,BYCHG,1,2,treeline,wind_drifted_snow,1,1,1,1,0,0,1,1
12/28/2020,AM,,BYBGD,1,2,treeline,wind_drifted_snow,1,1,1,1,0,0,1,1
12/29/2020,AM,,BYALL,1,3,treeline,wind_drifted_snow,1,1,1,1,0,0,1,1
12/29/2020,AM,,BYAMM,1,2,treeline,wind_drifted_snow,1,1,1,1,0,0,1,1
12/29/2020,AM,,BYWFK,1,3,treeline,wind_drifted_snow,1,1,1,1,0,0,1,1
12/29/2020,AM,,BYBVA,1,2,treeline,wind_drifted_snow,1,1,1,1,0,0,1,1
12/29/2020,AM,,BYCHG,1,2,treeline,wind_drifted_snow,1,1,1,1,0,0,1,1
12/29/2020,AM,,BYBGD,1,2,treeline,wind_drifted_snow,1,1,1,1,0,0,1,1
12/30/2020,AM,,BYALL,1,3,treeline,wind_drifted_snow,1,1,1,1,1,1,1,1
12/30/2020,AM,,BYAMM,1,2,1800,wind_drifted_snow,1,1,1,1,1,1,1,1
12/30/2020,AM,,BYWFK,1,3,1800,wind_drifted_snow,1,1,1,1,1,1,1,1
12/30/2020,AM,,BYBVA,1,1,NA,wind_drifted_snow,1,1,1,1,1,1,1,1
12/30/2020,AM,,BYCHG,1,1,NA,wind_drifted_snow,1,1,1,1,1,1,1,1
12/30/2020,AM,,BYBGD,1,2,1800,wind_drifted_snow,1,1,1,1,1,1,1,1
12/31/2020,AM,,BYALL,1,2,1800,wind_drifted_snow,1,1,1,0,0,0,1,1
12/31/2020,AM,,BYAMM,1,2,1800,wind_drifted_snow,1,1,1,0,0,0,1,1
12/31/2020,AM,,BYWFK,1,2,1800,wind_drifted_snow,1,1,1,0,0,0,1,1
12/31/2020,AM,,BYBVA,1,1,NA,wind_drifted_snow,1,1,1,0,0,0,1,1
12/31/2020,AM,,BYCHG,1,1,NA,wind_drifted_snow,1,1,1,0,0,0,1,1
12/31/2020,AM,,BYBGD,1,2,1800,wind_drifted_snow,1,1,1,0,0,0,1,1
01/01/2021,AM,,BYALL,1,2,1800,wind_drifted_snow,1,1,1,0,0,0,0,1
01/01/2021,AM,,BYAMM,1,2,1800,wind_drifted_snow,1,1,1,0,0,0,0,1
01/01/2021,AM,,BYWFK,1,2,1800,wind_drifted_snow,1,1,1,0,0,0,0,1
01/01/2021,AM,,BYBVA,1,1,NA,wind_drifted_snow,1,1,1,0,0,0,0,1
01/01/2021,AM,,BYCHG,1,1,NA,wind_drifted_snow,1,1,1,0,0,0,0,1
01/01/2021,AM,,BYBGD,1,2,1800,wind_drifted_snow,1,1,1,0,0,0,0,1
01/02/2021,AM,,BYALL,1,2,2000,wind_drifted_snow,1,1,1,0,0,0,0,1
01/02/2021,AM,,BYAMM,1,1,NA,wind_drifted_snow,1,1,1,0,0,0,0,1
01/02/2021,AM,,BYWFK,1,2,2000,wind_drifted_snow,1,1,1,0,0,0,0,1
01/02/2021,AM,,BYBVA,1,1,NA,wind_drifted_snow,1,1,1,0,0,0,0,1
01/02/2021,AM,,BYCHG,1,1,NA,wind_drifted_snow,1,1,1,0,0,0,0,1
01/02/2021,AM,,BYBGD,1,2,2000,wind_drifted_snow,1,1,1,0,0,0,0,1
01/03/2021,AM,,BYALL,1,1,NA,wind_drifted_snow,1,1,1,0,0,0,1,1
01/03/2021,AM,,BYAMM,1,1,NA,wind_drifted_snow,1,1,1,0,0,0,1,1
01/03/2021,AM,,BYWFK,1,1,NA,wind_drifted_snow,1,1,1,0,0,0,1,1
01/03/2021,AM,,BYBVA,1,1,NA,wind_drifted_snow,1,1,1,0,0,0,1,1
01/03/2021,AM,,BYCHG,1,1,NA,wind_drifted_snow,1,1,1,0,0,0,1,1
01/03/2021,AM,,BYBGD,1,1,NA,wind_drifted_snow,1,1,1,0,0,0,1,1
01/04/2021,AM,,BYALL,1,1,NA,wind_drifted_snow,1,1,0,0,0,0,1,1
01/04/2021,AM,,BYAMM,1,1,NA,wind_drifted_snow,1,1,0,0,0,0,1,1
01/04/2021,AM,,BYWFK,1,1,NA,wind_drifted_snow,1,1,0,0,0,0,1,1
01/04/2021,AM,,BYBVA,1,1,NA,wind_drifted_snow,1,1,0,0,0,0,1,1
01/04/2021,AM,,BYCHG,1,1,NA,wind_drifted_snow,1,1,0,0,0,0,1,1
01/04/2021,AM,,BYBGD,1,1,NA,wind_drifted_snow,1,1,0,0,0,0,1,1
01/05/2021,AM,,BYALL,1,1,NA,persistent_weak_layers,1,1,0,0,0,0,0,1
01/05/2021,AM,,BYAMM,1,1,NA,persistent_weak_layers,1,1,0,0,0,0,0,1
01/05/2021,AM,,BYWFK,1,1,NA,persistent_weak_layers,1,1,0,0,0,0,0,1
01/05/2021,AM,,BYBVA,1,1,NA,persistent_weak_layers,1,1,0,0,0,0,0,1
01/05/2021,AM,,BYCHG,1,1,NA,persistent_weak_layers,1,1,0,0,0,0,0,1
01/05/2021,AM,,BYBGD,1,1,NA,persistent_weak_layers,1,1,0,0,0,0,0,1
01/06/2021,AM,,BYALL,1,1,treeline,wind_drifted_snow,1,1,1,1,1,1,0,0
01/06/2021,AM,,BYAMM,1,1,treeline,wind_drifted_snow,1,1,1,1,1,1,0,0
01/06/2021,AM,,BYWFK,1,1,treeline,wind_drifted_snow,1,1,1,1,1,1,0,0
01/06/2021,AM,,BYBVA,1,1,treeline,wind_drifted_snow,1,1,1,1,1,1,0,0
01/06/2021,AM,,BYCHG,1,1,treeline,wind_drifted_snow,1,1,1,1,1,1,0,0
01/06/2021,AM,,BYBGD,1,1,treeline,wind_drifted_snow,1,1,1,1,1,1,0,0
01/06/2021,PM,,BYALL,1,2,treeline,wind_drifted_snow,1,1,1,1,1,1,0,0
01/06/2021,PM,,BYAMM,1,2,treeline,wind_drifted_snow,1,1,1,1,1,1,0,0
01/06/2021,PM,,BYWFK,1,2,treeline,wind_drifted_snow,1,1,1,1,1,1,0,0
01/06/2021,PM,,BYBVA,1,2,treeline,wind_drifted_snow,1,1,1,1,1,1,0,0
01/06/2021,PM,,BYCHG,1,2,treeline,wind_drifted_snow,1,1,1,1,1,1,0,0
01/06/2021,PM,,BYBGD,1,2,treeline,wind_drifted_snow,1,1,1,1,1,1,0,0
01/07/2021,AM,,BYALL,1,1,NA,wind_drifted_snow,1,1,1,1,1,0,0,0
01/07/2021,AM,,BYAMM,1,1,NA,wind_drifted_snow,1,1,1,1,1,0,0,0
01/07/2021,AM,,BYWFK,1,1,NA,wind_drifted_snow,1,1,1,1,1,0,0,0
01/07/2021,AM,,BYBVA,1,1,NA,wind_drifted_snow,1,1,1,1,1,0,0,0
01/07/2021,AM,,BYCHG,1,1,NA,wind_drifted_snow,1,1,1,1,1,0,0,0
01/07/2021,AM,,BYBGD,1,1,NA,wind_drifted_snow,1,1,1,1,1,0,0,0
01/08/2021,AM,,BYALL,1,1,NA,persistent_weak_layers,1,1,0,0,0,0,0,1
01/08/2021,AM,,BYAMM,1,1,NA,persistent_weak_layers,1,1,0,0,0,0,0,1
01/08/2021,AM,,BYWFK,1,1,NA,persistent_weak_layers,1,1,0,0,0,0,0,1
01/08/2021,AM,,BYBVA,1,1,NA,persistent_weak_layers,1,1,0,0,0,0,0,1
01/08/2021,AM,,BYCHG,1,1,NA,persistent_weak_layers,1,1,0,0,0,0,0,1
01/08/2021,AM,,BYBGD,1,1,NA,persistent_weak_layers,1,1,0,0,0,0,0,1
01/09/2021,AM,,BYALL,1,1,NA,persistent_weak_layers,1,1,0,0,0,0,0,1
01/09/2021,AM,,BYAMM,1,1,NA,persistent_weak_layers,1,1,0,0,0,0,0,1
01/09/2021,AM,,BYWFK,1,1,NA,persistent_weak_layers,1,1,0,0,0,0,0,1
01/09/2021,AM,,BYBVA,1,1,NA,persistent_weak_layers,1,1,0,0,0,0,0,1
01/09/2021,AM,,BYCHG,1,1,NA,persistent_weak_layers,1,1,0,0,0,0,0,1
01/09/2021,AM,,BYBGD,1,1,NA,persistent_weak_layers,1,1,0,0,0,0,0,1
01/10/2021,AM,,BYALL,1,1,NA,persistent_weak_layers,1,1,0,0,0,0,0,1
01/10/2021,AM,,BYAMM,1,1,NA,persistent_weak_layers,1,1,0,0,0,0,0,1
01/10/2021,AM,,BYWFK,1,1,NA,persistent_weak_layers,1,1,0,0,0,0,0,1
01/10/2021,AM,,BYBVA,1,1,NA,persistent_weak_layers,1,1,0,0,0,0,0,1
01/10/2021,AM,,BYCHG,1,1,NA,persistent_weak_layers,1,1,0,0,0,0,0,1
01/10/2021,AM,,BYBGD,1,1,NA,persistent_weak_layers,1,1,0,0,0,0,0,1
01/11/2021,AM,,BYALL,1,1,NA,persistent_weak_layers,1,1,0,0,0,0,0,1
01/11/2021,AM,,BYAMM,1,1,NA,persistent_weak_layers,1,1,0,0,0,0,0,1
01/11/2021,AM,,BYWFK,1,1,NA,persistent_weak_layers,1,1,0,0,0,0,0,1
01/11/2021,AM,,BYBVA,1,1,NA,persistent_weak_layers,1,1,0,0,0,0,0,1
01/11/2021,AM,,BYCHG,1,1,NA,persistent_weak_layers,1,1,0,0,0,0,0,1
01/11/2021,AM,,BYBGD,1,1,NA,persistent_weak_layers,1,1,0,0,0,0,0,1
01/12/2021,AM,,BYALL,1,1,NA,wind_drifted_snow,1,1,1,1,1,0,0,1
01/12/2021,AM,,BYAMM,1,1,treeline,wind_drifted_snow,1,1,1,1,1,0,0,1
01/12/2021,AM,,BYWFK,1,1,treeline,wind_drifted_snow,1,1,1,1,1,0,0,1
01/12/2021,AM,,BYBVA,1,1,treeline,wind_drifted_snow,1,1,1,1,1,0,0,1
01/12/2021,AM,,BYCHG,1,1,treeline,wind_drifted_snow,1,1,1,1,1,0,0,1
01/12/2021,AM,,BYBGD,1,1,treeline,wind_drifted_snow,1,1,1,1,1,0,0,1
01/12/2021,PM,,BYALL,2,2,NA,wind_drifted_snow,1,1,1,1,1,0,0,1
01/12/2021,PM,,BYAMM,1,2,treeline,wind_drifted_snow,1,1,1,1,1,0,0,1
01/12/2021,PM,,BYWFK,1,2,treeline,wind_drifted_snow,1,1,1,1,1,0,0,1
01/12/2021,PM,,BYBVA,1,2,treeline,wind_drifted_snow,1,1,1,1,1,0,0,1
01/12/2021,PM,,BYCHG,1,2,treeline,wind_drifted_snow,1,1,1,1,1,0,0,1
01/12/2021,PM,,BYBGD,1,2,treeline,wind_drifted_snow,1,1,1,1,1,0,0,1
01/13/2021,AM,,BYALL,3,3,NA,wind_drifted_snow,1,1,1,1,1,0,0,0
01/13/2021,AM,,BYAMM,2,3,treeline,wind_drifted_snow,1,1,1,1,1,0,0,0
01/13/2021,AM,,BYWFK,2,3,treeline,wind_drifted_snow,1,1,1,1,1,0,0,0
01/13/2021,AM,,BYBVA,2,3,treeline,wind_drifted_snow,1,1,1,1,1,0,0,0
01/13/2021,AM,,BYCHG,2,3,treeline,wind_drifted_snow,1,1,1,1,1,0,0,0
01/13/2021,AM,,BYBGD,2,3,treeline,wind_drifted_snow,1,1,1,1,1,0,0,0
01/14/2021,AM,,BYALL,3,4,1800,new_snow,1,1,1,1,1,1,1,1
01/14/2021,AM,,BYAMM,3,4,1800,new_snow,1,1,1,1,1,1,1,1
01/14/2021,AM,,BYWFK,3,4,1800,new_snow,1,1,1,1,1,1,1,1
01/14/2021,AM,,BYBVA,2,3,treeline,new_snow,1,1,1,1,1,1,1,1
01/14/2021,AM,,BYCHG,2,2,NA,new_snow,1,1,1,1,1,1,1,1
01/14/2021,AM,,BYBGD,2,3,treeline,new_snow,1,1,1,1,1,1,1,1
01/15/2021,AM,,BYALL,4,4,NA,new_snow,1,1,1,1,1,1,1,1
01/15/2021,AM,,BYAMM,4,4,NA,new_snow,1,1,1,1,1,1,1,1
01/15/2021,AM,,BYWFK,4,4,NA,new_snow,1,1,1,1,1,1,1,1
01/15/2021,AM,,BYBVA,3,4,1500,new_snow,1,1,1,1,1,1,1,1
01/15/2021,AM,,BYCHG,2,3,1500,new_snow,1,1,1,1,1,1,1,1
01/15/2021,AM,,BYBGD,2,3,1500,new_snow,1,1,1,1,1,1,1,1
01/16/2021,AM,,BYALL,3,4,1600,new_snow,1,1,1,1,1,1,1,1
01/16/2021,AM,,BYAMM,3,4,1600,new_snow,1,1,1,1,1,1,1,1
01/16/2021,AM,,BYWFK,3,4,1600,new_snow,1,1,1,1,1,1,1,1
01/16/2021,AM,,BYBVA,3,3,NA,new_snow,1,1,1,1,1,1,1,1
01/16/2021,AM,,BYCHG,2,3,1500,new_snow,1,1,1,1,1,1,1,1
01/16/2021,AM,,BYBGD,2,3,1500,new_snow,1,1,1,1,1,1,1,1
01/17/2021,AM,,BYALL,3,3,NA,wind_drifted_snow,1,1,1,1,1,1,0,0
01/17/2021,AM,,BYAMM,3,3,NA,wind_drifted_snow,1,1,1,1,1,1,0,0
01/17/2021,AM,,BYWFK,3,3,NA,wind_drifted_snow,1,1,1,1,1,1,0,0
01/17/2021,AM,,BYBVA,3,3,NA,wind_drifted_snow,1,1,1,1,1,1,0,0
01/17/2021,AM,,BYCHG,2,3,1500,wind_drifted_snow,1,1,1,1,1,1,0,0
01/17/2021,AM,,BYBGD,2,3,1500,wind_drifted_snow,1,1,1,1,1,1,0,0
01/18/2021,AM,,BYALL,3,4,treeline,wind_drifted_snow,1,1,1,1,1,1,1,1
01/18/2021,AM,,BYAMM,3,4,treeline,wind_drifted_snow,1,1,1,1,1,1,1,1
01/18/2021,AM,,BYWFK,3,4,treeline,wind_drifted_snow,1,1,1,1,1,1,1,1
01/18/2021,AM,,BYBVA,3,3,NA,wind_drifted_snow,1,1,1,1,1,1,1,1
01/18/2021,AM,,BYCHG,2,3,1500,wind_drifted_snow,1,1,1,1,1,1,1,1
01/18/2021,AM,,BYBGD,2,3,1500,wind_drifted_snow,1,1,1,1,1,1,1,1
01/19/2021,AM,,BYALL,3,3,NA,new_snow,1,1,1,1,1,1,1,1
01/19/2021,AM,,BYAMM,3,3,NA,new_snow,1,1,1,1,1,1,1,1
01/19/2021,AM,,BYWFK,3,3,NA,new_snow,1,1,1,1,1,1,1,1
01/19/2021,AM,,BYBVA,3,3,NA,new_snow,1,1,1,1,1,1,1,1
01/19/2021,AM,,BYCHG,2,3,treeline,new_snow,1,1,1,1,1,1,1,1
01/19/2021,AM,,BYBGD,2,3,treeline,new_snow,1,1,1,1,1,1,1,1
01/20/2021,AM,,BYALL,2,3,1500,wind_drifted_snow,1,1,1,1,0,0,0,1
01/20/2021,AM,,BYAMM,2,3,1500,wind_drifted_snow,1,1,1,1,0,0,0,1
01/20/2021,AM,,BYWFK,2,3,1500,wind_drifted_snow,1,1,1,1,0,0,0,1
01/20/2021,AM,,BYBVA,2,3,1500,wind_drifted_snow,1,1,1,1,0,0,0,1
01/20/2021,AM,,BYCHG,2,3,1500,wind_drifted_snow,1,1,1,1,0,0,0,1
01/20/2021,AM,,BYBGD,2,3,1500,wind_drifted_snow,1,1,1,1,0,0,0,1
01/21/2021,AM,,BYALL,2,3,1800,wind_drifted_snow,1,1,1,1,1,1,1,1
01/21/2021,AM,,BYAMM,2,3,1800,wind_drifted_snow,1,1,1,1,1,1,1,1
01/21/2021,AM,,BYWFK,2,3,1800,wind_drifted_snow,1,1,1,1,1,1,1,1
01/21/2021,AM,,BYBVA,2,2,NA,wind_drifted_snow,1,1,1,1,1,1,1,1
01/21/2021,AM,,BYCHG,2,2,NA,wind_drifted_snow,1,1,1,1,1,1,1,1
01/21/2021,AM,,BYBGD,2,3,1800,wind_drifted_snow,1,1,1,1,1,1,1,1
01/22/2021,AM,,BYALL,2,3,2000,wind_drifted_snow,1,1,1,0,0,0,1,1
01/22/2021,AM,,BYAMM,2,2,NA,wind_drifted_snow,1,1,1,0,0,0,1,1
01/22/2021,AM,,BYWFK,2,3,2000,wind_drifted_snow,1,1,1,0,0,0,1,1
01/22/2021,AM,,BYBVA,2,2,NA,wind_drifted_snow,1,1,1,0,0,0,1,1
01/22/2021,AM,,BYCHG,2,2,NA,wind_drifted_snow,1,1,1,0,0,0,1,1
01/22/2021,AM,,BYBGD,2,3,2000,wind_drifted_snow,1,1,1,0,0,0,1,1
01/23/2021,AM,,BYALL,2,2,NA,wind_drifted_snow,1,1,1,0,0,0,0,1
01/23/2021,AM,,BYAMM,2,2,NA,wind_drifted_snow,1,1,1,0,0,0,0,1
01/23/2021,AM,,BYWFK,2,2,NA,wind_drifted_snow,1,1,1,0,0,0,0,1
01/23/2021,AM,,BYBVA,2,2,NA,wind_drifted_snow,1,1,1,0,0,0,0,1
01/23/2021,AM,,BYCHG,2,2,NA,wind_drifted_snow,1,1,1,0,0,0,0,1
01/23/2021,AM,,BYBGD,2,2,NA,wind_drifted_snow,1,1,1,1,0,0,0,1
01/24/2021,AM,,BYALL,2,2,NA,wind_drifted_snow,1,1,1,0,0,0,0,1
01/24/2021,AM,,BYAMM,2,2,NA,wind_drifted_snow,1,1,1,0,0,0,0,1
01/24/2021,AM,,BYWFK,2,2,NA,wind_drifted_snow,1,1,1,0,0,0,0,1
01/24/2021,AM,,BYBVA,2,2,NA,wind_drifted_snow,1,1,1,0,0,0,0,1
01/24/2021,AM,,BYCHG,2,2,NA,wind_drifted_snow,1,1,1,0,0,0,0,1
01/24/2021,AM,,BYBGD,2,2,NA,wind_drifted_snow,1,1,1,1,0,0,0,1
01/25/2021,AM,,BYALL,1,2,treeline,wind_drifted_snow,1,1,1,0,0,0,0,1
01/25/2021,AM,,BYAMM,1,2,treeline,wind_drifted_snow,1,1,1,0,0,0,0,1
01/25/2021,AM,,BYWFK,1,2,treeline,wind_drifted_snow,1,1,1,0,0,0,0,1
01/25/2021,AM,,BYBVA,1,2,treeline,wind_drifted_snow,1,1,1,0,0,0,0,1
01/25/2021,AM,,BYCHG,1,2,treeline,wind_drifted_snow,1,1,1,0,0,0,0,1
01/25/2021,AM,,BYBGD,1,2,treeline,wind_drifted_snow,1,1,1,1,0,0,0,1
01/25/2021,PM,,BYALL,1,3,treeline,wind_drifted_snow,1,1,1,0,0,0,0,1
01/25/2021,PM,,BYAMM,1,2,treeline,wind_drifted_snow,1,1,1,0,0,0,0,1
01/25/2021,PM,,BYWFK,1,3,treeline,wind_drifted_snow,1,1,1,0,0,0,0,1
01/25/2021,PM,,BYBVA,1,2,treeline,wind_drifted_snow,1,1,1,0,0,0,0,1
01/25/2021,PM,,BYCHG,1,2,treeline,wind_drifted_snow,1,1,1,0,0,0,0,1
01/25/2021,PM,,BYBGD,1,2,treeline,wind_drifted_snow,1,1,1,1,0,0,0,1
