[
  {
    "valid_regions": [
      "AT-05-07",
      "AT-05-06"
    ],
    "danger_main": [
      {
        "main_value": 3,
        "valid_elevation": ">2400"
      },
      {
        "main_value": 1,
        "valid_elevation": "<2400"
      }
    ],
    "dangerpattern": [],
    "problem_list": [
      {
        "problem_type": "drifting snow",
        "aspect": [
          "N",
          "NE",
          "E",
          "W",
          "NW"
        ],
        "valid_elevation": null
      },
      {
        "problem_type": "old snow",
        "aspect": [
          "N",
          "NE",
          "NW"
        ],
        "valid_elevation": null
      }
    ],
    "report_texts": null,
    "report_id": "RID11RGR1",
    "rep_date": "2020-12-03T17:00:00+00:00",
    "validity_begin": "2020-12-03T23:00:00+00:00",
    "validity_end": "2020-12-04T23:00:00+00:00"
  },
  {
    "valid_regions": [
      "AT-05-05",
      "AT-05-04",
      "AT-05-03"
    ],
    "danger_main": [
      {
        "main_value": 2,
        "valid_elevation": ">Treeline"
      },
      {
        "main_value": 1,
        "valid_elevation": "<Treeline"
      }
    ],
    "dangerpattern": [],
    "problem_list": [
      {
        "problem_type": "drifting snow",
        "aspect": [
          "N",
          "NE",
          "NW"
        ],
        "valid_elevation": null
      },
      {
        "problem_type": "gliding snow",
        "aspect": [
          "N",
          "NE",
          "E",
          "W",
          "NW"
        ],
        "valid_elevation": null
      }
    ],
    "report_texts": null,
    "report_id": "RID11RGR2",
    "rep_date": "2020-12-03T17:00:00+00:00",
    "validity_begin": "2020-12-03T23:00:00+00:00",
    "validity_end": "2020-12-04T23:00:00+00:00"
  },
  {
    "valid_regions": [
      "AT-05-18",
      "AT-05-17",
      "AT-05-16"
    ],
    "danger_main": [
      {
        "main_value": 1,
        "valid_elevation": null
      }
    ],
    "dangerpattern": [],
    "problem_list": [
      {
        "problem_type": "favourable situation",
        "aspect": [],
        "valid_elevation": null
      }
    ],
    "report_texts": null,
    "report_id": "RID11RGR3",
    "rep_date": "2020-12-03T17:00:00+00:00",
    "validity_begin": "2020-12-03T23:00:00+00:00",
    "validity_end": "2020-12-04T23:00:00+00:00"
  },
  {
    "valid_regions": [
      "AT-05-01"
    ],
    "danger_main": [
      {
        "main_value": 1,
        "valid_elevation": null
      }
    ],
    "dangerpattern": [],
    "problem_list": [
      {
        "problem_type": "drifting snow",
        "aspect": [
          "N",
          "NE",
          "NW"
        ],
        "valid_elevation": null
      }
    ],
    "report_texts": null,
    "report_id": "RID11RGR4",
    "rep_date": "2020-12-03T17:00:00+00:00",
    "validity_begin": "2020-12-03T23:00:00+00:00",
    "validity_end": "2020-12-04T23:00:00+00:00"
  }
]