[
  {
    "valid_regions": [
      "AT-06-04",
      "AT-06-05",
      "AT-06-07",
      "AT-06-06",
      "AT-06-08",
      "AT-06-15",
      "AT-06-16",
      "AT-06-14",
      "AT-06-13"
    ],
    "danger_main": [
      {
        "main_value": 1,
        "valid_elevation": null
      }
    ],
    "dangerpattern": [],
    "problem_list": [
      {
        "problem_type": "drifting snow",
        "aspect": [
          "N",
          "NE",
          "E",
          "NW"
        ],
        "valid_elevation": null
      }
    ],
    "report_texts": null,
    "report_id": "RID40RGR1",
    "rep_date": "2020-12-12T12:29:03+00:00",
    "validity_begin": "2020-12-12T12:29:03+00:00",
    "validity_end": "2020-12-13T08:00:00+00:00"
  },
  {
    "valid_regions": [
      "AT-06-18",
      "AT-06-17"
    ],
    "danger_main": [
      {
        "main_value": 2,
        "valid_elevation": ">1900"
      },
      {
        "main_value": 1,
        "valid_elevation": "<1900"
      }
    ],
    "dangerpattern": [],
    "problem_list": [
      {
        "problem_type": "drifting snow",
        "aspect": [
          "N",
          "NE",
          "E",
          "NW"
        ],
        "valid_elevation": null
      }
    ],
    "report_texts": null,
    "report_id": "RID40RGR2",
    "rep_date": "2020-12-12T12:29:03+00:00",
    "validity_begin": "2020-12-12T12:29:03+00:00",
    "validity_end": "2020-12-13T08:00:00+00:00"
  }
]