[
  {
    "valid_regions": [
      "AT-04-01",
      "AT-04-04",
      "AT-04-03"
    ],
    "danger_main": [
      {
        "main_value": 3,
        "valid_elevation": ">1800"
      },
      {
        "main_value": 1,
        "valid_elevation": "<1800"
      }
    ],
    "dangerpattern": [],
    "problem_list": [
      {
        "problem_type": "drifting snow",
        "aspect": [
          "N",
          "NE",
          "E",
          "NW"
        ],
        "valid_elevation": null
      }
    ],
    "report_texts": null,
    "report_id": "RID124RGR1",
    "rep_date": "2020-12-31T17:00:00+00:00",
    "validity_begin": "2020-12-31T23:00:00+00:00",
    "validity_end": "2021-01-01T23:00:00+00:00"
  },
  {
    "valid_regions": [
      "AT-04-02",
      "AT-04-05",
      "AT-04-06",
      "AT-04-07",
      "AT-04-08"
    ],
    "danger_main": [
      {
        "main_value": 2,
        "valid_elevation": ">Treeline"
      },
      {
        "main_value": 1,
        "valid_elevation": "<Treeline"
      }
    ],
    "dangerpattern": [],
    "problem_list": [
      {
        "problem_type": "drifting snow",
        "aspect": [
          "N",
          "NE",
          "NW"
        ],
        "valid_elevation": null
      }
    ],
    "report_texts": null,
    "report_id": "RID124RGR2",
    "rep_date": "2020-12-31T17:00:00+00:00",
    "validity_begin": "2020-12-31T23:00:00+00:00",
    "validity_end": "2021-01-01T23:00:00+00:00"
  },
  {
    "valid_regions": [
      "AT-04-09"
    ],
    "danger_main": [
      {
        "main_value": 1,
        "valid_elevation": null
      }
    ],
    "dangerpattern": [],
    "problem_list": [
      {
        "problem_type": "drifting snow",
        "aspect": [
          "N",
          "NE",
          "NW"
        ],
        "valid_elevation": null
      }
    ],
    "report_texts": null,
    "report_id": "RID124RGR3",
    "rep_date": "2020-12-31T17:00:00+00:00",
    "validity_begin": "2020-12-31T23:00:00+00:00",
    "validity_end": "2021-01-01T23:00:00+00:00"
  }
]