[
  {
    "valid_regions": [
      "AT-03-01",
      "AT-03-02",
      "AT-03-03",
      "AT-03-05"
    ],
    "danger_main": [
      {
        "main_value": 1,
        "valid_elevation": null
      }
    ],
    "dangerpattern": [],
    "problem_list": [
      {
        "problem_type": "drifting snow",
        "aspect": [
          "N",
          "NE",
          "E",
          "NW"
        ],
        "valid_elevation": null
      }
    ],
    "report_texts": null,
    "report_id": "RID144RGR1",
    "rep_date": "2021-01-04T17:00:00+00:00",
    "validity_begin": "2021-01-04T23:00:00+00:00",
    "validity_end": "2021-01-05T23:00:00+00:00"
  },
  {
    "valid_regions": [
      "AT-03-06",
      "AT-03-04"
    ],
    "danger_main": [
      {
        "main_value": 2,
        "valid_elevation": ">Treeline"
      },
      {
        "main_value": 1,
        "valid_elevation": "<Treeline"
      }
    ],
    "dangerpattern": [],
    "problem_list": [
      {
        "problem_type": "drifting snow",
        "aspect": [
          "N",
          "NE",
          "E",
          "NW"
        ],
        "valid_elevation": null
      }
    ],
    "report_texts": null,
    "report_id": "RID144RGR2",
    "rep_date": "2021-01-04T17:00:00+00:00",
    "validity_begin": "2021-01-04T23:00:00+00:00",
    "validity_end": "2021-01-05T23:00:00+00:00"
  }
]