[
  {
    "valid_regions": [
      "AT-03-01",
      "AT-03-06",
      "AT-03-04"
    ],
    "danger_main": [
      {
        "main_value": 2,
        "valid_elevation": ">Treeline"
      },
      {
        "main_value": 1,
        "valid_elevation": "<Treeline"
      }
    ],
    "dangerpattern": [],
    "problem_list": [
      {
        "problem_type": "drifting snow",
        "aspect": [
          "E",
          "SE",
          "S",
          "SW"
        ],
        "valid_elevation": null
      }
    ],
    "report_texts": null,
    "report_id": "RID797RGR1",
    "rep_date": "2021-04-06T16:00:00+00:00",
    "validity_begin": "2021-04-06T22:00:00+00:00",
    "validity_end": "2021-04-07T22:00:00+00:00"
  },
  {
    "valid_regions": [
      "AT-03-02",
      "AT-03-05"
    ],
    "danger_main": [
      {
        "main_value": 1,
        "valid_elevation": null
      }
    ],
    "dangerpattern": [],
    "problem_list": [
      {
        "problem_type": "drifting snow",
        "aspect": [
          "E",
          "SE",
          "S"
        ],
        "valid_elevation": null
      }
    ],
    "report_texts": null,
    "report_id": "RID797RGR2",
    "rep_date": "2021-04-06T16:00:00+00:00",
    "validity_begin": "2021-04-06T22:00:00+00:00",
    "validity_end": "2021-04-07T22:00:00+00:00"
  }
]