[
  {
    "valid_regions": [
      "AT-03-01",
      "AT-03-06",
      "AT-03-04",
      "AT-03-05"
    ],
    "danger_main": [
      {
        "main_value": 1,
        "valid_elevation": null
      }
    ],
    "dangerpattern": [],
    "problem_list": [
      {
        "problem_type": "old snow",
        "aspect": [
          "N",
          "NE",
          "E"
        ],
        "valid_elevation": null
      }
    ],
    "report_texts": null,
    "report_id": "RID565RGR1",
    "rep_date": "2021-03-07T17:00:00+00:00",
    "validity_begin": "2021-03-07T23:00:00+00:00",
    "validity_end": "2021-03-08T23:00:00+00:00"
  }
]