[
  {
    "valid_regions": [
      "AT-07-24",
      "AT-07-23",
      "AT-07-15",
      "AT-07-17",
      "AT-07-06",
      "AT-07-04",
      "AT-07-08",
      "AT-07-13",
      "AT-07-20",
      "AT-07-14",
      "AT-07-01",
      "AT-07-12",
      "AT-07-10",
      "AT-07-16",
      "AT-07-05",
      "AT-07-03",
      "AT-07-22",
      "AT-07-02",
      "AT-07-18",
      "AT-07-09",
      "AT-07-21",
      "AT-07-19",
      "AT-07-07",
      "AT-07-11"
    ],
    "danger_main": [
      {
        "main_value": 2,
        "valid_elevation": ">2200"
      },
      {
        "main_value": 1,
        "valid_elevation": "<2200"
      }
    ],
    "dangerpattern": [],
    "problem_list": [],
    "report_texts": null,
    "report_id": "RID824RGR1",
    "rep_date": "2021-04-09T15:00:00+00:00",
    "validity_begin": "2021-04-10T15:00:00+00:00",
    "validity_end": "2021-04-10T22:00:00+00:00"
  },
  {
    "valid_regions": [
      "AT-07-27",
      "AT-07-29",
      "AT-07-28",
      "AT-07-26",
      "AT-07-25"
    ],
    "danger_main": [
      {
        "main_value": 1,
        "valid_elevation": ">2400"
      },
      {
        "main_value": 1,
        "valid_elevation": "<2400"
      }
    ],
    "dangerpattern": [],
    "problem_list": [],
    "report_texts": null,
    "report_id": "RID824RGR2",
    "rep_date": "2021-04-09T15:00:00+00:00",
    "validity_begin": "2021-04-10T15:00:00+00:00",
    "validity_end": "2021-04-10T22:00:00+00:00"
  }
]