[
  {
    "valid_regions": [
      "AT-05-18",
      "AT-05-17"
    ],
    "danger_main": [
      {
        "main_value": 2,
        "valid_elevation": ">2300"
      },
      {
        "main_value": 1,
        "valid_elevation": "<2300"
      }
    ],
    "dangerpattern": [],
    "problem_list": [
      {
        "problem_type": "drifting snow",
        "aspect": [
          "N",
          "NE",
          "E",
          "NW"
        ],
        "valid_elevation": null
      }
    ],
    "report_texts": null,
    "report_id": "RID84RGR1",
    "rep_date": "2020-12-23T17:00:00+00:00",
    "validity_begin": "2020-12-23T23:00:00+00:00",
    "validity_end": "2020-12-24T23:00:00+00:00"
  },
  {
    "valid_regions": [
      "AT-05-15",
      "AT-05-11",
      "AT-05-07",
      "AT-05-06",
      "AT-05-05",
      "AT-05-10"
    ],
    "danger_main": [
      {
        "main_value": 1,
        "valid_elevation": ">2300"
      },
      {
        "main_value": 1,
        "valid_elevation": "<2300"
      }
    ],
    "dangerpattern": [],
    "problem_list": [
      {
        "problem_type": "drifting snow",
        "aspect": [
          "N",
          "NE",
          "E",
          "NW"
        ],
        "valid_elevation": null
      }
    ],
    "report_texts": null,
    "report_id": "RID84RGR2",
    "rep_date": "2020-12-23T17:00:00+00:00",
    "validity_begin": "2020-12-23T23:00:00+00:00",
    "validity_end": "2020-12-24T11:00:00+00:00"
  },
  {
    "valid_regions": [
      "AT-05-15",
      "AT-05-11",
      "AT-05-07",
      "AT-05-06",
      "AT-05-05",
      "AT-05-10"
    ],
    "danger_main": [
      {
        "main_value": 2,
        "valid_elevation": ">2300"
      },
      {
        "main_value": 1,
        "valid_elevation": "<2300"
      }
    ],
    "dangerpattern": [],
    "problem_list": [
      {
        "problem_type": "drifting snow",
        "aspect": [
          "N",
          "NE",
          "E",
          "NW"
        ],
        "valid_elevation": null
      }
    ],
    "report_texts": null,
    "report_id": "RID84RGR2_PM",
    "rep_date": "2020-12-23T17:00:00+00:00",
    "validity_begin": "2020-12-24T11:00:00+00:00",
    "validity_end": "2020-12-24T23:00:00+00:00",
    "predecessor_id": "RID84RGR2"
  },
  {
    "valid_regions": [
      "AT-05-14",
      "AT-05-13",
      "AT-05-08",
      "AT-05-09",
      "AT-05-04",
      "AT-05-03",
      "AT-05-02",
      "AT-05-01",
      "AT-05-16",
      "AT-05-12"
    ],
    "danger_main": [
      {
        "main_value": 1,
        "valid_elevation": null
      }
    ],
    "dangerpattern": [],
    "problem_list": [
      {
        "problem_type": "favourable situation",
        "aspect": [],
        "valid_elevation": null
      }
    ],
    "report_texts": null,
    "report_id": "RID84RGR3",
    "rep_date": "2020-12-23T17:00:00+00:00",
    "validity_begin": "2020-12-23T23:00:00+00:00",
    "validity_end": "2020-12-24T23:00:00+00:00"
  }
]