{
"type": "FeatureCollection",
"name": "AT-08_micro-regions",
"crs": { "type": "name", "properties": { "name": "urn:ogc:def:crs:OGC:1.3:CRS84" } },
"features": [
{ "type": "Feature", "properties": { "id": "AT-08-02" }, "geometry": { "type": "MultiPolygon", "coordinates": [ [ [ [ 10.1762, 47.2703 ], [ 10.1788, 47.2702 ], [ 10.1745, 47.2638 ], [ 10.1637, 47.2679 ], [ 10.1542, 47.2682 ], [ 10.1346, 47.2695 ], [ 10.1239, 47.2676 ], [ 10.1101, 47.267 ], [ 10.0953, 47.2579 ], [ 10.0889, 47.2576 ], [ 10.0869, 47.2588 ], [ 10.0829, 47.2602 ], [ 10.0786, 47.2612 ], [ 10.0733, 47.2623 ], [ 10.0693, 47.2639 ], [ 10.067, 47.2658 ], [ 10.065, 47.2684 ], [ 10.0632, 47.2725 ], [ 10.0622, 47.2751 ], [ 10.0599, 47.278 ], [ 10.0571, 47.2802 ], [ 10.0528, 47.2822 ], [ 10.049, 47.2843 ], [ 10.0465, 47.2859 ], [ 10.0459, 47.2873 ], [ 10.0461, 47.2885 ], [ 10.0462, 47.2899 ], [ 10.0456, 47.2918 ], [ 10.0442, 47.2939 ], [ 10.0414, 47.2979 ], [ 10.0409, 47.2985 ], [ 10.0386, 47.3008 ], [ 10.0365, 47.3025 ], [ 10.0357, 47.3029 ], [ 10.0344, 47.3034 ], [ 10.03, 47.304 ], [ 10.0244, 47.3054 ], [ 10.0193, 47.3075 ], [ 10.0138, 47.3097 ], [ 10.0072, 47.3128 ], [ 9.9988, 47.316 ], [ 9.9911, 47.3188 ], [ 9.9842, 47.321 ], [ 9.9807, 47.3221 ], [ 9.9917, 47.3248 ], [ 10.0022, 47.3295 ], [ 10.0157, 47.3484 ], [ 10.0117, 47.3556 ], [ 10.0184, 47.3636 ], [ 10.02, 47.3742 ], [ 10.0372, 47.3802 ], [ 10.0428, 47.3856 ], [ 10.0494, 47.391 ], [ 10.0476, 47.3965 ], [ 10.0393, 47.4032 ], [ 10.0342, 47.4132 ], [ 10.0234, 47.4244 ], [ 10.0181, 47.4323 ], [ 10.0042, 47.4334 ], [ 9.9884, 47.4365 ], [ 9.9723, 47.4428 ], [ 9.9618, 47.45 ], [ 9.9504, 47.4508 ], [ 9.9332, 47.4471 ], [ 9.9225, 47.4402 ], [ 9.9056, 47.44 ], [ 9.889, 47.4433 ], [ 9.8891, 47.4442 ], [ 9.8891, 47.4451 ], [ 9.8888, 47.4457 ], [ 9.8882, 47.447 ], [ 9.8875, 47.4481 ], [ 9.887, 47.4493 ], [ 9.8869, 47.4505 ], [ 9.8871, 47.4515 ], [ 9.8873, 47.4531 ], [ 9.8873, 47.4552 ], [ 9.8866, 47.4575 ], [ 9.8855, 47.4591 ], [ 9.8839, 47.4598 ], [ 9.8832, 47.4601 ], [ 9.8815, 47.4605 ], [ 9.8782, 47.4608 ], [ 9.8769, 47.461 ], [ 9.8747, 47.4612 ], [ 9.8723, 47.4616 ], [ 9.8704, 47.4624 ], [ 9.8686, 47.4639 ], [ 9.8671, 47.4654 ], [ 9.8656, 47.4673 ], [ 9.8639, 47.4695 ], [ 9.8612, 47.4709 ], [ 9.8589, 47.4719 ], [ 9.8565, 47.4726 ], [ 9.8538, 47.4729 ], [ 9.8517, 47.4733 ], [ 9.8501, 47.4739 ], [ 9.8493, 47.4744 ], [ 9.8486, 47.4748 ], [ 9.848, 47.4757 ], [ 9.8471, 47.4777 ], [ 9.846, 47.4802 ], [ 9.845, 47.4826 ], [ 9.8441, 47.4851 ], [ 9.843, 47.4873 ], [ 9.8421, 47.4879 ], [ 9.8418, 47.4881 ], [ 9.8401, 47.4889 ], [ 9.8378, 47.4898 ], [ 9.8359, 47.4908 ], [ 9.8336, 47.4918 ], [ 9.8307, 47.4931 ], [ 9.8284, 47.4939 ], [ 9.827, 47.4942 ], [ 9.8265, 47.4943 ], [ 9.8246, 47.4943 ], [ 9.8222, 47.494 ], [ 9.8187, 47.4931 ], [ 9.8137, 47.4918 ], [ 9.8101, 47.4908 ], [ 9.806, 47.4892 ], [ 9.8017, 47.4875 ], [ 9.7987, 47.4857 ], [ 9.7965, 47.484 ], [ 9.7937, 47.4824 ], [ 9.7889, 47.4803 ], [ 9.7846, 47.4787 ], [ 9.7792, 47.4773 ], [ 9.7749, 47.4761 ], [ 9.7709, 47.4757 ], [ 9.7689, 47.4757 ], [ 9.767, 47.4758 ], [ 9.7668, 47.4759 ], [ 9.7646, 47.4763 ], [ 9.7617, 47.4774 ], [ 9.7576, 47.4793 ], [ 9.753, 47.4813 ], [ 9.7476, 47.484 ], [ 9.7416, 47.4859 ], [ 9.7371, 47.4868 ], [ 9.7399, 47.5104 ], [ 9.7439, 47.5114 ], [ 9.7503, 47.5134 ], [ 9.7505, 47.5135 ], [ 9.752, 47.5142 ], [ 9.753, 47.5151 ], [ 9.7535, 47.516 ], [ 9.7533, 47.5173 ], [ 9.7524, 47.519 ], [ 9.7505, 47.5219 ], [ 9.7493, 47.523 ], [ 9.7477, 47.5241 ], [ 9.7415, 47.5275 ], [ 9.7404, 47.5281 ], [ 9.7377, 47.53 ], [ 9.7373, 47.5305 ], [ 9.7362, 47.5319 ], [ 9.7354, 47.5342 ], [ 9.7363, 47.5364 ], [ 9.7367, 47.5404 ], [ 9.7353, 47.5461 ], [ 9.736, 47.5473 ], [ 9.7419, 47.5546 ], [ 9.7473, 47.556 ], [ 9.7479, 47.5708 ], [ 9.7558, 47.5725 ], [ 9.7564, 47.5794 ], [ 9.7768, 47.5956 ], [ 9.7907, 47.5937 ], [ 9.8, 47.5963 ], [ 9.8206, 47.5877 ], [ 9.8275, 47.5795 ], [ 9.8209, 47.5707 ], [ 9.826, 47.5596 ], [ 9.8202, 47.5512 ], [ 9.8298, 47.5446 ], [ 9.8502, 47.5418 ], [ 9.8585, 47.5339 ], [ 9.8745, 47.5285 ], [ 9.8785, 47.5395 ], [ 9.8757, 47.5445 ], [ 9.8809, 47.5483 ], [ 9.9069, 47.5425 ], [ 9.9146, 47.5321 ], [ 9.9226, 47.5299 ], [ 9.9413, 47.5382 ], [ 9.9569, 47.5377 ], [ 9.959, 47.5433 ], [ 9.9682, 47.5464 ], [ 9.9696, 47.5421 ], [ 9.9669, 47.5349 ], [ 9.9683, 47.5252 ], [ 9.9656, 47.5231 ], [ 9.9954, 47.5028 ], [ 9.9878, 47.4984 ], [ 9.9993, 47.4828 ], [ 10.0109, 47.4815 ], [ 10.037, 47.4889 ], [ 10.0472, 47.4863 ], [ 10.054, 47.4665 ], [ 10.0645, 47.4636 ], [ 10.0702, 47.4555 ], [ 10.0884, 47.4601 ], [ 10.0913, 47.4583 ], [ 10.0934, 47.4419 ], [ 10.1045, 47.4302 ], [ 10.0952, 47.4177 ], [ 10.0748, 47.4149 ], [ 10.069, 47.4093 ], [ 10.0853, 47.3998 ], [ 10.0834, 47.3939 ], [ 10.0923, 47.3727 ], [ 10.0978, 47.3594 ], [ 10.0998, 47.3548 ], [ 10.1195, 47.3755 ], [ 10.1348, 47.3697 ], [ 10.1419, 47.367 ], [ 10.1658, 47.3686 ], [ 10.1693, 47.3706 ], [ 10.1695, 47.3858 ], [ 10.1825, 47.388 ], [ 10.1818, 47.3924 ], [ 10.1953, 47.3893 ], [ 10.2001, 47.3833 ], [ 10.2127, 47.3804 ], [ 10.2272, 47.3892 ], [ 10.2363, 47.3818 ], [ 10.2317, 47.379 ], [ 10.2371, 47.3738 ], [ 10.2248, 47.3589 ], [ 10.2165, 47.3543 ], [ 10.2175, 47.3506 ], [ 10.2108, 47.3435 ], [ 10.2044, 47.3367 ], [ 10.2078, 47.3327 ], [ 10.1995, 47.3265 ], [ 10.2111, 47.3191 ], [ 10.2165, 47.3104 ], [ 10.2124, 47.3109 ], [ 10.2087, 47.3044 ], [ 10.1898, 47.2941 ], [ 10.1798, 47.2962 ], [ 10.1726, 47.2793 ], [ 10.1744, 47.2703 ], [ 10.1762, 47.2703 ] ] ] ] } },
{ "type": "Feature", "properties": { "id": "AT-08-01" }, "geometry": { "type": "MultiPolygon", "coordinates": [ [ [ [ 9.7399, 47.5104 ], [ 9.7371, 47.4868 ], [ 9.7416, 47.4859 ], [ 9.7476, 47.484 ], [ 9.753, 47.4813 ], [ 9.7576, 47.4793 ], [ 9.7617, 47.4774 ], [ 9.7646, 47.4763 ], [ 9.7668, 47.4759 ], [ 9.767, 47.4758 ], [ 9.7689, 47.4757 ], [ 9.7709, 47.4757 ], [ 9.7749, 47.4761 ], [ 9.7792, 47.4773 ], [ 9.7846, 47.4787 ], [ 9.7889, 47.4803 ], [ 9.7937, 47.4824 ], [ 9.7965, 47.484 ], [ 9.7987, 47.4857 ], [ 9.8017, 47.4875 ], [ 9.806, 47.4892 ], [ 9.8101, 47.4908 ], [ 9.8137, 47.4918 ], [ 9.8187, 47.4931 ], [ 9.8222, 47.494 ], [ 9.8246, 47.4943 ], [ 9.8265, 47.4943 ], [ 9.827, 47.4942 ], [ 9.8284, 47.4939 ], [ 9.8307, 47.4931 ], [ 9.8336, 47.4918 ], [ 9.8359, 47.4908 ], [ 9.8378, 47.4898 ], [ 9.8401, 47.4889 ], [ 9.8418, 47.4881 ], [ 9.8421, 47.4879 ], [ 9.843, 47.4873 ], [ 9.8441, 47.4851 ], [ 9.845, 47.4826 ], [ 9.846, 47.4802 ], [ 9.8471, 47.4777 ], [ 9.848, 47.4757 ], [ 9.8486, 47.4748 ], [ 9.8493, 47.4744 ], [ 9.8501, 47.4739 ], [ 9.8517, 47.4733 ], [ 9.8538, 47.4729 ], [ 9.8565, 47.4726 ], [ 9.8589, 47.4719 ], [ 9.8612, 47.4709 ], [ 9.8639, 47.4695 ], [ 9.8656, 47.4673 ], [ 9.8671, 47.4654 ], [ 9.8686, 47.4639 ], [ 9.8704, 47.4624 ], [ 9.8723, 47.4616 ], [ 9.8747, 47.4612 ], [ 9.8769, 47.461 ], [ 9.8782, 47.4608 ], [ 9.8815, 47.4605 ], [ 9.8832, 47.4601 ], [ 9.8839, 47.4598 ], [ 9.8855, 47.4591 ], [ 9.8866, 47.4575 ], [ 9.8873, 47.4552 ], [ 9.8873, 47.4531 ], [ 9.8871, 47.4515 ], [ 9.8869, 47.4505 ], [ 9.887, 47.4493 ], [ 9.8875, 47.4481 ], [ 9.8882, 47.447 ], [ 9.8888, 47.4457 ], [ 9.8891, 47.4451 ], [ 9.8891, 47.4442 ], [ 9.889, 47.4433 ], [ 9.9056, 47.44 ], [ 9.9225, 47.4402 ], [ 9.9332, 47.4471 ], [ 9.9504, 47.4508 ], [ 9.9618, 47.45 ], [ 9.9723, 47.4428 ], [ 9.9884, 47.4365 ], [ 10.0042, 47.4334 ], [ 10.0181, 47.4323 ], [ 10.0234, 47.4244 ], [ 10.0342, 47.4132 ], [ 10.0393, 47.4032 ], [ 10.0476, 47.3965 ], [ 10.0494, 47.391 ], [ 10.0428, 47.3856 ], [ 10.0372, 47.3802 ], [ 10.02, 47.3742 ], [ 10.0184, 47.3636 ], [ 10.0117, 47.3556 ], [ 10.0157, 47.3484 ], [ 10.0022, 47.3295 ], [ 9.9917, 47.3248 ], [ 9.9807, 47.3221 ], [ 9.9794, 47.3225 ], [ 9.9772, 47.3234 ], [ 9.9763, 47.3237 ], [ 9.9762, 47.3239 ], [ 9.9527, 47.3097 ], [ 9.9406, 47.2957 ], [ 9.9269, 47.2877 ], [ 9.9054, 47.2812 ], [ 9.9062, 47.2659 ], [ 9.9177, 47.251 ], [ 9.9195, 47.2379 ], [ 9.9029, 47.2363 ], [ 9.8852, 47.2282 ], [ 9.8618, 47.2216 ], [ 9.8478, 47.2214 ], [ 9.8284, 47.2157 ], [ 9.804, 47.2121 ], [ 9.7854, 47.2034 ], [ 9.7738, 47.1933 ], [ 9.7751, 47.1742 ], [ 9.7737, 47.1747 ], [ 9.7673, 47.1763 ], [ 9.7626, 47.1772 ], [ 9.751, 47.1791 ], [ 9.7427, 47.1801 ], [ 9.7383, 47.1805 ], [ 9.7347, 47.1812 ], [ 9.7345, 47.1813 ], [ 9.7308, 47.1827 ], [ 9.729, 47.1833 ], [ 9.7273, 47.1839 ], [ 9.7247, 47.1849 ], [ 9.7198, 47.1879 ], [ 9.7154, 47.1908 ], [ 9.7122, 47.1925 ], [ 9.7073, 47.1938 ], [ 9.7022, 47.1949 ], [ 9.6949, 47.1961 ], [ 9.69, 47.1977 ], [ 9.682, 47.2003 ], [ 9.6771, 47.2026 ], [ 9.669, 47.2076 ], [ 9.666, 47.21 ], [ 9.6627, 47.2125 ], [ 9.6576, 47.216 ], [ 9.6518, 47.2198 ], [ 9.6472, 47.2223 ], [ 9.6427, 47.2238 ], [ 9.6389, 47.2245 ], [ 9.6357, 47.2247 ], [ 9.6312, 47.2246 ], [ 9.6263, 47.2247 ], [ 9.6218, 47.2255 ], [ 9.6162, 47.227 ], [ 9.6138, 47.2274 ], [ 9.6124, 47.2277 ], [ 9.6103, 47.2246 ], [ 9.6074, 47.2207 ], [ 9.6048, 47.2165 ], [ 9.6023, 47.2134 ], [ 9.5992, 47.2105 ], [ 9.5956, 47.2085 ], [ 9.5913, 47.2064 ], [ 9.5849, 47.2046 ], [ 9.5847, 47.2047 ], [ 9.5692, 47.2194 ], [ 9.5604, 47.2233 ], [ 9.5586, 47.2242 ], [ 9.5517, 47.2238 ], [ 9.5674, 47.2413 ], [ 9.5308, 47.2707 ], [ 9.5318, 47.272 ], [ 9.5324, 47.2725 ], [ 9.5339, 47.2736 ], [ 9.5369, 47.2754 ], [ 9.5418, 47.2779 ], [ 9.5457, 47.2805 ], [ 9.5488, 47.2833 ], [ 9.5509, 47.2869 ], [ 9.5528, 47.2927 ], [ 9.554, 47.2952 ], [ 9.5554, 47.297 ], [ 9.5569, 47.2982 ], [ 9.5601, 47.3004 ], [ 9.5675, 47.3045 ], [ 9.576, 47.3095 ], [ 9.5843, 47.3146 ], [ 9.5871, 47.3167 ], [ 9.5886, 47.3179 ], [ 9.5902, 47.3197 ], [ 9.5916, 47.3223 ], [ 9.5929, 47.3259 ], [ 9.5943, 47.3311 ], [ 9.5965, 47.3378 ], [ 9.5983, 47.3418 ], [ 9.6001, 47.3453 ], [ 9.6029, 47.3492 ], [ 9.6077, 47.3536 ], [ 9.614, 47.3583 ], [ 9.6194, 47.3622 ], [ 9.6244, 47.3663 ], [ 9.6498, 47.3674 ], [ 9.6596, 47.3698 ], [ 9.6707, 47.3779 ], [ 9.674, 47.3839 ], [ 9.6738, 47.3912 ], [ 9.6591, 47.3989 ], [ 9.6518, 47.4059 ], [ 9.6516, 47.4101 ], [ 9.6511, 47.4147 ], [ 9.65, 47.4202 ], [ 9.6475, 47.4264 ], [ 9.6462, 47.4303 ], [ 9.6457, 47.4341 ], [ 9.6461, 47.4367 ], [ 9.6471, 47.4387 ], [ 9.6493, 47.4409 ], [ 9.6547, 47.4457 ], [ 9.6613, 47.4504 ], [ 9.6532, 47.4545 ], [ 9.623, 47.4574 ], [ 9.6074, 47.4704 ], [ 9.6037, 47.4625 ], [ 9.5966, 47.4626 ], [ 9.5831, 47.482 ], [ 9.5641, 47.4939 ], [ 9.5616, 47.5014 ], [ 9.5633, 47.5014 ], [ 9.5659, 47.501 ], [ 9.5689, 47.5003 ], [ 9.5726, 47.4992 ], [ 9.5757, 47.4977 ], [ 9.5807, 47.4942 ], [ 9.5828, 47.493 ], [ 9.585, 47.492 ], [ 9.5879, 47.4912 ], [ 9.5929, 47.4904 ], [ 9.5986, 47.4901 ], [ 9.604, 47.4902 ], [ 9.6094, 47.4908 ], [ 9.6134, 47.4916 ], [ 9.6173, 47.4926 ], [ 9.6209, 47.4939 ], [ 9.6242, 47.4953 ], [ 9.6277, 47.4972 ], [ 9.631, 47.4997 ], [ 9.6335, 47.502 ], [ 9.6352, 47.5045 ], [ 9.6362, 47.5053 ], [ 9.6385, 47.5062 ], [ 9.6421, 47.5067 ], [ 9.6432, 47.5067 ], [ 9.6441, 47.5064 ], [ 9.6451, 47.5058 ], [ 9.6454, 47.5052 ], [ 9.6454, 47.5043 ], [ 9.6449, 47.5021 ], [ 9.6433, 47.4991 ], [ 9.6429, 47.4978 ], [ 9.6435, 47.4956 ], [ 9.645, 47.4935 ], [ 9.6459, 47.4928 ], [ 9.6469, 47.4922 ], [ 9.6504, 47.4911 ], [ 9.6552, 47.4902 ], [ 9.6572, 47.4901 ], [ 9.6588, 47.4901 ], [ 9.6609, 47.4907 ], [ 9.663, 47.4918 ], [ 9.6637, 47.4928 ], [ 9.6647, 47.4954 ], [ 9.6656, 47.4963 ], [ 9.6677, 47.4974 ], [ 9.67, 47.4981 ], [ 9.6712, 47.4982 ], [ 9.6731, 47.4984 ], [ 9.6744, 47.4983 ], [ 9.6754, 47.498 ], [ 9.6763, 47.4973 ], [ 9.6777, 47.4948 ], [ 9.6787, 47.4942 ], [ 9.6792, 47.4941 ], [ 9.6797, 47.4941 ], [ 9.681, 47.4942 ], [ 9.6842, 47.495 ], [ 9.6859, 47.496 ], [ 9.6887, 47.4987 ], [ 9.6901, 47.4997 ], [ 9.6914, 47.5003 ], [ 9.6948, 47.5015 ], [ 9.6961, 47.5023 ], [ 9.6966, 47.503 ], [ 9.6968, 47.5032 ], [ 9.6976, 47.5059 ], [ 9.6992, 47.5075 ], [ 9.7008, 47.5083 ], [ 9.7045, 47.5094 ], [ 9.7079, 47.51 ], [ 9.7119, 47.5103 ], [ 9.7161, 47.5101 ], [ 9.7275, 47.5093 ], [ 9.7309, 47.5093 ], [ 9.7339, 47.5095 ], [ 9.7399, 47.5104 ] ] ] ] } },
{ "type": "Feature", "properties": { "id": "AT-08-03" }, "geometry": { "type": "MultiPolygon", "coordinates": [ [ [ [ 10.2139, 47.2072 ], [ 10.2139, 47.2062 ], [ 10.2121, 47.2048 ], [ 10.2116, 47.2044 ], [ 10.197, 47.193 ], [ 10.2039, 47.1761 ], [ 10.2119, 47.1712 ], [ 10.2069, 47.1624 ], [ 10.2128, 47.1576 ], [ 10.2257, 47.1527 ], [ 10.222, 47.1494 ], [ 10.2147, 47.1438 ], [ 10.2035, 47.1424 ], [ 10.2034, 47.1392 ], [ 10.2034, 47.1372 ], [ 10.204, 47.1367 ], [ 10.204, 47.1366 ], [ 10.2018, 47.1365 ], [ 10.1864, 47.1381 ], [ 10.142, 47.1363 ], [ 10.1185, 47.1309 ], [ 10.086, 47.1314 ], [ 10.0396, 47.1286 ], [ 10.0062, 47.1234 ], [ 9.9893, 47.1229 ], [ 9.922, 47.1416 ], [ 9.8948, 47.1433 ], [ 9.8778, 47.1396 ], [ 9.8554, 47.1401 ], [ 9.8453, 47.1354 ], [ 9.8367, 47.1348 ], [ 9.8352, 47.1359 ], [ 9.834, 47.1367 ], [ 9.8316, 47.1393 ], [ 9.8267, 47.144 ], [ 9.8201, 47.1486 ], [ 9.8134, 47.153 ], [ 9.8061, 47.1584 ], [ 9.7984, 47.1628 ], [ 9.7898, 47.1677 ], [ 9.7878, 47.1687 ], [ 9.7831, 47.1712 ], [ 9.7828, 47.1713 ], [ 9.7751, 47.1742 ], [ 9.7738, 47.1933 ], [ 9.7854, 47.2034 ], [ 9.804, 47.2121 ], [ 9.8284, 47.2157 ], [ 9.8478, 47.2214 ], [ 9.8618, 47.2216 ], [ 9.8852, 47.2282 ], [ 9.9029, 47.2363 ], [ 9.9195, 47.2379 ], [ 9.9177, 47.251 ], [ 9.9062, 47.2659 ], [ 9.9054, 47.2812 ], [ 9.9269, 47.2877 ], [ 9.9406, 47.2957 ], [ 9.9527, 47.3097 ], [ 9.9762, 47.3239 ], [ 9.9763, 47.3237 ], [ 9.9772, 47.3234 ], [ 9.9794, 47.3225 ], [ 9.9807, 47.3221 ], [ 9.9842, 47.321 ], [ 9.9911, 47.3188 ], [ 9.9988, 47.316 ], [ 10.0072, 47.3128 ], [ 10.0138, 47.3097 ], [ 10.0193, 47.3075 ], [ 10.0244, 47.3054 ], [ 10.03, 47.304 ], [ 10.0344, 47.3034 ], [ 10.0357, 47.3029 ], [ 10.0365, 47.3025 ], [ 10.0386, 47.3008 ], [ 10.0409, 47.2985 ], [ 10.0414, 47.2979 ], [ 10.0442, 47.2939 ], [ 10.0456, 47.2918 ], [ 10.0462, 47.2899 ], [ 10.0461, 47.2885 ], [ 10.0459, 47.2873 ], [ 10.0465, 47.2859 ], [ 10.049, 47.2843 ], [ 10.0528, 47.2822 ], [ 10.0571, 47.2802 ], [ 10.0599, 47.278 ], [ 10.0622, 47.2751 ], [ 10.0632, 47.2725 ], [ 10.065, 47.2684 ], [ 10.067, 47.2658 ], [ 10.0693, 47.2639 ], [ 10.0733, 47.2623 ], [ 10.0786, 47.2612 ], [ 10.0829, 47.2602 ], [ 10.0869, 47.2588 ], [ 10.0889, 47.2576 ], [ 10.0953, 47.2579 ], [ 10.1101, 47.267 ], [ 10.1239, 47.2676 ], [ 10.1346, 47.2695 ], [ 10.1542, 47.2682 ], [ 10.1637, 47.2679 ], [ 10.1745, 47.2638 ], [ 10.193, 47.2597 ], [ 10.2105, 47.2558 ], [ 10.2135, 47.2554 ], [ 10.2172, 47.2547 ], [ 10.2196, 47.254 ], [ 10.2209, 47.2535 ], [ 10.2223, 47.2525 ], [ 10.2227, 47.2515 ], [ 10.223, 47.2506 ], [ 10.2233, 47.25 ], [ 10.2204, 47.2476 ], [ 10.2137, 47.2478 ], [ 10.2114, 47.2479 ], [ 10.2003, 47.2377 ], [ 10.198, 47.2356 ], [ 10.2075, 47.2324 ], [ 10.2079, 47.2319 ], [ 10.2082, 47.2314 ], [ 10.2105, 47.2278 ], [ 10.2094, 47.2256 ], [ 10.2093, 47.2254 ], [ 10.2095, 47.2252 ], [ 10.2126, 47.222 ], [ 10.2139, 47.2072 ] ] ] ] } },
{ "type": "Feature", "properties": { "id": "AT-08-06" }, "geometry": { "type": "MultiPolygon", "coordinates": [ [ [ [ 9.9139, 46.9366 ], [ 9.9114, 46.947 ], [ 9.9184, 46.9541 ], [ 9.92, 46.9717 ], [ 9.9476, 47.0014 ], [ 9.9558, 47.0179 ], [ 9.9631, 47.0234 ], [ 9.9632, 47.0234 ], [ 9.9642, 47.0224 ], [ 9.967, 47.0206 ], [ 9.9703, 47.0191 ], [ 9.9727, 47.0186 ], [ 9.9772, 47.018 ], [ 9.9828, 47.0169 ], [ 9.9867, 47.0158 ], [ 9.9906, 47.0132 ], [ 9.9933, 47.0112 ], [ 9.996, 47.0092 ], [ 10.0032, 47.0035 ], [ 10.0097, 46.9984 ], [ 10.0152, 46.9952 ], [ 10.0195, 46.9924 ], [ 10.0226, 46.9898 ], [ 10.0257, 46.9858 ], [ 10.0258, 46.9856 ], [ 10.031, 46.9819 ], [ 10.0355, 46.9789 ], [ 10.0419, 46.9749 ], [ 10.0477, 46.972 ], [ 10.0548, 46.969 ], [ 10.0643, 46.9667 ], [ 10.0695, 46.9656 ], [ 10.0719, 46.9652 ], [ 10.0736, 46.9646 ], [ 10.0749, 46.9636 ], [ 10.0867, 46.9652 ], [ 10.0974, 46.9713 ], [ 10.1237, 46.9716 ], [ 10.1311, 46.9757 ], [ 10.1338, 46.9766 ], [ 10.1363, 46.9772 ], [ 10.1384, 46.9773 ], [ 10.1402, 46.9771 ], [ 10.1368, 46.9724 ], [ 10.1359, 46.9639 ], [ 10.135, 46.9551 ], [ 10.1244, 46.9409 ], [ 10.1125, 46.9373 ], [ 10.0979, 46.9258 ], [ 10.099, 46.918 ], [ 10.1087, 46.9083 ], [ 10.1083, 46.8955 ], [ 10.1197, 46.883 ], [ 10.1407, 46.8747 ], [ 10.1387, 46.8676 ], [ 10.1451, 46.8509 ], [ 10.1401, 46.8474 ], [ 10.1228, 46.8481 ], [ 10.1189, 46.8442 ], [ 10.1054, 46.8409 ], [ 10.096139975015763, 46.84812621713823 ], [ 10.0919, 46.8514 ], [ 10.0914, 46.859 ], [ 10.0875, 46.8612 ], [ 10.0549, 46.8617 ], [ 10.0509, 46.8652 ], [ 10.052, 46.8767 ], [ 10.0323, 46.888 ], [ 10.0181, 46.9021 ], [ 10.0056, 46.899 ], [ 9.9903, 46.9024 ], [ 9.9821, 46.9067 ], [ 9.978, 46.9158 ], [ 9.967, 46.9122 ], [ 9.9592, 46.916 ], [ 9.9386, 46.9132 ], [ 9.923, 46.9183 ], [ 9.9123, 46.9261 ], [ 9.9146, 46.9338 ], [ 9.9139, 46.9366 ] ] ] ] } },
{ "type": "Feature", "properties": { "id": "AT-08-05" }, "geometry": { "type": "MultiPolygon", "coordinates": [ [ [ [ 9.6023, 47.1546 ], [ 9.5968, 47.1629 ], [ 9.5794, 47.1711 ], [ 9.5647, 47.1703 ], [ 9.5735, 47.1764 ], [ 9.5726, 47.1908 ], [ 9.5849, 47.2045 ], [ 9.5849, 47.2046 ], [ 9.5913, 47.2064 ], [ 9.5956, 47.2085 ], [ 9.5992, 47.2105 ], [ 9.6023, 47.2134 ], [ 9.6048, 47.2165 ], [ 9.6074, 47.2207 ], [ 9.6103, 47.2246 ], [ 9.6124, 47.2277 ], [ 9.6138, 47.2274 ], [ 9.6162, 47.227 ], [ 9.6218, 47.2255 ], [ 9.6263, 47.2247 ], [ 9.6312, 47.2246 ], [ 9.6357, 47.2247 ], [ 9.6389, 47.2245 ], [ 9.6427, 47.2238 ], [ 9.6472, 47.2223 ], [ 9.6518, 47.2198 ], [ 9.6576, 47.216 ], [ 9.6627, 47.2125 ], [ 9.666, 47.21 ], [ 9.669, 47.2076 ], [ 9.6771, 47.2026 ], [ 9.682, 47.2003 ], [ 9.69, 47.1977 ], [ 9.6949, 47.1961 ], [ 9.7022, 47.1949 ], [ 9.7073, 47.1938 ], [ 9.7122, 47.1925 ], [ 9.7154, 47.1908 ], [ 9.7198, 47.1879 ], [ 9.7247, 47.1849 ], [ 9.7273, 47.1839 ], [ 9.729, 47.1833 ], [ 9.7308, 47.1827 ], [ 9.7345, 47.1813 ], [ 9.7347, 47.1812 ], [ 9.7383, 47.1805 ], [ 9.7427, 47.1801 ], [ 9.751, 47.1791 ], [ 9.7626, 47.1772 ], [ 9.7673, 47.1763 ], [ 9.7737, 47.1747 ], [ 9.7751, 47.1742 ], [ 9.7828, 47.1713 ], [ 9.7831, 47.1712 ], [ 9.7878, 47.1687 ], [ 9.7898, 47.1677 ], [ 9.7984, 47.1628 ], [ 9.8061, 47.1584 ], [ 9.8134, 47.153 ], [ 9.8201, 47.1486 ], [ 9.8267, 47.144 ], [ 9.8316, 47.1393 ], [ 9.834, 47.1367 ], [ 9.8352, 47.1359 ], [ 9.8367, 47.1348 ], [ 9.837, 47.1345 ], [ 9.8403, 47.1334 ], [ 9.842, 47.1327 ], [ 9.845, 47.1321 ], [ 9.8476, 47.132 ], [ 9.8516, 47.1315 ], [ 9.8546, 47.1302 ], [ 9.8565, 47.1286 ], [ 9.8576, 47.1273 ], [ 9.8577, 47.1255 ], [ 9.8574, 47.1233 ], [ 9.8569, 47.1207 ], [ 9.857, 47.1183 ], [ 9.8577, 47.1171 ], [ 9.8592, 47.1153 ], [ 9.8614, 47.1131 ], [ 9.8628, 47.1112 ], [ 9.8644, 47.1087 ], [ 9.8651, 47.1057 ], [ 9.8661, 47.1009 ], [ 9.8672, 47.0981 ], [ 9.8687, 47.0961 ], [ 9.8716, 47.094 ], [ 9.8778, 47.0907 ], [ 9.8886, 47.0857 ], [ 9.8983, 47.0806 ], [ 9.9077, 47.0757 ], [ 9.9172, 47.0703 ], [ 9.9266, 47.0656 ], [ 9.9299, 47.0637 ], [ 9.9311, 47.063 ], [ 9.935, 47.0595 ], [ 9.9385, 47.0558 ], [ 9.9407, 47.0525 ], [ 9.9435, 47.0459 ], [ 9.9451, 47.0421 ], [ 9.9466, 47.0387 ], [ 9.949, 47.0355 ], [ 9.9517, 47.0333 ], [ 9.9554, 47.0302 ], [ 9.9599, 47.0264 ], [ 9.9631, 47.0234 ], [ 9.9558, 47.0179 ], [ 9.9476, 47.0014 ], [ 9.92, 46.9717 ], [ 9.9184, 46.9541 ], [ 9.9114, 46.947 ], [ 9.9139, 46.9366 ], [ 9.9146, 46.9338 ], [ 9.9123, 46.9261 ], [ 9.9064, 46.9252 ], [ 9.8807, 46.9352 ], [ 9.8767, 46.9478 ], [ 9.8793, 46.9566 ], [ 9.8708, 46.9632 ], [ 9.8849, 46.9856 ], [ 9.8916, 46.9888 ], [ 9.8888, 47.0008 ], [ 9.8734, 47.0064 ], [ 9.8711, 47.0135 ], [ 9.8814, 47.0183 ], [ 9.8769, 47.0215 ], [ 9.8616, 47.0223 ], [ 9.8361, 47.0134 ], [ 9.7929, 47.0314 ], [ 9.7843, 47.0383 ], [ 9.7473, 47.0373 ], [ 9.742, 47.0428 ], [ 9.7171, 47.0448 ], [ 9.7066, 47.0487 ], [ 9.7075, 47.0538 ], [ 9.6979, 47.0524 ], [ 9.6839, 47.0577 ], [ 9.6819, 47.0621 ], [ 9.6775, 47.0614 ], [ 9.6585, 47.0576 ], [ 9.6451, 47.0598 ], [ 9.6415, 47.0541 ], [ 9.6404, 47.0538 ], [ 9.6299, 47.0514 ], [ 9.6172, 47.0536 ], [ 9.6071, 47.0608 ], [ 9.6135, 47.0695 ], [ 9.6115, 47.0794 ], [ 9.6187, 47.0781 ], [ 9.6235, 47.0825 ], [ 9.6269, 47.0828 ], [ 9.6336, 47.0834 ], [ 9.6354, 47.0906 ], [ 9.6344, 47.1011 ], [ 9.6316, 47.1031 ], [ 9.6209, 47.1107 ], [ 9.6337, 47.1268 ], [ 9.6247, 47.1326 ], [ 9.6248, 47.146 ], [ 9.6206, 47.1515 ], [ 9.6149, 47.1478 ], [ 9.6062, 47.1487 ], [ 9.6023, 47.1546 ] ] ] ] } },
{ "type": "Feature", "properties": { "id": "AT-08-04" }, "geometry": { "type": "MultiPolygon", "coordinates": [ [ [ [ 10.1999, 47.1306 ], [ 10.1866, 47.1291 ], [ 10.1867, 47.1196 ], [ 10.172, 47.12 ], [ 10.1627, 47.1141 ], [ 10.1623, 47.1142 ], [ 10.1583, 47.1147 ], [ 10.1339, 47.0825 ], [ 10.1338, 47.0775 ], [ 10.1347, 47.0647 ], [ 10.151, 47.062 ], [ 10.1569, 47.0491 ], [ 10.1445, 47.0338 ], [ 10.1346, 47.0293 ], [ 10.1229, 47.0224 ], [ 10.1314, 47.0129 ], [ 10.1542, 47.0053 ], [ 10.1593, 46.999 ], [ 10.1554, 46.9911 ], [ 10.1592, 46.9838 ], [ 10.1449, 46.9835 ], [ 10.1441, 46.9824 ], [ 10.1413, 46.9785 ], [ 10.141, 46.9782 ], [ 10.141, 46.9781 ], [ 10.1409, 46.978 ], [ 10.1402, 46.9771 ], [ 10.1384, 46.9773 ], [ 10.1363, 46.9772 ], [ 10.1338, 46.9766 ], [ 10.1311, 46.9757 ], [ 10.1237, 46.9716 ], [ 10.0974, 46.9713 ], [ 10.0867, 46.9652 ], [ 10.0749, 46.9636 ], [ 10.0736, 46.9646 ], [ 10.0719, 46.9652 ], [ 10.0695, 46.9656 ], [ 10.0643, 46.9667 ], [ 10.0548, 46.969 ], [ 10.0477, 46.972 ], [ 10.0419, 46.9749 ], [ 10.0355, 46.9789 ], [ 10.031, 46.9819 ], [ 10.0258, 46.9856 ], [ 10.0257, 46.9858 ], [ 10.0226, 46.9898 ], [ 10.0195, 46.9924 ], [ 10.0152, 46.9952 ], [ 10.0097, 46.9984 ], [ 10.0032, 47.0035 ], [ 9.996, 47.0092 ], [ 9.9933, 47.0112 ], [ 9.9906, 47.0132 ], [ 9.9867, 47.0158 ], [ 9.9828, 47.0169 ], [ 9.9772, 47.018 ], [ 9.9727, 47.0186 ], [ 9.9703, 47.0191 ], [ 9.967, 47.0206 ], [ 9.9642, 47.0224 ], [ 9.9632, 47.0234 ], [ 9.9631, 47.0234 ], [ 9.9599, 47.0264 ], [ 9.9554, 47.0302 ], [ 9.9517, 47.0333 ], [ 9.949, 47.0355 ], [ 9.9466, 47.0387 ], [ 9.9451, 47.0421 ], [ 9.9435, 47.0459 ], [ 9.9407, 47.0525 ], [ 9.9385, 47.0558 ], [ 9.935, 47.0595 ], [ 9.9311, 47.063 ], [ 9.9299, 47.0637 ], [ 9.9266, 47.0656 ], [ 9.9172, 47.0703 ], [ 9.9077, 47.0757 ], [ 9.8983, 47.0806 ], [ 9.8886, 47.0857 ], [ 9.8778, 47.0907 ], [ 9.8716, 47.094 ], [ 9.8687, 47.0961 ], [ 9.8672, 47.0981 ], [ 9.8661, 47.1009 ], [ 9.8651, 47.1057 ], [ 9.8644, 47.1087 ], [ 9.8628, 47.1112 ], [ 9.8614, 47.1131 ], [ 9.8592, 47.1153 ], [ 9.8577, 47.1171 ], [ 9.857, 47.1183 ], [ 9.8569, 47.1207 ], [ 9.8574, 47.1233 ], [ 9.8577, 47.1255 ], [ 9.8576, 47.1273 ], [ 9.8565, 47.1286 ], [ 9.8546, 47.1302 ], [ 9.8516, 47.1315 ], [ 9.8476, 47.132 ], [ 9.845, 47.1321 ], [ 9.842, 47.1327 ], [ 9.8403, 47.1334 ], [ 9.837, 47.1345 ], [ 9.8367, 47.1348 ], [ 9.8453, 47.1354 ], [ 9.8554, 47.1401 ], [ 9.8778, 47.1396 ], [ 9.8948, 47.1433 ], [ 9.922, 47.1416 ], [ 9.9893, 47.1229 ], [ 10.0062, 47.1234 ], [ 10.0396, 47.1286 ], [ 10.086, 47.1314 ], [ 10.1185, 47.1309 ], [ 10.142, 47.1363 ], [ 10.1864, 47.1381 ], [ 10.2018, 47.1365 ], [ 10.204, 47.1366 ], [ 10.2093, 47.1317 ], [ 10.1999, 47.1306 ] ] ] ] } }
]
}
