Date,Daytime,Subregion,DangerRatingAbove,DangerRatingBelow,DangerRatingElevation
15.12.2011,AM,BYALL,1,1,
15.12.2011,AM,BYAMM,1,1,
15.12.2011,AM,BYWFK,1,1,
15.12.2011,AM,BYBVA,1,1,
15.12.2011,AM,BYCHG,1,1,
15.12.2011,AM,BYBGD,1,1,
16.12.2011,AM,BYALL,1,1,
16.12.2011,AM,BYAMM,1,1,
16.12.2011,AM,BYWFK,1,1,
16.12.2011,AM,BYBVA,1,1,
16.12.2011,AM,BYCHG,1,1,
16.12.2011,AM,BYBGD,1,1,
16.12.2011,PM,BYALL,2,1,treeline
16.12.2011,PM,BYAMM,2,1,treeline
16.12.2011,PM,BYWFK,2,1,treeline
16.12.2011,PM,BYBVA,2,1,treeline
16.12.2011,PM,BYCHG,2,1,treeline
16.12.2011,PM,BYBGD,2,1,treeline
17.12.2011,AM,BYALL,2,1,treeline
17.12.2011,AM,BYAMM,1,1,
17.12.2011,AM,BYWFK,1,1,
17.12.2011,AM,BYBVA,1,1,
17.12.2011,AM,BYCHG,1,1,
17.12.2011,AM,BYBGD,1,1,
18.12.2011,AM,BYALL,2,1,treeline
18.12.2011,AM,BYAMM,2,1,treeline
18.12.2011,AM,BYWFK,3,1,treeline
18.12.2011,AM,BYBVA,2,1,treeline
18.12.2011,AM,BYCHG,2,1,treeline
18.12.2011,AM,BYBGD,3,1,treeline
19.12.2011,AM,BYALL,2,1,2000
19.12.2011,AM,BYAMM,2,1,2000
19.12.2011,AM,BYWFK,3,1,2000
19.12.2011,AM,BYBVA,1,1,
19.12.2011,AM,BYCHG,1,1,
19.12.2011,AM,BYBGD,2,1,2000
20.12.2011,AM,BYALL,2,1,2000
20.12.2011,AM,BYAMM,2,1,2000
20.12.2011,AM,BYWFK,2,1,2000
20.12.2011,AM,BYBVA,1,1,
20.12.2011,AM,BYCHG,1,1,
20.12.2011,AM,BYBGD,2,1,2000
21.12.2011,AM,BYALL,3,3,
21.12.2011,AM,BYAMM,3,2,1600
21.12.2011,AM,BYWFK,3,2,1600
21.12.2011,AM,BYBVA,3,2,1600
21.12.2011,AM,BYCHG,3,2,1600
21.12.2011,AM,BYBGD,3,2,1600
22.12.2011,AM,BYALL,3,2,1400
22.12.2011,AM,BYAMM,3,2,1400
22.12.2011,AM,BYWFK,3,2,1400
22.12.2011,AM,BYBVA,3,2,1400
22.12.2011,AM,BYCHG,3,2,1400
22.12.2011,AM,BYBGD,3,2,1400
22.12.2011,PM,BYALL,3,3,
22.12.2011,PM,BYAMM,3,3,
22.12.2011,PM,BYWFK,3,3,
22.12.2011,PM,BYBVA,3,3,
22.12.2011,PM,BYCHG,3,3,
22.12.2011,PM,BYBGD,3,3,
23.12.2011,AM,BYALL,4,4,
23.12.2011,AM,BYAMM,3,3,
23.12.2011,AM,BYWFK,3,3,
23.12.2011,AM,BYBVA,3,3,
23.12.2011,AM,BYCHG,3,3,
23.12.2011,AM,BYBGD,3,3,
24.12.2011,AM,BYALL,2,2,
24.12.2011,AM,BYAMM,2,2,
24.12.2011,AM,BYWFK,2,2,
24.12.2011,AM,BYBVA,2,2,
24.12.2011,AM,BYCHG,2,2,
24.12.2011,AM,BYBGD,2,2,
25.12.2011,AM,BYALL,2,1,treeline
25.12.2011,AM,BYAMM,2,1,treeline
25.12.2011,AM,BYWFK,2,1,treeline
25.12.2011,AM,BYBVA,2,1,treeline
25.12.2011,AM,BYCHG,2,1,treeline
25.12.2011,AM,BYBGD,2,1,treeline
26.12.2011,AM,BYALL,2,1,treeline
26.12.2011,AM,BYAMM,2,1,treeline
26.12.2011,AM,BYWFK,2,1,treeline
26.12.2011,AM,BYBVA,1,1,
26.12.2011,AM,BYCHG,1,1,
26.12.2011,AM,BYBGD,2,1,treeline
27.12.2011,AM,BYALL,2,2,
27.12.2011,AM,BYAMM,2,1,1800
27.12.2011,AM,BYWFK,2,1,1800
27.12.2011,AM,BYBVA,1,1,
27.12.2011,AM,BYCHG,1,1,
27.12.2011,AM,BYBGD,2,1,1800
28.12.2011,AM,BYALL,2,2,
28.12.2011,AM,BYAMM,2,1,1800
28.12.2011,AM,BYWFK,2,1,1800
28.12.2011,AM,BYBVA,1,1,
28.12.2011,AM,BYCHG,1,1,
28.12.2011,AM,BYBGD,2,1,1800
28.12.2011,PM,BYAMM,2,2,
28.12.2011,PM,BYWFK,2,2,
28.12.2011,PM,BYBVA,2,2,
28.12.2011,PM,BYCHG,2,2,
28.12.2011,PM,BYBGD,2,2,
29.12.2011,AM,BYALL,2,1,1800
29.12.2011,AM,BYAMM,2,1,1800
29.12.2011,AM,BYWFK,2,1,1800
29.12.2011,AM,BYBVA,2,1,1800
29.12.2011,AM,BYCHG,2,1,1800
29.12.2011,AM,BYBGD,2,1,1800
29.12.2011,PM,BYALL,3,1,1800
29.12.2011,PM,BYAMM,3,1,1800
29.12.2011,PM,BYWFK,3,1,1800
29.12.2011,PM,BYBVA,3,1,1800
29.12.2011,PM,BYCHG,3,1,1800
29.12.2011,PM,BYBGD,3,1,1800
30.12.2011,AM,BYALL,3,1,treeline
30.12.2011,AM,BYAMM,3,1,treeline
30.12.2011,AM,BYWFK,2,1,treeline
30.12.2011,AM,BYBVA,2,1,treeline
30.12.2011,AM,BYCHG,2,1,treeline
30.12.2011,AM,BYBGD,2,1,treeline
30.12.2011,PM,BYALL,3,2,treeline
30.12.2011,PM,BYAMM,3,2,treeline
30.12.2011,PM,BYWFK,3,2,treeline
30.12.2011,PM,BYBVA,3,2,treeline
30.12.2011,PM,BYCHG,3,2,treeline
30.12.2011,PM,BYBGD,3,2,treeline
31.12.2011,AM,BYALL,3,2,treeline
31.12.2011,AM,BYAMM,3,2,treeline
31.12.2011,AM,BYWFK,3,2,treeline
31.12.2011,AM,BYBVA,3,2,treeline
31.12.2011,AM,BYCHG,3,2,treeline
31.12.2011,AM,BYBGD,3,2,treeline
31.12.2011,PM,BYALL,4,3,treeline
01.01.2012,AM,BYALL,4,4,
01.01.2012,AM,BYAMM,4,4,
01.01.2012,AM,BYWFK,4,4,
01.01.2012,AM,BYBVA,3,3,
01.01.2012,AM,BYCHG,3,3,
01.01.2012,AM,BYBGD,3,3,
02.01.2012,AM,BYALL,3,2,treeline
02.01.2012,AM,BYAMM,2,2,
02.01.2012,AM,BYWFK,2,2,
02.01.2012,AM,BYBVA,2,2,
02.01.2012,AM,BYCHG,2,2,
02.01.2012,AM,BYBGD,2,2,
02.01.2012,PM,BYALL,3,3,
02.01.2012,PM,BYAMM,2,3,treeline
02.01.2012,PM,BYWFK,2,3,treeline
02.01.2012,PM,BYBVA,2,3,treeline
02.01.2012,PM,BYCHG,2,3,treeline
02.01.2012,PM,BYBGD,2,3,treeline
03.01.2012,AM,BYALL,2,2,
03.01.2012,AM,BYAMM,2,1,treeline
03.01.2012,AM,BYWFK,2,1,treeline
03.01.2012,AM,BYBVA,2,1,treeline
03.01.2012,AM,BYCHG,2,1,treeline
03.01.2012,AM,BYBGD,2,1,treeline
03.01.2012,PM,BYAMM,2,2,
03.01.2012,PM,BYWFK,2,2,
03.01.2012,PM,BYBVA,2,2,
03.01.2012,PM,BYCHG,2,2,
03.01.2012,PM,BYBGD,2,2,
04.01.2012,AM,BYALL,2,2,
04.01.2012,AM,BYAMM,2,2,
04.01.2012,AM,BYWFK,2,2,
04.01.2012,AM,BYBVA,2,2,
04.01.2012,AM,BYCHG,2,2,
04.01.2012,AM,BYBGD,2,2,
04.01.2012,PM,BYALL,3,2,treeline
04.01.2012,PM,BYAMM,3,2,treeline
04.01.2012,PM,BYWFK,3,2,treeline
05.01.2012,AM,BYALL,3,2,treeline
05.01.2012,AM,BYAMM,3,2,treeline
05.01.2012,AM,BYWFK,3,2,treeline
05.01.2012,AM,BYBVA,2,2,
05.01.2012,AM,BYCHG,2,2,
05.01.2012,AM,BYBGD,3,2,treeline
05.01.2012,PM,BYBVA,3,2,treeline
05.01.2012,PM,BYCHG,3,2,treeline
06.01.2012,AM,BYALL,4,3,treeline
06.01.2012,AM,BYAMM,4,3,treeline
06.01.2012,AM,BYWFK,4,3,treeline
06.01.2012,AM,BYBVA,3,2,treeline
06.01.2012,AM,BYCHG,3,2,treeline
06.01.2012,AM,BYBGD,3,2,treeline
06.01.2012,PM,BYBVA,4,2,treeline
06.01.2012,PM,BYCHG,4,2,treeline
06.01.2012,PM,BYBGD,4,2,treeline
07.01.2012,AM,BYALL,4,3,treeline
07.01.2012,AM,BYAMM,4,3,treeline
07.01.2012,AM,BYWFK,4,3,treeline
07.01.2012,AM,BYBVA,3,2,treeline
07.01.2012,AM,BYCHG,3,2,treeline
07.01.2012,AM,BYBGD,3,2,treeline
07.01.2012,PM,BYBVA,4,2,treeline
07.01.2012,PM,BYCHG,4,2,treeline
07.01.2012,PM,BYBGD,4,2,treeline
08.01.2012,AM,BYALL,3,2,treeline
08.01.2012,AM,BYAMM,3,2,treeline
08.01.2012,AM,BYWFK,4,3,treeline
08.01.2012,AM,BYBVA,3,2,treeline
08.01.2012,AM,BYCHG,3,2,treeline
08.01.2012,AM,BYBGD,3,2,treeline
09.01.2012,AM,BYALL,4,3,treeline
09.01.2012,AM,BYAMM,4,3,treeline
09.01.2012,AM,BYWFK,4,3,treeline
09.01.2012,AM,BYBVA,3,2,treeline
09.01.2012,AM,BYCHG,3,2,treeline
09.01.2012,AM,BYBGD,4,3,treeline
10.01.2012,AM,BYALL,3,4,1800
10.01.2012,AM,BYAMM,3,4,1800
10.01.2012,AM,BYWFK,3,4,1800
10.01.2012,AM,BYBVA,3,3,
10.01.2012,AM,BYCHG,3,3,
10.01.2012,AM,BYBGD,3,4,1800
11.01.2012,AM,BYALL,2,3,1800
11.01.2012,AM,BYAMM,2,3,1800
11.01.2012,AM,BYWFK,2,3,1800
11.01.2012,AM,BYBVA,2,3,1800
11.01.2012,AM,BYCHG,2,3,1800
11.01.2012,AM,BYBGD,2,4,1800
11.01.2012,PM,BYALL,2,4,1800
11.01.2012,PM,BYAMM,2,4,1800
11.01.2012,PM,BYWFK,2,4,1800
11.01.2012,PM,BYBVA,2,4,1800
11.01.2012,PM,BYCHG,2,4,1800
12.01.2012,AM,BYALL,2,2,
12.01.2012,AM,BYAMM,2,2,
12.01.2012,AM,BYWFK,2,2,
12.01.2012,AM,BYBVA,2,2,
12.01.2012,AM,BYCHG,2,2,
12.01.2012,AM,BYBGD,2,2,
13.01.2012,AM,BYALL,2,2,
13.01.2012,AM,BYAMM,2,2,
13.01.2012,AM,BYWFK,2,2,
13.01.2012,AM,BYBVA,2,2,
13.01.2012,AM,BYCHG,2,2,
13.01.2012,AM,BYBGD,3,2,treeline
14.01.2012,AM,BYALL,2,1,treeline
14.01.2012,AM,BYAMM,2,1,treeline
14.01.2012,AM,BYWFK,3,1,treeline
14.01.2012,AM,BYBVA,3,1,treeline
14.01.2012,AM,BYCHG,3,1,treeline
14.01.2012,AM,BYBGD,3,1,treeline
15.01.2012,AM,BYALL,2,1,treeline
15.01.2012,AM,BYAMM,2,1,treeline
15.01.2012,AM,BYWFK,3,1,treeline
15.01.2012,AM,BYBVA,3,1,treeline
15.01.2012,AM,BYCHG,3,1,treeline
15.01.2012,AM,BYBGD,3,2,treeline
16.01.2012,AM,BYALL,2,1,2000
16.01.2012,AM,BYAMM,2,1,2000
16.01.2012,AM,BYWFK,2,1,2000
16.01.2012,AM,BYBVA,1,1,
16.01.2012,AM,BYCHG,1,1,
16.01.2012,AM,BYBGD,2,1,2000
17.01.2012,AM,BYALL,2,1,2000
17.01.2012,AM,BYAMM,2,1,2000
17.01.2012,AM,BYWFK,2,1,2000
17.01.2012,AM,BYBVA,1,1,
17.01.2012,AM,BYCHG,1,1,
17.01.2012,AM,BYBGD,2,1,2000
18.01.2012,AM,BYALL,2,2,
18.01.2012,AM,BYAMM,2,1,1800
18.01.2012,AM,BYWFK,2,1,1800
18.01.2012,AM,BYBVA,3,1,1800
18.01.2012,AM,BYCHG,3,1,1800
18.01.2012,AM,BYBGD,3,1,1800
19.01.2012,AM,BYALL,2,2,
19.01.2012,AM,BYAMM,2,2,
19.01.2012,AM,BYWFK,2,2,
19.01.2012,AM,BYBVA,2,2,
19.01.2012,AM,BYCHG,2,2,
19.01.2012,AM,BYBGD,2,2,
19.01.2012,PM,BYALL,3,3,
19.01.2012,PM,BYAMM,3,3,
19.01.2012,PM,BYWFK,3,3,
19.01.2012,PM,BYBVA,3,3,
19.01.2012,PM,BYCHG,3,3,
19.01.2012,PM,BYBGD,3,3,
20.01.2012,AM,BYALL,3,4,1800
20.01.2012,AM,BYAMM,3,3,
20.01.2012,AM,BYWFK,3,3,
20.01.2012,AM,BYBVA,3,3,
20.01.2012,AM,BYCHG,3,3,
20.01.2012,AM,BYBGD,3,3,
21.01.2012,AM,BYALL,4,4,
21.01.2012,AM,BYAMM,4,4,
21.01.2012,AM,BYWFK,4,4,
21.01.2012,AM,BYBVA,4,4,
21.01.2012,AM,BYCHG,4,4,
21.01.2012,AM,BYBGD,4,4,
22.01.2012,AM,BYALL,4,4,
22.01.2012,AM,BYAMM,3,3,
22.01.2012,AM,BYWFK,3,3,
22.01.2012,AM,BYBVA,3,3,
22.01.2012,AM,BYCHG,3,3,
22.01.2012,AM,BYBGD,3,3,
23.01.2012,AM,BYALL,3,3,
23.01.2012,AM,BYAMM,3,2,treeline
23.01.2012,AM,BYWFK,3,2,treeline
23.01.2012,AM,BYBVA,3,2,treeline
23.01.2012,AM,BYCHG,3,2,treeline
23.01.2012,AM,BYBGD,3,3,
24.01.2012,AM,BYALL,4,4,
24.01.2012,AM,BYAMM,3,2,treeline
24.01.2012,AM,BYWFK,3,2,treeline
24.01.2012,AM,BYBVA,3,2,treeline
24.01.2012,AM,BYCHG,3,2,treeline
24.01.2012,AM,BYBGD,3,2,treeline
25.01.2012,AM,BYALL,3,3,
25.01.2012,AM,BYAMM,3,2,treeline
25.01.2012,AM,BYWFK,3,2,treeline
25.01.2012,AM,BYBVA,3,2,treeline
25.01.2012,AM,BYCHG,3,2,treeline
25.01.2012,AM,BYBGD,3,2,treeline
25.01.2012,PM,BYALL,4,4,
26.01.2012,AM,BYALL,3,3,
26.01.2012,AM,BYAMM,3,2,treeline
26.01.2012,AM,BYWFK,3,2,treeline
26.01.2012,AM,BYBVA,3,2,treeline
26.01.2012,AM,BYCHG,3,2,treeline
26.01.2012,AM,BYBGD,3,2,treeline
27.01.2012,AM,BYALL,2,2,
27.01.2012,AM,BYAMM,2,2,
27.01.2012,AM,BYWFK,2,2,
27.01.2012,AM,BYBVA,2,2,
27.01.2012,AM,BYCHG,2,2,
27.01.2012,AM,BYBGD,2,2,
28.01.2012,AM,BYALL,2,2,
28.01.2012,AM,BYAMM,2,2,
28.01.2012,AM,BYWFK,2,2,
28.01.2012,AM,BYBVA,2,2,
28.01.2012,AM,BYCHG,2,2,
28.01.2012,AM,BYBGD,2,2,
29.01.2012,AM,BYALL,2,1,1800
29.01.2012,AM,BYAMM,2,1,1800
29.01.2012,AM,BYWFK,2,1,1800
29.01.2012,AM,BYBVA,2,1,1800
29.01.2012,AM,BYCHG,2,1,1800
29.01.2012,AM,BYBGD,2,1,1800
29.01.2012,PM,BYALL,2,2,
29.01.2012,PM,BYAMM,2,2,
29.01.2012,PM,BYWFK,2,2,
29.01.2012,PM,BYBVA,2,2,
29.01.2012,PM,BYCHG,2,2,
29.01.2012,PM,BYBGD,2,2,
30.01.2012,AM,BYALL,2,2,
30.01.2012,AM,BYAMM,2,1,1800
30.01.2012,AM,BYWFK,2,1,1800
30.01.2012,AM,BYBVA,2,1,1800
30.01.2012,AM,BYCHG,2,1,1800
30.01.2012,AM,BYBGD,2,1,1800
31.01.2012,AM,BYALL,1,2,treeline
31.01.2012,AM,BYAMM,1,1,
31.01.2012,AM,BYWFK,1,1,
31.01.2012,AM,BYBVA,1,1,
31.01.2012,AM,BYCHG,1,1,
31.01.2012,AM,BYBGD,2,1,treeline
01.02.2012,AM,BYALL,1,2,treeline
01.02.2012,AM,BYAMM,1,2,treeline
01.02.2012,AM,BYWFK,1,2,treeline
01.02.2012,AM,BYBVA,1,2,treeline
01.02.2012,AM,BYCHG,1,2,treeline
01.02.2012,AM,BYBGD,2,2,
02.02.2012,AM,BYALL,1,2,treeline
02.02.2012,AM,BYAMM,1,2,treeline
02.02.2012,AM,BYWFK,2,2,
02.02.2012,AM,BYBVA,1,2,treeline
02.02.2012,AM,BYCHG,1,2,treeline
02.02.2012,AM,BYBGD,2,2,
03.02.2012,AM,BYALL,1,2,treeline
03.02.2012,AM,BYAMM,1,2,treeline
03.02.2012,AM,BYWFK,2,2,
03.02.2012,AM,BYBVA,1,2,treeline
03.02.2012,AM,BYCHG,1,2,treeline
03.02.2012,AM,BYBGD,2,2,
04.02.2012,AM,BYALL,2,2,
04.02.2012,AM,BYAMM,2,2,
04.02.2012,AM,BYWFK,2,2,
04.02.2012,AM,BYBVA,2,2,
04.02.2012,AM,BYCHG,2,2,
04.02.2012,AM,BYBGD,2,2,
05.02.2012,AM,BYALL,2,2,
05.02.2012,AM,BYAMM,2,2,
05.02.2012,AM,BYWFK,2,2,
05.02.2012,AM,BYBVA,2,2,
05.02.2012,AM,BYCHG,2,2,
05.02.2012,AM,BYBGD,2,2,
06.02.2012,AM,BYALL,2,2,
06.02.2012,AM,BYAMM,2,2,
06.02.2012,AM,BYWFK,2,2,
06.02.2012,AM,BYBVA,2,2,
06.02.2012,AM,BYCHG,2,2,
06.02.2012,AM,BYBGD,2,2,
07.02.2012,AM,BYALL,2,2,
07.02.2012,AM,BYAMM,2,1,1600
07.02.2012,AM,BYWFK,2,1,1600
07.02.2012,AM,BYBVA,2,1,1600
07.02.2012,AM,BYCHG,2,1,1600
07.02.2012,AM,BYBGD,2,1,1600
08.02.2012,AM,BYALL,3,2,1800
08.02.2012,AM,BYAMM,3,1,1800
08.02.2012,AM,BYWFK,3,1,1800
08.02.2012,AM,BYBVA,3,1,1800
08.02.2012,AM,BYCHG,3,1,1800
08.02.2012,AM,BYBGD,3,1,1800
09.02.2012,AM,BYALL,3,2,1800
09.02.2012,AM,BYAMM,3,1,1800
09.02.2012,AM,BYWFK,3,1,1800
09.02.2012,AM,BYBVA,3,1,1800
09.02.2012,AM,BYCHG,3,1,1800
09.02.2012,AM,BYBGD,3,1,1800
10.02.2012,AM,BYALL,2,2,
10.02.2012,AM,BYAMM,2,1,2000
10.02.2012,AM,BYWFK,3,1,2000
10.02.2012,AM,BYBVA,1,1,
10.02.2012,AM,BYCHG,1,1,
10.02.2012,AM,BYBGD,3,1,2000
11.02.2012,AM,BYALL,3,2,1800
11.02.2012,AM,BYAMM,3,1,1800
11.02.2012,AM,BYWFK,3,1,1800
11.02.2012,AM,BYBVA,2,1,1800
11.02.2012,AM,BYCHG,2,1,1800
11.02.2012,AM,BYBGD,3,1,1800
12.02.2012,AM,BYALL,3,2,1800
12.02.2012,AM,BYAMM,3,1,1800
12.02.2012,AM,BYWFK,3,1,1800
12.02.2012,AM,BYBVA,2,1,1800
12.02.2012,AM,BYCHG,2,1,1800
12.02.2012,AM,BYBGD,3,1,1800
13.02.2012,AM,BYALL,2,2,
13.02.2012,AM,BYAMM,2,1,1800
13.02.2012,AM,BYWFK,2,1,1800
13.02.2012,AM,BYBVA,2,1,1800
13.02.2012,AM,BYCHG,2,1,1800
13.02.2012,AM,BYBGD,2,1,1800
14.02.2012,AM,BYALL,3,2,treeline
14.02.2012,AM,BYAMM,3,1,treeline
14.02.2012,AM,BYWFK,3,1,treeline
14.02.2012,AM,BYBVA,3,1,treeline
14.02.2012,AM,BYCHG,2,1,treeline
14.02.2012,AM,BYBGD,2,1,treeline
15.02.2012,AM,BYALL,4,4,
15.02.2012,AM,BYAMM,4,4,
15.02.2012,AM,BYWFK,4,4,
15.02.2012,AM,BYBVA,4,4,
15.02.2012,AM,BYCHG,4,4,
15.02.2012,AM,BYBGD,4,4,
16.02.2012,AM,BYALL,4,4,
16.02.2012,AM,BYAMM,4,4,
16.02.2012,AM,BYWFK,4,4,
16.02.2012,AM,BYBVA,4,4,
16.02.2012,AM,BYCHG,4,4,
16.02.2012,AM,BYBGD,4,4,
17.02.2012,AM,BYALL,4,4,
17.02.2012,AM,BYAMM,4,4,
17.02.2012,AM,BYWFK,4,4,
17.02.2012,AM,BYBVA,4,4,
17.02.2012,AM,BYCHG,4,4,
17.02.2012,AM,BYBGD,4,4,
18.02.2012,AM,BYALL,4,4,
18.02.2012,AM,BYAMM,4,4,
18.02.2012,AM,BYWFK,4,4,
18.02.2012,AM,BYBVA,4,4,
18.02.2012,AM,BYCHG,4,4,
18.02.2012,AM,BYBGD,4,4,
19.02.2012,AM,BYALL,3,3,
19.02.2012,AM,BYAMM,3,3,
19.02.2012,AM,BYWFK,3,3,
19.02.2012,AM,BYBVA,3,3,
19.02.2012,AM,BYCHG,3,2,treeline
19.02.2012,AM,BYBGD,3,2,treeline
20.02.2012,AM,BYALL,3,2,1500
20.02.2012,AM,BYAMM,3,2,1500
20.02.2012,AM,BYWFK,3,2,1500
20.02.2012,AM,BYBVA,3,2,1500
20.02.2012,AM,BYCHG,3,2,1500
20.02.2012,AM,BYBGD,3,2,1500
21.02.2012,AM,BYALL,3,2,1800
21.02.2012,AM,BYAMM,3,2,1800
21.02.2012,AM,BYWFK,3,2,1800
21.02.2012,AM,BYBVA,2,2,
21.02.2012,AM,BYCHG,2,2,
21.02.2012,AM,BYBGD,3,2,1800
22.02.2012,AM,BYALL,2,2,
22.02.2012,AM,BYAMM,2,2,
22.02.2012,AM,BYWFK,2,2,
22.02.2012,AM,BYBVA,2,2,
22.02.2012,AM,BYCHG,2,2,
22.02.2012,AM,BYBGD,2,2,
23.02.2012,AM,BYALL,2,2,
23.02.2012,AM,BYAMM,2,2,
23.02.2012,AM,BYWFK,2,2,
23.02.2012,AM,BYBVA,2,2,
23.02.2012,AM,BYCHG,2,2,
23.02.2012,AM,BYBGD,2,2,
24.02.2012,AM,BYALL,2,3,1700
24.02.2012,AM,BYAMM,2,3,1700
24.02.2012,AM,BYWFK,2,3,1700
24.02.2012,AM,BYBVA,2,3,1700
24.02.2012,AM,BYCHG,2,3,1700
24.02.2012,AM,BYBGD,2,3,1700
25.02.2012,AM,BYALL,2,3,1700
25.02.2012,AM,BYAMM,2,3,1700
25.02.2012,AM,BYWFK,2,3,1700
25.02.2012,AM,BYBVA,2,3,1700
25.02.2012,AM,BYCHG,2,3,1700
25.02.2012,AM,BYBGD,2,3,1700
25.02.2012,PM,BYALL,2,4,1700
25.02.2012,PM,BYAMM,2,4,1700
25.02.2012,PM,BYWFK,2,4,1700
25.02.2012,PM,BYBVA,2,4,1700
25.02.2012,PM,BYCHG,2,4,1700
25.02.2012,PM,BYBGD,2,4,1700
26.02.2012,AM,BYALL,2,3,1700
26.02.2012,AM,BYAMM,2,3,1700
26.02.2012,AM,BYWFK,2,3,1700
26.02.2012,AM,BYBVA,2,3,1700
26.02.2012,AM,BYCHG,2,3,1700
26.02.2012,AM,BYBGD,2,3,1700
27.02.2012,AM,BYALL,2,2,
27.02.2012,AM,BYAMM,2,2,
27.02.2012,AM,BYWFK,3,2,treeline
27.02.2012,AM,BYBVA,3,2,treeline
27.02.2012,AM,BYCHG,3,2,treeline
27.02.2012,AM,BYBGD,3,2,treeline
28.02.2012,AM,BYALL,2,2,
28.02.2012,AM,BYAMM,2,2,
28.02.2012,AM,BYWFK,3,2,treeline
28.02.2012,AM,BYBVA,2,2,
28.02.2012,AM,BYCHG,2,2,
28.02.2012,AM,BYBGD,3,2,treeline
29.02.2012,AM,BYALL,2,2,
29.02.2012,AM,BYAMM,2,2,
29.02.2012,AM,BYWFK,2,2,
29.02.2012,AM,BYBVA,2,2,
29.02.2012,AM,BYCHG,2,3,1600
29.02.2012,AM,BYBGD,2,3,1600
29.02.2012,PM,BYALL,2,3,1600
29.02.2012,PM,BYAMM,2,3,1600
29.02.2012,PM,BYWFK,2,3,1600
29.02.2012,PM,BYBVA,2,3,1600
01.03.2012,AM,BYALL,2,3,2000
01.03.2012,AM,BYAMM,2,3,2000
01.03.2012,AM,BYWFK,2,3,2000
01.03.2012,AM,BYBVA,2,3,2000
01.03.2012,AM,BYCHG,2,3,2000
01.03.2012,AM,BYBGD,2,3,2000
02.03.2012,AM,BYALL,2,2,
02.03.2012,AM,BYAMM,2,2,
02.03.2012,AM,BYWFK,2,2,
02.03.2012,AM,BYBVA,2,2,
02.03.2012,AM,BYCHG,2,2,
02.03.2012,AM,BYBGD,2,2,
02.03.2012,PM,BYALL,2,3,2200
02.03.2012,PM,BYAMM,2,3,2200
02.03.2012,PM,BYWFK,2,3,2200
02.03.2012,PM,BYBVA,2,3,2200
02.03.2012,PM,BYCHG,2,3,2200
02.03.2012,PM,BYBGD,2,3,2200
03.03.2012,AM,BYALL,2,2,
03.03.2012,AM,BYAMM,2,2,
03.03.2012,AM,BYWFK,2,2,
03.03.2012,AM,BYBVA,2,2,
03.03.2012,AM,BYCHG,2,2,
03.03.2012,AM,BYBGD,2,2,
03.03.2012,PM,BYALL,2,3,2200
03.03.2012,PM,BYAMM,2,3,2200
03.03.2012,PM,BYWFK,2,3,2200
03.03.2012,PM,BYBVA,2,3,2200
03.03.2012,PM,BYCHG,2,3,2200
03.03.2012,PM,BYBGD,2,3,2200
04.03.2012,AM,BYALL,1,2,2000
04.03.2012,AM,BYAMM,1,2,2000
04.03.2012,AM,BYWFK,1,2,2000
04.03.2012,AM,BYBVA,1,2,2000
04.03.2012,AM,BYCHG,1,2,2000
04.03.2012,AM,BYBGD,1,2,2000
05.03.2012,AM,BYALL,1,2,treeline
05.03.2012,AM,BYAMM,1,2,treeline
05.03.2012,AM,BYWFK,1,2,treeline
05.03.2012,AM,BYBVA,1,2,treeline
05.03.2012,AM,BYCHG,1,2,treeline
05.03.2012,AM,BYBGD,1,2,treeline
06.03.2012,AM,BYALL,1,1,
06.03.2012,AM,BYAMM,1,1,
06.03.2012,AM,BYWFK,1,1,
06.03.2012,AM,BYBVA,1,1,
06.03.2012,AM,BYCHG,1,1,
06.03.2012,AM,BYBGD,1,1,
06.03.2012,PM,BYALL,1,2,treeline
06.03.2012,PM,BYAMM,1,2,treeline
06.03.2012,PM,BYWFK,1,2,treeline
06.03.2012,PM,BYBVA,1,2,treeline
06.03.2012,PM,BYCHG,1,2,treeline
06.03.2012,PM,BYBGD,1,2,treeline
07.03.2012,AM,BYALL,1,1,
07.03.2012,AM,BYAMM,1,1,
07.03.2012,AM,BYWFK,1,1,
07.03.2012,AM,BYBVA,1,1,
07.03.2012,AM,BYCHG,1,1,
07.03.2012,AM,BYBGD,1,1,
07.03.2012,PM,BYALL,1,2,1800
07.03.2012,PM,BYAMM,1,2,1800
07.03.2012,PM,BYWFK,1,2,1800
07.03.2012,PM,BYBVA,1,2,1800
07.03.2012,PM,BYCHG,1,2,1800
07.03.2012,PM,BYBGD,1,2,1800
08.03.2012,AM,BYALL,1,1,
08.03.2012,AM,BYAMM,1,1,
08.03.2012,AM,BYWFK,1,1,
08.03.2012,AM,BYBVA,1,1,
08.03.2012,AM,BYCHG,1,1,
08.03.2012,AM,BYBGD,1,1,
08.03.2012,PM,BYALL,2,1,treeline
08.03.2012,PM,BYAMM,2,1,treeline
08.03.2012,PM,BYWFK,2,1,treeline
08.03.2012,PM,BYBVA,2,1,treeline
08.03.2012,PM,BYCHG,2,1,treeline
08.03.2012,PM,BYBGD,2,1,treeline
09.03.2012,AM,BYALL,2,1,treeline
09.03.2012,AM,BYAMM,2,1,treeline
09.03.2012,AM,BYWFK,2,1,treeline
09.03.2012,AM,BYBVA,2,1,treeline
09.03.2012,AM,BYCHG,2,1,treeline
09.03.2012,AM,BYBGD,2,1,treeline
09.03.2012,PM,BYALL,3,2,treeline
09.03.2012,PM,BYAMM,3,2,treeline
09.03.2012,PM,BYWFK,3,2,treeline
09.03.2012,PM,BYBVA,3,2,treeline
09.03.2012,PM,BYCHG,3,2,treeline
09.03.2012,PM,BYBGD,3,2,treeline
10.03.2012,AM,BYALL,2,1,1800
10.03.2012,AM,BYAMM,2,1,1800
10.03.2012,AM,BYWFK,2,1,1800
10.03.2012,AM,BYBVA,2,1,1800
10.03.2012,AM,BYCHG,2,1,1800
10.03.2012,AM,BYBGD,2,1,1800
10.03.2012,PM,BYALL,2,2,
10.03.2012,PM,BYAMM,2,2,
10.03.2012,PM,BYWFK,2,2,
10.03.2012,PM,BYBVA,2,2,
10.03.2012,PM,BYCHG,2,2,
10.03.2012,PM,BYBGD,2,2,
11.03.2012,AM,BYALL,2,1,1800
11.03.2012,AM,BYAMM,2,1,1800
11.03.2012,AM,BYWFK,2,1,1800
11.03.2012,AM,BYBVA,2,1,1800
11.03.2012,AM,BYCHG,2,1,1800
11.03.2012,AM,BYBGD,2,1,1800
11.03.2012,PM,BYALL,2,2,
11.03.2012,PM,BYAMM,2,2,
11.03.2012,PM,BYWFK,2,2,
11.03.2012,PM,BYBVA,2,2,
11.03.2012,PM,BYCHG,2,2,
11.03.2012,PM,BYBGD,2,2,
12.03.2012,AM,BYALL,2,2,
12.03.2012,AM,BYAMM,2,1,1800
12.03.2012,AM,BYWFK,2,1,1800
12.03.2012,AM,BYBVA,2,1,1800
12.03.2012,AM,BYCHG,2,1,1800
12.03.2012,AM,BYBGD,2,1,1800
12.03.2012,PM,BYAMM,2,2,
12.03.2012,PM,BYWFK,2,2,
12.03.2012,PM,BYBVA,2,2,
12.03.2012,PM,BYCHG,2,2,
12.03.2012,PM,BYBGD,2,2,
13.03.2012,AM,BYALL,2,2,
13.03.2012,AM,BYAMM,2,2,
13.03.2012,AM,BYWFK,2,2,
13.03.2012,AM,BYBVA,2,2,
13.03.2012,AM,BYCHG,2,2,
13.03.2012,AM,BYBGD,2,2,
13.03.2012,PM,BYALL,2,3,2000
13.03.2012,PM,BYAMM,2,3,2000
13.03.2012,PM,BYWFK,2,3,2000
13.03.2012,PM,BYBVA,2,3,2000
13.03.2012,PM,BYCHG,2,3,2000
13.03.2012,PM,BYBGD,2,3,2000
14.03.2012,AM,BYALL,2,2,
14.03.2012,AM,BYAMM,2,2,
14.03.2012,AM,BYWFK,2,2,
14.03.2012,AM,BYBVA,2,2,
14.03.2012,AM,BYCHG,2,2,
14.03.2012,AM,BYBGD,2,2,
14.03.2012,PM,BYALL,2,3,2000
14.03.2012,PM,BYAMM,2,3,2000
14.03.2012,PM,BYWFK,2,3,2000
14.03.2012,PM,BYBVA,2,3,2000
14.03.2012,PM,BYCHG,2,3,2000
14.03.2012,PM,BYBGD,2,3,2000
15.03.2012,AM,BYALL,2,3,2200
15.03.2012,AM,BYAMM,2,3,2200
15.03.2012,AM,BYWFK,2,3,2200
15.03.2012,AM,BYBVA,2,3,2200
15.03.2012,AM,BYCHG,2,3,2200
15.03.2012,AM,BYBGD,2,3,2200
16.03.2012,AM,BYALL,2,3,2200
16.03.2012,AM,BYAMM,2,3,2200
16.03.2012,AM,BYWFK,2,3,2200
16.03.2012,AM,BYBVA,2,3,2200
16.03.2012,AM,BYCHG,2,3,2200
16.03.2012,AM,BYBGD,2,3,2200
17.03.2012,AM,BYALL,2,3,2200
17.03.2012,AM,BYAMM,2,3,2200
17.03.2012,AM,BYWFK,2,3,2200
17.03.2012,AM,BYBVA,2,3,2200
17.03.2012,AM,BYCHG,2,3,2200
17.03.2012,AM,BYBGD,2,3,2200
18.03.2012,AM,BYALL,2,2,
18.03.2012,AM,BYAMM,2,2,
18.03.2012,AM,BYWFK,2,2,
18.03.2012,AM,BYBVA,2,2,
18.03.2012,AM,BYCHG,2,2,
18.03.2012,AM,BYBGD,2,2,
18.03.2012,PM,BYALL,2,3,2200
18.03.2012,PM,BYAMM,2,3,2200
18.03.2012,PM,BYWFK,2,3,2200
18.03.2012,PM,BYBVA,2,3,2200
18.03.2012,PM,BYCHG,2,3,2200
18.03.2012,PM,BYBGD,2,3,2200
19.03.2012,AM,BYALL,2,2,
19.03.2012,AM,BYAMM,2,2,
19.03.2012,AM,BYWFK,2,2,
19.03.2012,AM,BYBVA,2,2,
19.03.2012,AM,BYCHG,2,2,
19.03.2012,AM,BYBGD,2,2,
20.03.2012,AM,BYALL,2,2,
20.03.2012,AM,BYAMM,2,2,
20.03.2012,AM,BYWFK,2,2,
20.03.2012,AM,BYBVA,2,2,
20.03.2012,AM,BYCHG,2,2,
20.03.2012,AM,BYBGD,2,2,
20.03.2012,PM,BYALL,2,3,2000
20.03.2012,PM,BYAMM,2,3,2000
20.03.2012,PM,BYWFK,2,3,2000
20.03.2012,PM,BYBVA,2,3,2000
20.03.2012,PM,BYCHG,2,3,2000
20.03.2012,PM,BYBGD,2,3,2000
21.03.2012,AM,BYALL,2,2,
21.03.2012,AM,BYAMM,2,2,
21.03.2012,AM,BYWFK,2,2,
21.03.2012,AM,BYBVA,2,2,
21.03.2012,AM,BYCHG,2,2,
21.03.2012,AM,BYBGD,2,2,
21.03.2012,PM,BYALL,2,3,2000
21.03.2012,PM,BYAMM,2,3,2000
21.03.2012,PM,BYWFK,2,3,2000
21.03.2012,PM,BYBVA,2,3,2000
21.03.2012,PM,BYCHG,2,3,2000
21.03.2012,PM,BYBGD,2,3,2000
22.03.2012,AM,BYALL,1,1,
22.03.2012,AM,BYAMM,1,1,
22.03.2012,AM,BYWFK,1,1,
22.03.2012,AM,BYBVA,1,1,
22.03.2012,AM,BYCHG,1,1,
22.03.2012,AM,BYBGD,1,1,
22.03.2012,PM,BYALL,1,2,2000
22.03.2012,PM,BYAMM,1,2,2000
22.03.2012,PM,BYWFK,1,2,2000
22.03.2012,PM,BYBVA,1,2,2000
22.03.2012,PM,BYCHG,1,2,2000
22.03.2012,PM,BYBGD,1,2,2000
23.03.2012,AM,BYALL,1,2,1800
23.03.2012,AM,BYAMM,1,2,1800
23.03.2012,AM,BYWFK,1,2,1800
23.03.2012,AM,BYBVA,1,2,1800
23.03.2012,AM,BYCHG,1,2,1800
23.03.2012,AM,BYBGD,1,2,1800
23.03.2012,PM,BYALL,1,3,1800
24.03.2012,AM,BYALL,1,1,
24.03.2012,AM,BYAMM,1,1,
24.03.2012,AM,BYWFK,1,1,
24.03.2012,AM,BYBVA,1,1,
24.03.2012,AM,BYCHG,1,1,
24.03.2012,AM,BYBGD,1,1,
24.03.2012,PM,BYALL,1,2,1800
24.03.2012,PM,BYAMM,1,2,1800
24.03.2012,PM,BYWFK,1,2,1800
24.03.2012,PM,BYBVA,1,2,1800
24.03.2012,PM,BYCHG,1,2,1800
24.03.2012,PM,BYBGD,1,2,1800
25.03.2012,AM,BYALL,1,1,
25.03.2012,AM,BYAMM,1,1,
25.03.2012,AM,BYWFK,1,2,1800
25.03.2012,AM,BYBVA,1,2,1800
25.03.2012,AM,BYCHG,1,2,1800
25.03.2012,AM,BYBGD,1,2,1800
25.03.2012,PM,BYALL,1,2,1800
25.03.2012,PM,BYAMM,1,2,1800
26.03.2012,AM,BYALL,1,1,
26.03.2012,AM,BYAMM,1,1,
26.03.2012,AM,BYWFK,1,1,
26.03.2012,AM,BYBVA,1,1,
26.03.2012,AM,BYCHG,1,1,
26.03.2012,AM,BYBGD,1,1,
26.03.2012,PM,BYALL,1,2,1800
26.03.2012,PM,BYAMM,1,2,1800
26.03.2012,PM,BYWFK,1,2,1800
26.03.2012,PM,BYBVA,1,2,1800
26.03.2012,PM,BYCHG,1,2,1800
26.03.2012,PM,BYBGD,1,2,1800
27.03.2012,AM,BYALL,1,1,
27.03.2012,AM,BYAMM,1,1,
27.03.2012,AM,BYWFK,1,1,
27.03.2012,AM,BYBVA,1,1,
27.03.2012,AM,BYCHG,1,1,
27.03.2012,AM,BYBGD,1,1,
27.03.2012,PM,BYALL,1,2,1800
27.03.2012,PM,BYAMM,1,2,1800
27.03.2012,PM,BYWFK,1,2,1800
27.03.2012,PM,BYBVA,1,2,1800
27.03.2012,PM,BYCHG,1,2,1800
27.03.2012,PM,BYBGD,1,2,1800
28.03.2012,AM,BYALL,1,1,
28.03.2012,AM,BYAMM,1,1,
28.03.2012,AM,BYWFK,1,1,
28.03.2012,AM,BYBVA,1,1,
28.03.2012,AM,BYCHG,1,1,
28.03.2012,AM,BYBGD,1,1,
28.03.2012,PM,BYALL,1,2,1800
28.03.2012,PM,BYAMM,1,2,1800
28.03.2012,PM,BYWFK,1,2,1800
28.03.2012,PM,BYBVA,1,2,1800
28.03.2012,PM,BYCHG,1,2,1800
28.03.2012,PM,BYBGD,1,2,1800
29.03.2012,AM,BYALL,1,2,1800
29.03.2012,AM,BYAMM,1,2,1800
29.03.2012,AM,BYWFK,1,2,1800
29.03.2012,AM,BYBVA,1,2,1800
29.03.2012,AM,BYCHG,1,2,1800
29.03.2012,AM,BYBGD,1,2,1800
30.03.2012,AM,BYALL,1,2,1800
30.03.2012,AM,BYAMM,1,2,1800
30.03.2012,AM,BYWFK,2,2,
30.03.2012,AM,BYBVA,2,2,
30.03.2012,AM,BYCHG,2,3,1800
30.03.2012,AM,BYBGD,3,3,
31.03.2012,AM,BYALL,1,2,1800
31.03.2012,AM,BYAMM,1,2,1800
31.03.2012,AM,BYWFK,1,2,1800
31.03.2012,AM,BYBVA,2,2,
31.03.2012,AM,BYCHG,2,2,
31.03.2012,AM,BYBGD,2,2,
01.04.2012,AM,BYALL,1,2,1800
01.04.2012,AM,BYAMM,1,2,1800
01.04.2012,AM,BYWFK,1,2,1800
01.04.2012,AM,BYBVA,1,2,1800
01.04.2012,AM,BYCHG,1,2,1800
01.04.2012,AM,BYBGD,2,2,
02.04.2012,AM,BYALL,1,1,
02.04.2012,AM,BYAMM,1,1,
02.04.2012,AM,BYWFK,1,1,
02.04.2012,AM,BYBVA,1,1,
02.04.2012,AM,BYCHG,1,1,
02.04.2012,AM,BYBGD,2,1,1800
03.04.2012,AM,BYALL,1,2,2000
03.04.2012,AM,BYAMM,1,2,2000
03.04.2012,AM,BYWFK,1,1,
03.04.2012,AM,BYBVA,1,1,
03.04.2012,AM,BYCHG,1,1,
03.04.2012,AM,BYBGD,2,1,1800
03.04.2012,PM,BYWFK,1,2,1800
03.04.2012,PM,BYBVA,1,2,1800
03.04.2012,PM,BYCHG,1,2,1800
03.04.2012,PM,BYBGD,2,2,
04.04.2012,AM,BYALL,1,1,
04.04.2012,AM,BYAMM,1,1,
04.04.2012,AM,BYWFK,1,1,
04.04.2012,AM,BYBVA,1,1,
04.04.2012,AM,BYCHG,1,1,
04.04.2012,AM,BYBGD,2,1,1800
04.04.2012,PM,BYALL,1,2,1800
04.04.2012,PM,BYAMM,1,2,1800
04.04.2012,PM,BYWFK,1,2,1800
04.04.2012,PM,BYBVA,1,2,1800
04.04.2012,PM,BYCHG,1,2,1800
04.04.2012,PM,BYBGD,2,2,
05.04.2012,AM,BYALL,1,2,2000
05.04.2012,AM,BYAMM,1,2,2000
05.04.2012,AM,BYWFK,1,2,2000
05.04.2012,AM,BYBVA,1,2,2000
05.04.2012,AM,BYCHG,1,2,2000
05.04.2012,AM,BYBGD,1,2,2000
06.04.2012,AM,BYALL,1,2,1800
06.04.2012,AM,BYAMM,1,2,1800
06.04.2012,AM,BYWFK,1,2,1800
06.04.2012,AM,BYBVA,1,2,1800
06.04.2012,AM,BYCHG,1,2,1800
06.04.2012,AM,BYBGD,1,2,1800
07.04.2012,AM,BYALL,1,2,1800
07.04.2012,AM,BYAMM,1,2,1800
07.04.2012,AM,BYWFK,2,2,
07.04.2012,AM,BYBVA,1,2,1800
07.04.2012,AM,BYCHG,1,2,1800
07.04.2012,AM,BYBGD,1,2,1800
08.04.2012,AM,BYALL,1,2,1800
08.04.2012,AM,BYAMM,1,1,
08.04.2012,AM,BYWFK,1,1,
08.04.2012,AM,BYBVA,1,1,
08.04.2012,AM,BYCHG,1,1,
08.04.2012,AM,BYBGD,1,1,
09.04.2012,AM,BYALL,2,2,
09.04.2012,AM,BYAMM,2,2,
09.04.2012,AM,BYWFK,2,2,
09.04.2012,AM,BYBVA,2,2,
09.04.2012,AM,BYCHG,2,2,
09.04.2012,AM,BYBGD,2,2,
10.04.2012,AM,BYALL,1,1,
10.04.2012,AM,BYAMM,1,1,
10.04.2012,AM,BYWFK,1,1,
10.04.2012,AM,BYBVA,1,1,
10.04.2012,AM,BYCHG,1,1,
10.04.2012,AM,BYBGD,1,1,
10.04.2012,PM,BYALL,1,2,2000
10.04.2012,PM,BYAMM,1,2,2000
10.04.2012,PM,BYWFK,1,2,2000
10.04.2012,PM,BYBVA,1,2,2000
10.04.2012,PM,BYCHG,1,2,2000
10.04.2012,PM,BYBGD,1,2,2000
11.04.2012,AM,BYALL,1,2,2000
11.04.2012,AM,BYAMM,1,1,
11.04.2012,AM,BYWFK,1,1,
11.04.2012,AM,BYBVA,1,1,
11.04.2012,AM,BYCHG,1,1,
11.04.2012,AM,BYBGD,1,1,
11.04.2012,PM,BYAMM,1,2,2000
11.04.2012,PM,BYWFK,1,2,2000
11.04.2012,PM,BYBVA,1,2,2000
11.04.2012,PM,BYCHG,1,2,2000
11.04.2012,PM,BYBGD,1,2,2000
12.04.2012,AM,BYALL,1,2,2000
12.04.2012,AM,BYAMM,1,1,
12.04.2012,AM,BYWFK,1,1,
12.04.2012,AM,BYBVA,1,1,
12.04.2012,AM,BYCHG,1,1,
12.04.2012,AM,BYBGD,1,1,
12.04.2012,PM,BYAMM,1,2,2000
12.04.2012,PM,BYWFK,1,2,2000
12.04.2012,PM,BYBVA,1,2,2000
12.04.2012,PM,BYCHG,1,2,2000
12.04.2012,PM,BYBGD,1,2,2000
13.04.2012,AM,BYALL,1,2,2000
13.04.2012,AM,BYAMM,1,2,2000
13.04.2012,AM,BYWFK,1,2,2000
13.04.2012,AM,BYBVA,1,2,2000
13.04.2012,AM,BYCHG,1,2,2000
13.04.2012,AM,BYBGD,1,2,2000
14.04.2012,AM,BYALL,1,1,
14.04.2012,AM,BYAMM,1,1,
14.04.2012,AM,BYWFK,1,1,
14.04.2012,AM,BYBVA,1,1,
14.04.2012,AM,BYCHG,1,1,
14.04.2012,AM,BYBGD,1,1,
14.04.2012,PM,BYALL,1,2,2000
14.04.2012,PM,BYAMM,1,2,2000
14.04.2012,PM,BYWFK,1,2,2000
14.04.2012,PM,BYBVA,1,2,2000
14.04.2012,PM,BYCHG,1,2,2000
14.04.2012,PM,BYBGD,1,2,2000
15.04.2012,AM,BYALL,1,1,
15.04.2012,AM,BYAMM,1,1,
15.04.2012,AM,BYWFK,1,1,
15.04.2012,AM,BYBVA,1,1,
15.04.2012,AM,BYCHG,1,1,
15.04.2012,AM,BYBGD,1,1,
15.04.2012,PM,BYALL,1,2,2000
15.04.2012,PM,BYAMM,1,2,2000
15.04.2012,PM,BYWFK,1,2,2000
15.04.2012,PM,BYBVA,1,2,2000
15.04.2012,PM,BYCHG,1,2,2000
15.04.2012,PM,BYBGD,1,2,2000
16.04.2012,AM,BYALL,2,2,
16.04.2012,AM,BYAMM,2,2,
16.04.2012,AM,BYWFK,2,2,
16.04.2012,AM,BYBVA,2,2,
16.04.2012,AM,BYCHG,2,2,
16.04.2012,AM,BYBGD,2,2,
17.04.2012,AM,BYALL,2,2,
17.04.2012,AM,BYAMM,2,2,
17.04.2012,AM,BYWFK,3,3,
17.04.2012,AM,BYBVA,3,3,
17.04.2012,AM,BYCHG,2,2,
17.04.2012,AM,BYBGD,2,2,
18.04.2012,AM,BYALL,2,1,1800
18.04.2012,AM,BYAMM,2,1,1800
18.04.2012,AM,BYWFK,2,1,1800
18.04.2012,AM,BYBVA,2,1,1800
18.04.2012,AM,BYCHG,2,1,1800
18.04.2012,AM,BYBGD,2,1,1800
18.04.2012,PM,BYALL,2,2,
18.04.2012,PM,BYAMM,2,2,
18.04.2012,PM,BYWFK,2,2,
18.04.2012,PM,BYBVA,2,2,
18.04.2012,PM,BYCHG,2,2,
18.04.2012,PM,BYBGD,2,2,
19.04.2012,AM,BYALL,2,1,2000
19.04.2012,AM,BYAMM,2,1,2000
19.04.2012,AM,BYWFK,2,1,2000
19.04.2012,AM,BYBVA,2,1,2000
19.04.2012,AM,BYCHG,2,1,2000
19.04.2012,AM,BYBGD,2,1,2000
19.04.2012,PM,BYALL,2,2,
19.04.2012,PM,BYAMM,2,2,
19.04.2012,PM,BYWFK,2,2,
19.04.2012,PM,BYBVA,2,2,
19.04.2012,PM,BYCHG,2,2,
19.04.2012,PM,BYBGD,2,2,
20.04.2012,AM,BYALL,2,2,
20.04.2012,AM,BYAMM,2,2,
20.04.2012,AM,BYWFK,2,2,
20.04.2012,AM,BYBVA,2,2,
20.04.2012,AM,BYCHG,2,2,
20.04.2012,AM,BYBGD,2,2,
21.04.2012,AM,BYALL,2,2,
21.04.2012,AM,BYAMM,2,2,
21.04.2012,AM,BYWFK,2,2,
21.04.2012,AM,BYBVA,2,2,
21.04.2012,AM,BYCHG,2,2,
21.04.2012,AM,BYBGD,2,2,
22.04.2012,AM,BYALL,2,2,
22.04.2012,AM,BYAMM,2,2,
22.04.2012,AM,BYWFK,2,2,
22.04.2012,AM,BYBVA,2,2,
22.04.2012,AM,BYCHG,2,2,
22.04.2012,AM,BYBGD,2,2,
23.04.2012,AM,BYALL,2,1,treeline
23.04.2012,AM,BYAMM,2,1,treeline
23.04.2012,AM,BYWFK,2,1,treeline
23.04.2012,AM,BYBVA,1,1,
23.04.2012,AM,BYCHG,1,1,
23.04.2012,AM,BYBGD,2,1,treeline
24.04.2012,AM,BYALL,2,1,2000
24.04.2012,AM,BYAMM,2,1,2000
24.04.2012,AM,BYWFK,3,1,2000
24.04.2012,AM,BYBVA,2,1,2000
24.04.2012,AM,BYCHG,2,1,2000
24.04.2012,AM,BYBGD,3,1,2000
24.04.2012,PM,BYALL,2,2,
24.04.2012,PM,BYAMM,2,2,
24.04.2012,PM,BYWFK,3,2,2000
24.04.2012,PM,BYBVA,2,2,
24.04.2012,PM,BYCHG,2,2,
24.04.2012,PM,BYBGD,3,2,2000
25.04.2012,AM,BYALL,3,2,1800
25.04.2012,AM,BYAMM,3,2,1800
25.04.2012,AM,BYWFK,3,2,1800
25.04.2012,AM,BYBVA,3,2,1800
25.04.2012,AM,BYCHG,2,2,
25.04.2012,AM,BYBGD,2,2,
25.04.2012,PM,BYALL,3,3,
25.04.2012,PM,BYAMM,3,3,
25.04.2012,PM,BYWFK,3,3,
25.04.2012,PM,BYBVA,3,3,
25.04.2012,PM,BYCHG,3,3,
25.04.2012,PM,BYBGD,3,3,
26.04.2012,AM,BYALL,2,3,2000
26.04.2012,AM,BYAMM,2,2,
26.04.2012,AM,BYWFK,2,2,
26.04.2012,AM,BYBVA,2,2,
26.04.2012,AM,BYCHG,2,2,
26.04.2012,AM,BYBGD,2,2,
27.04.2012,AM,BYALL,2,3,2200
27.04.2012,AM,BYAMM,2,3,2200
27.04.2012,AM,BYWFK,2,3,2200
27.04.2012,AM,BYBVA,3,3,
27.04.2012,AM,BYCHG,3,3,
27.04.2012,AM,BYBGD,2,3,2200
28.04.2012,AM,BYALL,2,3,2300
28.04.2012,AM,BYAMM,2,3,2300
28.04.2012,AM,BYWFK,2,3,2300
28.04.2012,AM,BYBVA,3,3,
28.04.2012,AM,BYCHG,3,3,
28.04.2012,AM,BYBGD,2,3,2300
29.04.2012,AM,BYALL,2,2,
29.04.2012,AM,BYAMM,2,2,
29.04.2012,AM,BYWFK,2,2,
29.04.2012,AM,BYBVA,2,2,
29.04.2012,AM,BYCHG,2,2,
29.04.2012,AM,BYBGD,2,2,
30.04.2012,AM,BYALL,1,2,2300
30.04.2012,AM,BYAMM,1,1,
30.04.2012,AM,BYWFK,1,1,
30.04.2012,AM,BYBVA,1,1,
30.04.2012,AM,BYCHG,1,1,
30.04.2012,AM,BYBGD,1,1,
30.04.2012,PM,BYAMM,1,2,2300
30.04.2012,PM,BYWFK,1,2,2300
30.04.2012,PM,BYBVA,1,2,2300
30.04.2012,PM,BYCHG,1,2,2300
30.04.2012,PM,BYBGD,1,2,2300
01.05.2012,AM,BYALL,1,2,2300
01.05.2012,AM,BYAMM,1,1,
01.05.2012,AM,BYWFK,1,1,
01.05.2012,AM,BYBVA,1,1,
01.05.2012,AM,BYCHG,1,1,
01.05.2012,AM,BYBGD,1,1,
01.05.2012,PM,BYAMM,1,2,2300
01.05.2012,PM,BYWFK,1,2,2300
01.05.2012,PM,BYBVA,1,2,2300
01.05.2012,PM,BYCHG,1,2,2300
01.05.2012,PM,BYBGD,1,2,2300
