[
  {
    "valid_regions": [
      "AT-07-24",
      "AT-07-27",
      "AT-07-29",
      "AT-07-28",
      "AT-07-26",
      "AT-07-25"
    ],
    "danger_main": [
      {
        "main_value": 3,
        "valid_elevation": ">2000"
      },
      {
        "main_value": 2,
        "valid_elevation": "<2000"
      }
    ],
    "dangerpattern": [],
    "problem_list": [],
    "report_texts": null,
    "report_id": "RID390RGR1",
    "rep_date": "2021-02-12T16:00:00+00:00",
    "validity_begin": "2021-02-12T16:00:00+00:00",
    "validity_end": "2021-02-13T23:00:00+00:00"
  },
  {
    "valid_regions": [
      "AT-07-21"
    ],
    "danger_main": [
      {
        "main_value": 3,
        "valid_elevation": ">Treeline"
      },
      {
        "main_value": 1,
        "valid_elevation": "<Treeline"
      }
    ],
    "dangerpattern": [],
    "problem_list": [],
    "report_texts": null,
    "report_id": "RID390RGR2",
    "rep_date": "2021-02-12T16:00:00+00:00",
    "validity_begin": "2021-02-12T16:00:00+00:00",
    "validity_end": "2021-02-13T23:00:00+00:00"
  },
  {
    "valid_regions": [
      "AT-07-23",
      "AT-07-15",
      "AT-07-08",
      "AT-07-13",
      "AT-07-20",
      "AT-07-14",
      "AT-07-01",
      "AT-07-12",
      "AT-07-10",
      "AT-07-16",
      "AT-07-03",
      "AT-07-22",
      "AT-07-02",
      "AT-07-09",
      "AT-07-19",
      "AT-07-07",
      "AT-07-11"
    ],
    "danger_main": [
      {
        "main_value": 3,
        "valid_elevation": ">2000"
      },
      {
        "main_value": 1,
        "valid_elevation": "<2000"
      }
    ],
    "dangerpattern": [],
    "problem_list": [],
    "report_texts": null,
    "report_id": "RID390RGR3",
    "rep_date": "2021-02-12T16:00:00+00:00",
    "validity_begin": "2021-02-12T16:00:00+00:00",
    "validity_end": "2021-02-13T23:00:00+00:00"
  },
  {
    "valid_regions": [
      "AT-07-17",
      "AT-07-06",
      "AT-07-04",
      "AT-07-05",
      "AT-07-18"
    ],
    "danger_main": [
      {
        "main_value": 2,
        "valid_elevation": ">1800"
      },
      {
        "main_value": 1,
        "valid_elevation": "<1800"
      }
    ],
    "dangerpattern": [],
    "problem_list": [],
    "report_texts": null,
    "report_id": "RID390RGR4",
    "rep_date": "2021-02-12T16:00:00+00:00",
    "validity_begin": "2021-02-12T16:00:00+00:00",
    "validity_end": "2021-02-13T23:00:00+00:00"
  }
]