[
  {
    "valid_regions": [
      "AT-04-02",
      "AT-04-05",
      "AT-04-01",
      "AT-04-03",
      "AT-04-06",
      "AT-04-07",
      "AT-04-04",
      "AT-04-08",
      "AT-04-09"
    ],
    "danger_main": [
      {
        "main_value": 1,
        "valid_elevation": null
      }
    ],
    "dangerpattern": [],
    "problem_list": [
      {
        "problem_type": "wet snow",
        "aspect": [
          "E",
          "SE",
          "S",
          "SW",
          "W"
        ],
        "valid_elevation": null
      },
      {
        "problem_type": "old snow",
        "aspect": [
          "N",
          "NE",
          "E",
          "NW"
        ],
        "valid_elevation": null
      }
    ],
    "report_texts": null,
    "report_id": "RID922RGR1",
    "rep_date": "2021-04-22T16:00:00+00:00",
    "validity_begin": "2021-04-22T22:00:00+00:00",
    "validity_end": "2021-04-23T11:00:00+00:00"
  },
  {
    "valid_regions": [
      "AT-04-02",
      "AT-04-05",
      "AT-04-01",
      "AT-04-03",
      "AT-04-06",
      "AT-04-07",
      "AT-04-04",
      "AT-04-08",
      "AT-04-09"
    ],
    "danger_main": [
      {
        "main_value": 2,
        "valid_elevation": null
      }
    ],
    "dangerpattern": [],
    "problem_list": [
      {
        "problem_type": "wet snow",
        "aspect": [
          "E",
          "SE",
          "S",
          "SW",
          "W"
        ],
        "valid_elevation": null
      },
      {
        "problem_type": "old snow",
        "aspect": [
          "N",
          "NE",
          "E",
          "NW"
        ],
        "valid_elevation": null
      }
    ],
    "report_texts": null,
    "report_id": "RID922RGR1_PM",
    "rep_date": "2021-04-22T16:00:00+00:00",
    "validity_begin": "2021-04-23T10:00:00+00:00",
    "validity_end": "2021-04-23T23:00:00+00:00",
    "predecessor_id": "RID922RGR1"
  }
]