[
  {
    "valid_regions": [
      "AT-02-01",
      "AT-02-02",
      "AT-02-09",
      "AT-02-03",
      "AT-02-12",
      "AT-02-11",
      "AT-02-10",
      "AT-02-14",
      "AT-02-15"
    ],
    "danger_main": [
      {
        "main_value": 1,
        "valid_elevation": ">2400"
      },
      {
        "main_value": 1,
        "valid_elevation": "<2400"
      }
    ],
    "dangerpattern": [],
    "problem_list": [
      {
        "problem_type": "wet snow",
        "aspect": [
          "N",
          "NE",
          "E",
          "SE",
          "S",
          "SW",
          "W",
          "NW"
        ],
        "valid_elevation": null
      },
      {
        "problem_type": "old snow",
        "aspect": [
          "N",
          "NE",
          "NW"
        ],
        "valid_elevation": null
      }
    ],
    "report_texts": null,
    "report_id": "RID956RGR1",
    "rep_date": "2021-04-27T16:00:00+00:00",
    "validity_begin": "2021-04-27T22:00:00+00:00",
    "validity_end": "2021-04-28T11:00:00+00:00"
  },
  {
    "valid_regions": [
      "AT-02-01",
      "AT-02-02",
      "AT-02-09",
      "AT-02-03",
      "AT-02-12",
      "AT-02-11",
      "AT-02-10",
      "AT-02-14",
      "AT-02-15"
    ],
    "danger_main": [
      {
        "main_value": 1,
        "valid_elevation": ">2400"
      },
      {
        "main_value": 2,
        "valid_elevation": "<2400"
      }
    ],
    "dangerpattern": [],
    "problem_list": [
      {
        "problem_type": "wet snow",
        "aspect": [
          "N",
          "NE",
          "E",
          "SE",
          "S",
          "SW",
          "W",
          "NW"
        ],
        "valid_elevation": null
      },
      {
        "problem_type": "old snow",
        "aspect": [
          "N",
          "NE",
          "NW"
        ],
        "valid_elevation": null
      }
    ],
    "report_texts": null,
    "report_id": "RID956RGR1_PM",
    "rep_date": "2021-04-27T16:00:00+00:00",
    "validity_begin": "2021-04-28T10:00:00+00:00",
    "validity_end": "2021-04-28T23:00:00+00:00",
    "predecessor_id": "RID956RGR1"
  },
  {
    "valid_regions": [
      "AT-02-19",
      "AT-02-18",
      "AT-02-17",
      "AT-02-13",
      "AT-02-16"
    ],
    "danger_main": [
      {
        "main_value": 1,
        "valid_elevation": ">2000"
      },
      {
        "main_value": 1,
        "valid_elevation": "<2000"
      }
    ],
    "dangerpattern": [],
    "problem_list": [
      {
        "problem_type": "wet snow",
        "aspect": [
          "N",
          "NE",
          "E",
          "SE",
          "S",
          "SW",
          "W",
          "NW"
        ],
        "valid_elevation": null
      }
    ],
    "report_texts": null,
    "report_id": "RID956RGR2",
    "rep_date": "2021-04-27T16:00:00+00:00",
    "validity_begin": "2021-04-27T22:00:00+00:00",
    "validity_end": "2021-04-28T11:00:00+00:00"
  },
  {
    "valid_regions": [
      "AT-02-19",
      "AT-02-18",
      "AT-02-17",
      "AT-02-13",
      "AT-02-16"
    ],
    "danger_main": [
      {
        "main_value": 1,
        "valid_elevation": ">2000"
      },
      {
        "main_value": 2,
        "valid_elevation": "<2000"
      }
    ],
    "dangerpattern": [],
    "problem_list": [
      {
        "problem_type": "wet snow",
        "aspect": [
          "N",
          "NE",
          "E",
          "SE",
          "S",
          "SW",
          "W",
          "NW"
        ],
        "valid_elevation": null
      }
    ],
    "report_texts": null,
    "report_id": "RID956RGR2_PM",
    "rep_date": "2021-04-27T16:00:00+00:00",
    "validity_begin": "2021-04-28T10:00:00+00:00",
    "validity_end": "2021-04-28T23:00:00+00:00",
    "predecessor_id": "RID956RGR2"
  },
  {
    "valid_regions": [
      "AT-02-04",
      "AT-02-05",
      "AT-02-06",
      "AT-02-07",
      "AT-02-08"
    ],
    "danger_main": [
      {
        "main_value": 1,
        "valid_elevation": null
      }
    ],
    "dangerpattern": [],
    "problem_list": [
      {
        "problem_type": "wet snow",
        "aspect": [
          "N",
          "NE",
          "E",
          "SE",
          "S",
          "SW",
          "W",
          "NW"
        ],
        "valid_elevation": null
      },
      {
        "problem_type": "old snow",
        "aspect": [
          "N",
          "NE",
          "NW"
        ],
        "valid_elevation": null
      }
    ],
    "report_texts": null,
    "report_id": "RID956RGR3",
    "rep_date": "2021-04-27T16:00:00+00:00",
    "validity_begin": "2021-04-27T22:00:00+00:00",
    "validity_end": "2021-04-28T22:00:00+00:00"
  }
]