[
  {
    "valid_regions": [
      "AT-04-05",
      "AT-04-02",
      "AT-04-01",
      "AT-04-03",
      "AT-04-06",
      "AT-04-07",
      "AT-04-08",
      "AT-04-04"
    ],
    "danger_main": [
      {
        "main_value": 2,
        "valid_elevation": null
      }
    ],
    "dangerpattern": [],
    "problem_list": [
      {
        "problem_type": "drifting snow",
        "aspect": [
          "NE",
          "E",
          "SE",
          "S",
          "SW"
        ],
        "valid_elevation": null
      },
      {
        "problem_type": "wet snow",
        "aspect": [
          "N",
          "NE",
          "E",
          "SE",
          "S",
          "SW",
          "W",
          "NW"
        ],
        "valid_elevation": null
      }
    ],
    "report_texts": null,
    "report_id": "RID768RGR1",
    "rep_date": "2021-04-02T16:00:00+00:00",
    "validity_begin": "2021-04-02T22:00:00+00:00",
    "validity_end": "2021-04-03T22:00:00+00:00"
  },
  {
    "valid_regions": [
      "AT-04-09"
    ],
    "danger_main": [
      {
        "main_value": 1,
        "valid_elevation": null
      }
    ],
    "dangerpattern": [],
    "problem_list": [
      {
        "problem_type": "favourable situation",
        "aspect": [],
        "valid_elevation": null
      }
    ],
    "report_texts": null,
    "report_id": "RID768RGR2",
    "rep_date": "2021-04-02T16:00:00+00:00",
    "validity_begin": "2021-04-02T22:00:00+00:00",
    "validity_end": "2021-04-03T22:00:00+00:00"
  }
]