[
  {
    "valid_regions": [
      "AT-02-01",
      "AT-02-03"
    ],
    "danger_main": [
      {
        "main_value": 2,
        "valid_elevation": ">2200"
      },
      {
        "main_value": 1,
        "valid_elevation": "<2200"
      }
    ],
    "dangerpattern": [],
    "problem_list": [
      {
        "problem_type": "old snow",
        "aspect": [
          "N",
          "NE",
          "E",
          "SE",
          "S",
          "SW",
          "W",
          "NW"
        ],
        "valid_elevation": null
      },
      {
        "problem_type": "drifting snow",
        "aspect": [
          "N",
          "NE",
          "E",
          "SE",
          "S",
          "SW",
          "W",
          "NW"
        ],
        "valid_elevation": null
      }
    ],
    "report_texts": null,
    "report_id": "RID887RGR1",
    "rep_date": "2021-04-17T16:00:00+00:00",
    "validity_begin": "2021-04-17T22:00:00+00:00",
    "validity_end": "2021-04-18T22:00:00+00:00"
  },
  {
    "valid_regions": [
      "AT-02-02",
      "AT-02-09",
      "AT-02-12",
      "AT-02-11",
      "AT-02-10",
      "AT-02-14",
      "AT-02-15",
      "AT-02-13",
      "AT-02-16",
      "AT-02-18",
      "AT-02-17",
      "AT-02-19"
    ],
    "danger_main": [
      {
        "main_value": 2,
        "valid_elevation": ">2000"
      },
      {
        "main_value": 1,
        "valid_elevation": "<2000"
      }
    ],
    "dangerpattern": [],
    "problem_list": [
      {
        "problem_type": "drifting snow",
        "aspect": [
          "N",
          "NE",
          "E",
          "SE",
          "S",
          "SW",
          "W",
          "NW"
        ],
        "valid_elevation": null
      },
      {
        "problem_type": "old snow",
        "aspect": [
          "N",
          "NE",
          "E",
          "SE",
          "S",
          "SW",
          "W",
          "NW"
        ],
        "valid_elevation": null
      }
    ],
    "report_texts": null,
    "report_id": "RID887RGR2",
    "rep_date": "2021-04-17T16:00:00+00:00",
    "validity_begin": "2021-04-17T22:00:00+00:00",
    "validity_end": "2021-04-18T22:00:00+00:00"
  },
  {
    "valid_regions": [
      "AT-02-04",
      "AT-02-05",
      "AT-02-07",
      "AT-02-06",
      "AT-02-08"
    ],
    "danger_main": [
      {
        "main_value": 1,
        "valid_elevation": null
      }
    ],
    "dangerpattern": [],
    "problem_list": [
      {
        "problem_type": "drifting snow",
        "aspect": [
          "N",
          "NE",
          "E"
        ],
        "valid_elevation": null
      }
    ],
    "report_texts": null,
    "report_id": "RID887RGR3",
    "rep_date": "2021-04-17T16:00:00+00:00",
    "validity_begin": "2021-04-17T22:00:00+00:00",
    "validity_end": "2021-04-18T22:00:00+00:00"
  }
]