[
  {
    "valid_regions": [
      "AT-06-02",
      "AT-06-01",
      "AT-06-04",
      "AT-06-18",
      "AT-06-05",
      "AT-06-07",
      "AT-06-06",
      "AT-06-03",
      "AT-06-10",
      "AT-06-09",
      "AT-06-08",
      "AT-06-17"
    ],
    "danger_main": [
      {
        "main_value": 1,
        "valid_elevation": null
      }
    ],
    "dangerpattern": [],
    "problem_list": [
      {
        "problem_type": "wet snow",
        "aspect": [
          "E",
          "SE",
          "S",
          "SW",
          "W"
        ],
        "valid_elevation": null
      },
      {
        "problem_type": "old snow",
        "aspect": [
          "N",
          "NE",
          "E"
        ],
        "valid_elevation": null
      }
    ],
    "report_texts": null,
    "report_id": "RID469RGR1",
    "rep_date": "2021-02-23T17:00:00+00:00",
    "validity_begin": "2021-02-23T23:00:00+00:00",
    "validity_end": "2021-02-24T11:00:00+00:00"
  },
  {
    "valid_regions": [
      "AT-06-02",
      "AT-06-01",
      "AT-06-04",
      "AT-06-18",
      "AT-06-05",
      "AT-06-07",
      "AT-06-06",
      "AT-06-03",
      "AT-06-10",
      "AT-06-09",
      "AT-06-08",
      "AT-06-17"
    ],
    "danger_main": [
      {
        "main_value": 2,
        "valid_elevation": null
      }
    ],
    "dangerpattern": [],
    "problem_list": [
      {
        "problem_type": "wet snow",
        "aspect": [
          "E",
          "SE",
          "S",
          "SW",
          "W"
        ],
        "valid_elevation": null
      },
      {
        "problem_type": "old snow",
        "aspect": [
          "N",
          "NE",
          "E"
        ],
        "valid_elevation": null
      }
    ],
    "report_texts": null,
    "report_id": "RID469RGR1_PM",
    "rep_date": "2021-02-23T17:00:00+00:00",
    "validity_begin": "2021-02-24T11:00:00+00:00",
    "validity_end": "2021-02-24T23:00:00+00:00",
    "predecessor_id": "RID469RGR1"
  },
  {
    "valid_regions": [
      "AT-06-11",
      "AT-06-12",
      "AT-06-14",
      "AT-06-13",
      "AT-06-15",
      "AT-06-16"
    ],
    "danger_main": [
      {
        "main_value": 1,
        "valid_elevation": null
      }
    ],
    "dangerpattern": [],
    "problem_list": [
      {
        "problem_type": "wet snow",
        "aspect": [
          "E",
          "SE",
          "S",
          "SW",
          "W"
        ],
        "valid_elevation": null
      }
    ],
    "report_texts": null,
    "report_id": "RID469RGR2",
    "rep_date": "2021-02-23T17:00:00+00:00",
    "validity_begin": "2021-02-23T23:00:00+00:00",
    "validity_end": "2021-02-24T23:00:00+00:00"
  }
]