[
  {
    "valid_regions": [
      "AT-06-04",
      "AT-06-05",
      "AT-06-06",
      "AT-06-07",
      "AT-06-08",
      "AT-06-15",
      "AT-06-13",
      "AT-06-14",
      "AT-06-16"
    ],
    "danger_main": [
      {
        "main_value": 1,
        "valid_elevation": null
      }
    ],
    "dangerpattern": [],
    "problem_list": [
      {
        "problem_type": "favourable situation",
        "aspect": [],
        "valid_elevation": null
      }
    ],
    "report_texts": null,
    "report_id": "RID56RGR1",
    "rep_date": "2020-12-16T17:00:00+00:00",
    "validity_begin": "2020-12-16T23:00:00+00:00",
    "validity_end": "2020-12-17T23:00:00+00:00"
  },
  {
    "valid_regions": [
      "AT-06-18",
      "AT-06-17"
    ],
    "danger_main": [
      {
        "main_value": 1,
        "valid_elevation": null
      }
    ],
    "dangerpattern": [],
    "problem_list": [
      {
        "problem_type": "drifting snow",
        "aspect": [
          "N",
          "NE",
          "NW"
        ],
        "valid_elevation": null
      }
    ],
    "report_texts": null,
    "report_id": "RID56RGR2",
    "rep_date": "2020-12-16T17:00:00+00:00",
    "validity_begin": "2020-12-16T23:00:00+00:00",
    "validity_end": "2020-12-17T23:00:00+00:00"
  }
]