{
"type": "FeatureCollection",
"name": "AT-04_micro-regions",
"crs": { "type": "name", "properties": { "name": "urn:ogc:def:crs:OGC:1.3:CRS84" } },
"features": [
{ "type": "Feature", "properties": { "id": "AT-04-01" }, "geometry": { "type": "MultiPolygon", "coordinates": [ [ [ [ 13.6959, 47.6139 ], [ 13.6985, 47.602 ], [ 13.6915, 47.5889 ], [ 13.694, 47.5797 ], [ 13.6987, 47.5808 ], [ 13.7027, 47.5819 ], [ 13.7133, 47.5793 ], [ 13.7133, 47.5773 ], [ 13.7138, 47.5754 ], [ 13.7163, 47.5755 ], [ 13.7175, 47.5757 ], [ 13.7334, 47.5769 ], [ 13.7352, 47.577 ], [ 13.756, 47.5523 ], [ 13.7561, 47.5518 ], [ 13.7571, 47.5444 ], [ 13.7459, 47.5414 ], [ 13.7527, 47.5258 ], [ 13.7608, 47.5203 ], [ 13.7492, 47.5018 ], [ 13.7506, 47.4992 ], [ 13.7244, 47.4823 ], [ 13.7174, 47.4738 ], [ 13.7256, 47.4628 ], [ 13.6664, 47.4627 ], [ 13.6305, 47.4665 ], [ 13.6056, 47.4751 ], [ 13.5856, 47.4744 ], [ 13.5344, 47.495 ], [ 13.5157, 47.4961 ], [ 13.5121, 47.5041 ], [ 13.502, 47.5115 ], [ 13.4906, 47.5132 ], [ 13.4765, 47.5303 ], [ 13.4761, 47.5355 ], [ 13.4756, 47.5428 ], [ 13.4847, 47.553 ], [ 13.4813, 47.5622 ], [ 13.4787, 47.5688 ], [ 13.49, 47.5767 ], [ 13.505, 47.5817 ], [ 13.5056, 47.5916 ], [ 13.5259, 47.5872 ], [ 13.5332, 47.5844 ], [ 13.5457, 47.5871 ], [ 13.5738, 47.5892 ], [ 13.5925, 47.5951 ], [ 13.6036, 47.5943 ], [ 13.6177, 47.5897 ], [ 13.6315, 47.591 ], [ 13.6524, 47.5913 ], [ 13.6581, 47.5939 ], [ 13.6549, 47.5963 ], [ 13.6512, 47.5989 ], [ 13.6498, 47.6 ], [ 13.6468, 47.6021 ], [ 13.6559, 47.6144 ], [ 13.6771, 47.6248 ], [ 13.6846, 47.6311 ], [ 13.6979, 47.6325 ], [ 13.694, 47.6229 ], [ 13.6959, 47.6139 ] ] ] ] } },
{ "type": "Feature", "properties": { "id": "AT-04-02" }, "geometry": { "type": "MultiPolygon", "coordinates": [ [ [ [ 13.7077, 47.6592 ], [ 13.7077, 47.6569 ], [ 13.7061, 47.6529 ], [ 13.6979, 47.6325 ], [ 13.6846, 47.6311 ], [ 13.6771, 47.6248 ], [ 13.6559, 47.6144 ], [ 13.6468, 47.6021 ], [ 13.6498, 47.6 ], [ 13.6512, 47.5989 ], [ 13.6549, 47.5963 ], [ 13.6581, 47.5939 ], [ 13.6524, 47.5913 ], [ 13.6315, 47.591 ], [ 13.6177, 47.5897 ], [ 13.6036, 47.5943 ], [ 13.5925, 47.5951 ], [ 13.5738, 47.5892 ], [ 13.5457, 47.5871 ], [ 13.5332, 47.5844 ], [ 13.5259, 47.5872 ], [ 13.5056, 47.5916 ], [ 13.5061, 47.6003 ], [ 13.5061, 47.6006 ], [ 13.5233, 47.6182 ], [ 13.5205, 47.6232 ], [ 13.5135, 47.6328 ], [ 13.5058, 47.6292 ], [ 13.4895, 47.6299 ], [ 13.4838, 47.6412 ], [ 13.4902, 47.6438 ], [ 13.4908, 47.6447 ], [ 13.5001, 47.6593 ], [ 13.4989, 47.6655 ], [ 13.4985, 47.6677 ], [ 13.5113, 47.6776 ], [ 13.5171, 47.6756 ], [ 13.5259, 47.6795 ], [ 13.5324, 47.6823 ], [ 13.5363, 47.6958 ], [ 13.5471, 47.7029 ], [ 13.5512, 47.7135 ], [ 13.5513, 47.7136 ], [ 13.5518, 47.7135 ], [ 13.554, 47.7129 ], [ 13.5552, 47.7125 ], [ 13.5562, 47.7121 ], [ 13.557, 47.712 ], [ 13.5577, 47.712 ], [ 13.5586, 47.7121 ], [ 13.5596, 47.7123 ], [ 13.5625, 47.7132 ], [ 13.566, 47.7143 ], [ 13.5686, 47.715 ], [ 13.573, 47.7158 ], [ 13.5781, 47.7167 ], [ 13.5824, 47.7173 ], [ 13.5866, 47.7178 ], [ 13.59, 47.7183 ], [ 13.5924, 47.7187 ], [ 13.5947, 47.7193 ], [ 13.5972, 47.7197 ], [ 13.5994, 47.7199 ], [ 13.6018, 47.7201 ], [ 13.6056, 47.7202 ], [ 13.6083, 47.7202 ], [ 13.6099, 47.72 ], [ 13.611, 47.7198 ], [ 13.6122, 47.7192 ], [ 13.6129, 47.7186 ], [ 13.6137, 47.7176 ], [ 13.6143, 47.7163 ], [ 13.615, 47.7154 ], [ 13.6157, 47.7148 ], [ 13.6166, 47.7145 ], [ 13.619, 47.714 ], [ 13.6206, 47.7138 ], [ 13.621, 47.7138 ], [ 13.6235, 47.7136 ], [ 13.6267, 47.7135 ], [ 13.6326, 47.7118 ], [ 13.6488, 47.7041 ], [ 13.6786, 47.6928 ], [ 13.6921, 47.6943 ], [ 13.7235, 47.69 ], [ 13.7342, 47.6849 ], [ 13.7372, 47.6741 ], [ 13.7074, 47.6655 ], [ 13.7077, 47.6592 ] ] ] ] } },
{ "type": "Feature", "properties": { "id": "AT-04-03" }, "geometry": { "type": "MultiPolygon", "coordinates": [ [ [ [ 13.7718, 47.7106 ], [ 13.7666, 47.7058 ], [ 13.7549, 47.6996 ], [ 13.7489, 47.6874 ], [ 13.7342, 47.6849 ], [ 13.7235, 47.69 ], [ 13.6921, 47.6943 ], [ 13.6786, 47.6928 ], [ 13.6488, 47.7041 ], [ 13.6326, 47.7118 ], [ 13.6267, 47.7135 ], [ 13.6296, 47.7149 ], [ 13.6335, 47.7166 ], [ 13.6408, 47.7203 ], [ 13.6478, 47.7241 ], [ 13.6519, 47.726 ], [ 13.6553, 47.7271 ], [ 13.6573, 47.7282 ], [ 13.6587, 47.7293 ], [ 13.6596, 47.7309 ], [ 13.66, 47.7333 ], [ 13.6607, 47.7354 ], [ 13.6619, 47.7374 ], [ 13.6642, 47.7393 ], [ 13.6669, 47.7411 ], [ 13.6705, 47.7425 ], [ 13.6742, 47.7434 ], [ 13.6789, 47.7446 ], [ 13.6832, 47.7456 ], [ 13.6872, 47.7472 ], [ 13.6913, 47.7493 ], [ 13.6999, 47.7537 ], [ 13.7073, 47.7586 ], [ 13.7165, 47.7647 ], [ 13.7233, 47.7692 ], [ 13.7284, 47.7731 ], [ 13.7306, 47.7747 ], [ 13.7321, 47.7761 ], [ 13.733, 47.7778 ], [ 13.7443, 47.7773 ], [ 13.7647, 47.766 ], [ 13.7684, 47.7464 ], [ 13.7789, 47.7433 ], [ 13.7935, 47.7415 ], [ 13.804, 47.7427 ], [ 13.8156, 47.7429 ], [ 13.8386, 47.7476 ], [ 13.8645, 47.7439 ], [ 13.8829, 47.7438 ], [ 13.8927, 47.7487 ], [ 13.9055, 47.7493 ], [ 13.9224, 47.7478 ], [ 13.9298, 47.7489 ], [ 13.9376, 47.7548 ], [ 13.9502, 47.7519 ], [ 13.9547, 47.752 ], [ 13.9595, 47.7547 ], [ 13.9738, 47.7559 ], [ 13.987, 47.7691 ], [ 14.0008, 47.7703 ], [ 14.0097, 47.7662 ], [ 14.0135, 47.7581 ], [ 14.0268, 47.7593 ], [ 14.0373, 47.7634 ], [ 14.0512, 47.7645 ], [ 14.0703, 47.7719 ], [ 14.0763, 47.7717 ], [ 14.0821, 47.7686 ], [ 14.0947, 47.7684 ], [ 14.1123, 47.763 ], [ 14.1354, 47.7677 ], [ 14.159, 47.7576 ], [ 14.1644, 47.7573 ], [ 14.164, 47.7561 ], [ 14.1637, 47.7532 ], [ 14.1637, 47.7507 ], [ 14.1642, 47.7488 ], [ 14.1658, 47.7467 ], [ 14.1685, 47.7446 ], [ 14.1708, 47.7432 ], [ 14.1731, 47.7417 ], [ 14.1749, 47.74 ], [ 14.1768, 47.7373 ], [ 14.1783, 47.7346 ], [ 14.1788, 47.7334 ], [ 14.1787, 47.7323 ], [ 14.178, 47.7313 ], [ 14.1771, 47.7306 ], [ 14.1769, 47.7305 ], [ 14.1762, 47.7294 ], [ 14.1761, 47.7282 ], [ 14.1767, 47.7268 ], [ 14.177, 47.7262 ], [ 14.1777, 47.725 ], [ 14.1778, 47.7241 ], [ 14.1778, 47.7238 ], [ 14.1777, 47.7224 ], [ 14.1766, 47.7207 ], [ 14.1752, 47.7192 ], [ 14.1728, 47.7176 ], [ 14.1708, 47.7162 ], [ 14.169, 47.7146 ], [ 14.1674, 47.7129 ], [ 14.1658, 47.711 ], [ 14.1642, 47.7083 ], [ 14.1632, 47.7064 ], [ 14.1618, 47.705 ], [ 14.1597, 47.7038 ], [ 14.1596, 47.7038 ], [ 14.1568, 47.7026 ], [ 14.1513, 47.7004 ], [ 14.1476, 47.6987 ], [ 14.1447, 47.6969 ], [ 14.1423, 47.6948 ], [ 14.1393, 47.6924 ], [ 14.1363, 47.6903 ], [ 14.1316, 47.6875 ], [ 14.1271, 47.6844 ], [ 14.1213, 47.6806 ], [ 14.1178, 47.6775 ], [ 14.1136, 47.6737 ], [ 14.1099, 47.6703 ], [ 14.1073, 47.667 ], [ 14.1057, 47.6643 ], [ 14.1034, 47.66 ], [ 14.1007, 47.6554 ], [ 14.0962, 47.6506 ], [ 14.0922, 47.6466 ], [ 14.0856, 47.6418 ], [ 14.0709, 47.6288 ], [ 14.0637, 47.6246 ], [ 14.0505, 47.617 ], [ 14.0541, 47.6253 ], [ 14.0457, 47.6266 ], [ 14.0481, 47.6372 ], [ 14.0555, 47.6683 ], [ 14.0192, 47.6911 ], [ 14.0097, 47.7011 ], [ 14.0006, 47.7033 ], [ 13.9818, 47.6977 ], [ 13.9525, 47.71 ], [ 13.9358, 47.7099 ], [ 13.9201, 47.7048 ], [ 13.9067, 47.7106 ], [ 13.904, 47.7175 ], [ 13.8955, 47.7182 ], [ 13.8865, 47.7224 ], [ 13.8783, 47.7219 ], [ 13.8771, 47.7263 ], [ 13.8683, 47.7237 ], [ 13.861, 47.7268 ], [ 13.8508, 47.7142 ], [ 13.8397, 47.7184 ], [ 13.8041, 47.7139 ], [ 13.7931, 47.7125 ], [ 13.7769, 47.7189 ], [ 13.7781, 47.7166 ], [ 13.7718, 47.7106 ] ] ] ] } },
{ "type": "Feature", "properties": { "id": "AT-04-04" }, "geometry": { "type": "MultiPolygon", "coordinates": [ [ [ [ 14.4609, 47.6667 ], [ 14.4499, 47.6639 ], [ 14.445, 47.6551 ], [ 14.424, 47.653 ], [ 14.4208, 47.6563 ], [ 14.3981, 47.6529 ], [ 14.3932, 47.6485 ], [ 14.3946, 47.6416 ], [ 14.3954, 47.638 ], [ 14.3917, 47.6361 ], [ 14.387, 47.6345 ], [ 14.3717, 47.6291 ], [ 14.3602, 47.6292 ], [ 14.3348, 47.6185 ], [ 14.3301, 47.6122 ], [ 14.3266, 47.6076 ], [ 14.2953, 47.608 ], [ 14.2916, 47.6098 ], [ 14.2817, 47.6146 ], [ 14.2643, 47.6104 ], [ 14.2611, 47.6114 ], [ 14.2548, 47.6132 ], [ 14.2509, 47.6188 ], [ 14.2343, 47.628 ], [ 14.2233, 47.6419 ], [ 14.2329, 47.6505 ], [ 14.2185, 47.6499 ], [ 14.2054, 47.6522 ], [ 14.178, 47.638 ], [ 14.1688, 47.64 ], [ 14.1571, 47.6362 ], [ 14.1459, 47.6371 ], [ 14.1328, 47.63 ], [ 14.13, 47.6296 ], [ 14.1112, 47.6273 ], [ 14.0961, 47.6232 ], [ 14.0933, 47.6198 ], [ 14.0647, 47.6158 ], [ 14.0505, 47.617 ], [ 14.0637, 47.6246 ], [ 14.0709, 47.6288 ], [ 14.0856, 47.6418 ], [ 14.0922, 47.6466 ], [ 14.0962, 47.6506 ], [ 14.1007, 47.6554 ], [ 14.1034, 47.66 ], [ 14.1057, 47.6643 ], [ 14.1073, 47.667 ], [ 14.1099, 47.6703 ], [ 14.1136, 47.6737 ], [ 14.1178, 47.6775 ], [ 14.1213, 47.6806 ], [ 14.1271, 47.6844 ], [ 14.1316, 47.6875 ], [ 14.1363, 47.6903 ], [ 14.1393, 47.6924 ], [ 14.1423, 47.6948 ], [ 14.1447, 47.6969 ], [ 14.1476, 47.6987 ], [ 14.1513, 47.7004 ], [ 14.1568, 47.7026 ], [ 14.1596, 47.7038 ], [ 14.1597, 47.7038 ], [ 14.1618, 47.705 ], [ 14.1632, 47.7064 ], [ 14.1642, 47.7083 ], [ 14.1658, 47.711 ], [ 14.1674, 47.7129 ], [ 14.169, 47.7146 ], [ 14.1708, 47.7162 ], [ 14.1728, 47.7176 ], [ 14.1752, 47.7192 ], [ 14.1766, 47.7207 ], [ 14.1777, 47.7224 ], [ 14.1778, 47.7238 ], [ 14.1778, 47.7241 ], [ 14.1777, 47.725 ], [ 14.1855, 47.7242 ], [ 14.1925, 47.7201 ], [ 14.1898, 47.7156 ], [ 14.1827, 47.7088 ], [ 14.1864, 47.7072 ], [ 14.1945, 47.7067 ], [ 14.2099, 47.7111 ], [ 14.2181, 47.7098 ], [ 14.239, 47.7145 ], [ 14.249, 47.7117 ], [ 14.2616, 47.7126 ], [ 14.2744, 47.7054 ], [ 14.2861, 47.7066 ], [ 14.3016, 47.7134 ], [ 14.3043, 47.7106 ], [ 14.3064, 47.7092 ], [ 14.3084, 47.7083 ], [ 14.3119, 47.7073 ], [ 14.3158, 47.7061 ], [ 14.3187, 47.7047 ], [ 14.3205, 47.7033 ], [ 14.3216, 47.7019 ], [ 14.3481, 47.7001 ], [ 14.36, 47.7034 ], [ 14.3738, 47.7134 ], [ 14.3897, 47.7124 ], [ 14.402, 47.7142 ], [ 14.4237, 47.7134 ], [ 14.4297, 47.7099 ], [ 14.436, 47.7032 ], [ 14.4598, 47.6975 ], [ 14.4699, 47.6875 ], [ 14.4837, 47.6798 ], [ 14.4748, 47.6751 ], [ 14.4715, 47.6694 ], [ 14.4609, 47.6667 ] ] ] ] } },
{ "type": "Feature", "properties": { "id": "AT-04-05" }, "geometry": { "type": "MultiPolygon", "coordinates": [ [ [ [ 13.4537, 47.7776 ], [ 13.4648, 47.7862 ], [ 13.4869, 47.7824 ], [ 13.5149, 47.7725 ], [ 13.5351, 47.7768 ], [ 13.5384, 47.7837 ], [ 13.5309, 47.7949 ], [ 13.5308, 47.7951 ], [ 13.5306, 47.7954 ], [ 13.5306, 47.7955 ], [ 13.5305, 47.7955 ], [ 13.5293, 47.7973 ], [ 13.5297, 47.7975 ], [ 13.5309, 47.7982 ], [ 13.5322, 47.7995 ], [ 13.533, 47.7999 ], [ 13.5337, 47.8 ], [ 13.5357, 47.8 ], [ 13.5381, 47.8 ], [ 13.541, 47.8003 ], [ 13.5432, 47.8013 ], [ 13.5447, 47.8022 ], [ 13.5459, 47.8038 ], [ 13.5464, 47.8052 ], [ 13.5463, 47.8065 ], [ 13.546, 47.808 ], [ 13.5457, 47.8097 ], [ 13.5457, 47.8119 ], [ 13.5457, 47.8128 ], [ 13.5457, 47.8143 ], [ 13.5462, 47.8193 ], [ 13.5463, 47.8223 ], [ 13.546, 47.8247 ], [ 13.5453, 47.827 ], [ 13.5448, 47.8284 ], [ 13.5448, 47.8291 ], [ 13.5442, 47.8342 ], [ 13.5429, 47.8384 ], [ 13.5429, 47.8388 ], [ 13.5431, 47.8397 ], [ 13.5438, 47.8411 ], [ 13.5449, 47.8425 ], [ 13.5461, 47.844 ], [ 13.5482, 47.8458 ], [ 13.5506, 47.8476 ], [ 13.5532, 47.8497 ], [ 13.5538, 47.8502 ], [ 13.5547, 47.8513 ], [ 13.5554, 47.8524 ], [ 13.5563, 47.8541 ], [ 13.5565, 47.8546 ], [ 13.5569, 47.8555 ], [ 13.5574, 47.8568 ], [ 13.5585, 47.8583 ], [ 13.5603, 47.86 ], [ 13.5623, 47.863 ], [ 13.5627, 47.864 ], [ 13.5635, 47.8668 ], [ 13.5637, 47.8677 ], [ 13.5639, 47.8692 ], [ 13.564, 47.8709 ], [ 13.5637, 47.8738 ], [ 13.5642, 47.875 ], [ 13.5661, 47.8776 ], [ 13.5666, 47.879 ], [ 13.5668, 47.8811 ], [ 13.5668, 47.8821 ], [ 13.5668, 47.8831 ], [ 13.5666, 47.8858 ], [ 13.5668, 47.8882 ], [ 13.5682, 47.8913 ], [ 13.5696, 47.8933 ], [ 13.5701, 47.8947 ], [ 13.5699, 47.8958 ], [ 13.5694, 47.8973 ], [ 13.5686, 47.8982 ], [ 13.5679, 47.8989 ], [ 13.5659, 47.9006 ], [ 13.565, 47.9014 ], [ 13.5645, 47.9023 ], [ 13.5645, 47.9033 ], [ 13.5646, 47.9036 ], [ 13.5647, 47.9042 ], [ 13.565, 47.9046 ], [ 13.5651, 47.9048 ], [ 13.5654, 47.9053 ], [ 13.5675, 47.9069 ], [ 13.5697, 47.9085 ], [ 13.5719, 47.9098 ], [ 13.5732, 47.9109 ], [ 13.5744, 47.9119 ], [ 13.5748, 47.9127 ], [ 13.5751, 47.9132 ], [ 13.5761, 47.915 ], [ 13.5774, 47.9188 ], [ 13.5785, 47.922 ], [ 13.579, 47.9235 ], [ 13.5793, 47.9242 ], [ 13.5802, 47.9265 ], [ 13.5816, 47.9291 ], [ 13.5831, 47.9312 ], [ 13.5845, 47.9328 ], [ 13.5868, 47.9347 ], [ 13.5887, 47.9357 ], [ 13.5895, 47.9361 ], [ 13.5912, 47.9368 ], [ 13.5926, 47.9378 ], [ 13.5931, 47.9389 ], [ 13.5929, 47.9404 ], [ 13.5917, 47.9419 ], [ 13.5901, 47.9435 ], [ 13.5902, 47.9445 ], [ 13.5902, 47.9446 ], [ 13.5903, 47.9451 ], [ 13.5907, 47.9457 ], [ 13.5915, 47.9465 ], [ 13.5918, 47.9473 ], [ 13.5917, 47.9474 ], [ 13.5935, 47.9474 ], [ 13.5961, 47.9477 ], [ 13.5966, 47.9478 ], [ 13.5969, 47.9479 ], [ 13.5999, 47.9484 ], [ 13.6037, 47.9493 ], [ 13.6052, 47.9498 ], [ 13.6067, 47.9506 ], [ 13.6074, 47.9513 ], [ 13.6078, 47.9521 ], [ 13.6079, 47.9522 ], [ 13.6079, 47.9523 ], [ 13.6099, 47.952 ], [ 13.6113, 47.9517 ], [ 13.6148, 47.9515 ], [ 13.6174, 47.9515 ], [ 13.6212, 47.952 ], [ 13.6249, 47.9528 ], [ 13.6263, 47.9531 ], [ 13.6351, 47.9549 ], [ 13.6423, 47.9563 ], [ 13.6463, 47.9566 ], [ 13.6507, 47.9563 ], [ 13.6512, 47.9562 ], [ 13.6514, 47.9562 ], [ 13.6539, 47.9558 ], [ 13.655, 47.9555 ], [ 13.656, 47.9553 ], [ 13.6566, 47.955 ], [ 13.6579, 47.9547 ], [ 13.6629, 47.9529 ], [ 13.6668, 47.9511 ], [ 13.6707, 47.9498 ], [ 13.6728, 47.9494 ], [ 13.675, 47.949 ], [ 13.6762, 47.9489 ], [ 13.6792, 47.9487 ], [ 13.6843, 47.9489 ], [ 13.6898, 47.9497 ], [ 13.6948, 47.951 ], [ 13.6975, 47.9513 ], [ 13.7013, 47.9513 ], [ 13.7049, 47.951 ], [ 13.7087, 47.9507 ], [ 13.7123, 47.9511 ], [ 13.718, 47.9517 ], [ 13.7258, 47.9539 ], [ 13.7288, 47.9548 ], [ 13.7304, 47.9554 ], [ 13.7308, 47.9551 ], [ 13.7309, 47.955 ], [ 13.7316, 47.9549 ], [ 13.7326, 47.9547 ], [ 13.7345, 47.9545 ], [ 13.7375, 47.9545 ], [ 13.7378, 47.9545 ], [ 13.7397, 47.9545 ], [ 13.7416, 47.9544 ], [ 13.7419, 47.9544 ], [ 13.7421, 47.9543 ], [ 13.7442, 47.9536 ], [ 13.7478, 47.9515 ], [ 13.7504, 47.9502 ], [ 13.7528, 47.948 ], [ 13.7552, 47.9448 ], [ 13.7559, 47.9423 ], [ 13.7561, 47.9399 ], [ 13.7573, 47.9379 ], [ 13.759, 47.9368 ], [ 13.7611, 47.936 ], [ 13.764, 47.9355 ], [ 13.7663, 47.9354 ], [ 13.7692, 47.9351 ], [ 13.7713, 47.9346 ], [ 13.7735, 47.9343 ], [ 13.7757, 47.9338 ], [ 13.7779, 47.9336 ], [ 13.7797, 47.9335 ], [ 13.783, 47.933 ], [ 13.7846, 47.9325 ], [ 13.7868, 47.9312 ], [ 13.7869, 47.9311 ], [ 13.7876, 47.9308 ], [ 13.7973, 47.9312 ], [ 13.7977, 47.9301 ], [ 13.7988, 47.9285 ], [ 13.8012, 47.9263 ], [ 13.8017, 47.9258 ], [ 13.8025, 47.9247 ], [ 13.8027, 47.9238 ], [ 13.8028, 47.9233 ], [ 13.8027, 47.9219 ], [ 13.8024, 47.9202 ], [ 13.8017, 47.9187 ], [ 13.8005, 47.9171 ], [ 13.8, 47.9163 ], [ 13.7993, 47.9151 ], [ 13.7989, 47.9142 ], [ 13.799, 47.9131 ], [ 13.7995, 47.9117 ], [ 13.7998, 47.9098 ], [ 13.7993, 47.9077 ], [ 13.7985, 47.9056 ], [ 13.7967, 47.9034 ], [ 13.7943, 47.9014 ], [ 13.7916, 47.8997 ], [ 13.7908, 47.8986 ], [ 13.7903, 47.8971 ], [ 13.7902, 47.8955 ], [ 13.7905, 47.8904 ], [ 13.7914, 47.8842 ], [ 13.7925, 47.8794 ], [ 13.7938, 47.8746 ], [ 13.7955, 47.871 ], [ 13.7968, 47.868 ], [ 13.7978, 47.865 ], [ 13.7978, 47.8616 ], [ 13.7979, 47.8593 ], [ 13.7977, 47.8559 ], [ 13.7979, 47.8532 ], [ 13.799, 47.8508 ], [ 13.7995, 47.8493 ], [ 13.8002, 47.8481 ], [ 13.8007, 47.8464 ], [ 13.8003, 47.8441 ], [ 13.7991, 47.8419 ], [ 13.7981, 47.8399 ], [ 13.7969, 47.8382 ], [ 13.7967, 47.8363 ], [ 13.7974, 47.8341 ], [ 13.798, 47.8324 ], [ 13.7982, 47.8305 ], [ 13.7984, 47.8286 ], [ 13.7981, 47.8274 ], [ 13.7971, 47.8253 ], [ 13.7953, 47.8228 ], [ 13.7931, 47.8203 ], [ 13.7902, 47.8178 ], [ 13.7882, 47.8158 ], [ 13.7864, 47.8144 ], [ 13.7832, 47.8131 ], [ 13.7809, 47.8122 ], [ 13.7802, 47.8121 ], [ 13.7778, 47.8114 ], [ 13.7762, 47.8109 ], [ 13.7745, 47.8103 ], [ 13.7733, 47.8099 ], [ 13.7708, 47.8081 ], [ 13.7685, 47.8062 ], [ 13.7661, 47.8033 ], [ 13.7631, 47.8 ], [ 13.7595, 47.7974 ], [ 13.7553, 47.7952 ], [ 13.7512, 47.7935 ], [ 13.7475, 47.7921 ], [ 13.7431, 47.7895 ], [ 13.7385, 47.7867 ], [ 13.7351, 47.7842 ], [ 13.7338, 47.7826 ], [ 13.7335, 47.7812 ], [ 13.7335, 47.7796 ], [ 13.733, 47.7778 ], [ 13.7321, 47.7761 ], [ 13.7306, 47.7747 ], [ 13.7284, 47.7731 ], [ 13.7233, 47.7692 ], [ 13.7165, 47.7647 ], [ 13.7073, 47.7586 ], [ 13.6999, 47.7537 ], [ 13.6913, 47.7493 ], [ 13.6872, 47.7472 ], [ 13.6832, 47.7456 ], [ 13.6789, 47.7446 ], [ 13.6742, 47.7434 ], [ 13.6705, 47.7425 ], [ 13.6669, 47.7411 ], [ 13.6642, 47.7393 ], [ 13.6619, 47.7374 ], [ 13.6607, 47.7354 ], [ 13.66, 47.7333 ], [ 13.6596, 47.7309 ], [ 13.6587, 47.7293 ], [ 13.6573, 47.7282 ], [ 13.6553, 47.7271 ], [ 13.6519, 47.726 ], [ 13.6478, 47.7241 ], [ 13.6408, 47.7203 ], [ 13.6335, 47.7166 ], [ 13.6296, 47.7149 ], [ 13.6267, 47.7135 ], [ 13.6235, 47.7136 ], [ 13.621, 47.7138 ], [ 13.6206, 47.7138 ], [ 13.619, 47.714 ], [ 13.6166, 47.7145 ], [ 13.6157, 47.7148 ], [ 13.615, 47.7154 ], [ 13.6143, 47.7163 ], [ 13.6137, 47.7176 ], [ 13.6129, 47.7186 ], [ 13.6122, 47.7192 ], [ 13.611, 47.7198 ], [ 13.6099, 47.72 ], [ 13.6083, 47.7202 ], [ 13.6056, 47.7202 ], [ 13.6018, 47.7201 ], [ 13.5994, 47.7199 ], [ 13.5972, 47.7197 ], [ 13.5947, 47.7193 ], [ 13.5924, 47.7187 ], [ 13.59, 47.7183 ], [ 13.5866, 47.7178 ], [ 13.5824, 47.7173 ], [ 13.5781, 47.7167 ], [ 13.573, 47.7158 ], [ 13.5686, 47.715 ], [ 13.566, 47.7143 ], [ 13.5625, 47.7132 ], [ 13.5596, 47.7123 ], [ 13.5586, 47.7121 ], [ 13.5577, 47.712 ], [ 13.557, 47.712 ], [ 13.5562, 47.7121 ], [ 13.5552, 47.7125 ], [ 13.554, 47.7129 ], [ 13.5518, 47.7135 ], [ 13.5513, 47.7136 ], [ 13.547, 47.7144 ], [ 13.5424, 47.7151 ], [ 13.5395, 47.7157 ], [ 13.5382, 47.7158 ], [ 13.5375, 47.7159 ], [ 13.5363, 47.7161 ], [ 13.5349, 47.7162 ], [ 13.5325, 47.7162 ], [ 13.5306, 47.7162 ], [ 13.5291, 47.7163 ], [ 13.5278, 47.7166 ], [ 13.526, 47.7171 ], [ 13.5241, 47.7177 ], [ 13.5228, 47.718 ], [ 13.5217, 47.7183 ], [ 13.5201, 47.7185 ], [ 13.5197, 47.7186 ], [ 13.5186, 47.7186 ], [ 13.5169, 47.7186 ], [ 13.5135, 47.7183 ], [ 13.5103, 47.718 ], [ 13.5071, 47.7178 ], [ 13.5064, 47.7178 ], [ 13.5058, 47.7179 ], [ 13.5057, 47.718 ], [ 13.5056, 47.7181 ], [ 13.5053, 47.7184 ], [ 13.5054, 47.7187 ], [ 13.5056, 47.7191 ], [ 13.5059, 47.7196 ], [ 13.5063, 47.7203 ], [ 13.5063, 47.7206 ], [ 13.5062, 47.7208 ], [ 13.506, 47.7211 ], [ 13.5057, 47.7213 ], [ 13.5051, 47.7216 ], [ 13.5033, 47.722 ], [ 13.5004, 47.7225 ], [ 13.4978, 47.7227 ], [ 13.4953, 47.7227 ], [ 13.4933, 47.7226 ], [ 13.4913, 47.7223 ], [ 13.4891, 47.7221 ], [ 13.4867, 47.7217 ], [ 13.4848, 47.7215 ], [ 13.4824, 47.7216 ], [ 13.4803, 47.7218 ], [ 13.4782, 47.7222 ], [ 13.4762, 47.7229 ], [ 13.4367, 47.7381 ], [ 13.4367, 47.7389 ], [ 13.4446, 47.7667 ], [ 13.4461, 47.7717 ], [ 13.4537, 47.7776 ] ] ] ] } },
{ "type": "Feature", "properties": { "id": "AT-04-06" }, "geometry": { "type": "MultiPolygon", "coordinates": [ [ [ [ 13.8133, 47.9311 ], [ 13.8153, 47.9308 ], [ 13.8193, 47.931 ], [ 13.8232, 47.9318 ], [ 13.8276, 47.9322 ], [ 13.8326, 47.9328 ], [ 13.8371, 47.9333 ], [ 13.8417, 47.9346 ], [ 13.8488, 47.9381 ], [ 13.8549, 47.9403 ], [ 13.8622, 47.9409 ], [ 13.8654, 47.9406 ], [ 13.8735, 47.9399 ], [ 13.8742, 47.9398 ], [ 13.8789, 47.9392 ], [ 13.8874, 47.9353 ], [ 13.8906, 47.9345 ], [ 13.8964, 47.933 ], [ 13.9057, 47.9334 ], [ 13.9141, 47.935 ], [ 13.9166, 47.9352 ], [ 13.9201, 47.9355 ], [ 13.9331, 47.9346 ], [ 13.9381, 47.9342 ], [ 13.9536, 47.9302 ], [ 13.9634, 47.929 ], [ 13.9684, 47.9276 ], [ 13.9756, 47.9239 ], [ 13.9799, 47.9231 ], [ 13.9784, 47.9218 ], [ 13.9773, 47.92 ], [ 13.9768, 47.9186 ], [ 13.9766, 47.9168 ], [ 13.9764, 47.9159 ], [ 13.9758, 47.9148 ], [ 13.9748, 47.9138 ], [ 13.9733, 47.9128 ], [ 13.972, 47.9117 ], [ 13.971, 47.9104 ], [ 13.9698, 47.9085 ], [ 13.9691, 47.9074 ], [ 13.9686, 47.9065 ], [ 13.9673, 47.9048 ], [ 13.9662, 47.9036 ], [ 13.9652, 47.9028 ], [ 13.9619, 47.901 ], [ 13.9579, 47.8986 ], [ 13.9545, 47.8965 ], [ 13.9523, 47.8951 ], [ 13.9504, 47.8933 ], [ 13.9487, 47.8917 ], [ 13.947, 47.8902 ], [ 13.9447, 47.8885 ], [ 13.9436, 47.8874 ], [ 13.9432, 47.8865 ], [ 13.9428, 47.8846 ], [ 13.9427, 47.8822 ], [ 13.9433, 47.8782 ], [ 13.9434, 47.8754 ], [ 13.9428, 47.8715 ], [ 13.942, 47.8678 ], [ 13.9419, 47.8669 ], [ 13.9418, 47.8645 ], [ 13.9421, 47.8627 ], [ 13.9433, 47.8607 ], [ 13.9448, 47.8591 ], [ 13.9473, 47.8574 ], [ 13.9484, 47.8569 ], [ 13.9507, 47.8559 ], [ 13.9523, 47.8548 ], [ 13.9527, 47.8543 ], [ 13.9528, 47.8537 ], [ 13.9527, 47.853 ], [ 13.9519, 47.8516 ], [ 13.9517, 47.8514 ], [ 13.9506, 47.8501 ], [ 13.9498, 47.8487 ], [ 13.9496, 47.8477 ], [ 13.9496, 47.8469 ], [ 13.9499, 47.846 ], [ 13.9504, 47.8448 ], [ 13.9504, 47.8436 ], [ 13.9499, 47.8425 ], [ 13.9492, 47.8415 ], [ 13.9488, 47.8405 ], [ 13.9488, 47.8395 ], [ 13.949, 47.8387 ], [ 13.9495, 47.8379 ], [ 13.95, 47.8371 ], [ 13.9513, 47.8353 ], [ 13.9522, 47.8337 ], [ 13.9525, 47.8325 ], [ 13.9524, 47.8313 ], [ 13.9519, 47.8302 ], [ 13.9506, 47.8285 ], [ 13.9505, 47.8284 ], [ 13.9494, 47.8267 ], [ 13.9489, 47.8253 ], [ 13.9489, 47.824 ], [ 13.9493, 47.8222 ], [ 13.9502, 47.8197 ], [ 13.9508, 47.8174 ], [ 13.9508, 47.8162 ], [ 13.9502, 47.8145 ], [ 13.949, 47.8128 ], [ 13.9481, 47.8111 ], [ 13.9471, 47.8082 ], [ 13.9467, 47.8047 ], [ 13.9468, 47.8007 ], [ 13.9475, 47.7978 ], [ 13.9484, 47.7953 ], [ 13.9499, 47.7932 ], [ 13.9533, 47.7901 ], [ 13.9574, 47.7862 ], [ 13.9593, 47.7847 ], [ 13.9612, 47.7833 ], [ 13.9633, 47.7814 ], [ 13.964, 47.7798 ], [ 13.9641, 47.7783 ], [ 13.9638, 47.7763 ], [ 13.9629, 47.7748 ], [ 13.9621, 47.7739 ], [ 13.9608, 47.773 ], [ 13.9586, 47.7719 ], [ 13.9585, 47.7719 ], [ 13.9568, 47.771 ], [ 13.9561, 47.7704 ], [ 13.9559, 47.77 ], [ 13.9557, 47.7694 ], [ 13.9557, 47.7684 ], [ 13.9559, 47.7674 ], [ 13.9561, 47.7664 ], [ 13.9566, 47.7647 ], [ 13.9573, 47.7625 ], [ 13.9579, 47.761 ], [ 13.9585, 47.7597 ], [ 13.9596, 47.7577 ], [ 13.9595, 47.7547 ], [ 13.9547, 47.752 ], [ 13.9502, 47.7519 ], [ 13.9376, 47.7548 ], [ 13.9298, 47.7489 ], [ 13.9224, 47.7478 ], [ 13.9055, 47.7493 ], [ 13.8927, 47.7487 ], [ 13.8829, 47.7438 ], [ 13.8645, 47.7439 ], [ 13.8386, 47.7476 ], [ 13.8156, 47.7429 ], [ 13.804, 47.7427 ], [ 13.7935, 47.7415 ], [ 13.7789, 47.7433 ], [ 13.7684, 47.7464 ], [ 13.7647, 47.766 ], [ 13.7443, 47.7773 ], [ 13.733, 47.7778 ], [ 13.7335, 47.7796 ], [ 13.7335, 47.7812 ], [ 13.7338, 47.7826 ], [ 13.7351, 47.7842 ], [ 13.7385, 47.7867 ], [ 13.7431, 47.7895 ], [ 13.7475, 47.7921 ], [ 13.7512, 47.7935 ], [ 13.7553, 47.7952 ], [ 13.7595, 47.7974 ], [ 13.7631, 47.8 ], [ 13.7661, 47.8033 ], [ 13.7685, 47.8062 ], [ 13.7708, 47.8081 ], [ 13.7733, 47.8099 ], [ 13.7745, 47.8103 ], [ 13.7762, 47.8109 ], [ 13.7778, 47.8114 ], [ 13.7802, 47.8121 ], [ 13.7809, 47.8122 ], [ 13.7832, 47.8131 ], [ 13.7864, 47.8144 ], [ 13.7882, 47.8158 ], [ 13.7902, 47.8178 ], [ 13.7931, 47.8203 ], [ 13.7953, 47.8228 ], [ 13.7971, 47.8253 ], [ 13.7981, 47.8274 ], [ 13.7984, 47.8286 ], [ 13.7982, 47.8305 ], [ 13.798, 47.8324 ], [ 13.7974, 47.8341 ], [ 13.7967, 47.8363 ], [ 13.7969, 47.8382 ], [ 13.7981, 47.8399 ], [ 13.7991, 47.8419 ], [ 13.8003, 47.8441 ], [ 13.8007, 47.8464 ], [ 13.8002, 47.8481 ], [ 13.7995, 47.8493 ], [ 13.799, 47.8508 ], [ 13.7979, 47.8532 ], [ 13.7977, 47.8559 ], [ 13.7979, 47.8593 ], [ 13.7978, 47.8616 ], [ 13.7978, 47.865 ], [ 13.7968, 47.868 ], [ 13.7955, 47.871 ], [ 13.7938, 47.8746 ], [ 13.7925, 47.8794 ], [ 13.7914, 47.8842 ], [ 13.7905, 47.8904 ], [ 13.7902, 47.8955 ], [ 13.7903, 47.8971 ], [ 13.7908, 47.8986 ], [ 13.7916, 47.8997 ], [ 13.7943, 47.9014 ], [ 13.7967, 47.9034 ], [ 13.7985, 47.9056 ], [ 13.7993, 47.9077 ], [ 13.7998, 47.9098 ], [ 13.7995, 47.9117 ], [ 13.799, 47.9131 ], [ 13.7989, 47.9142 ], [ 13.7993, 47.9151 ], [ 13.8, 47.9163 ], [ 13.8005, 47.9171 ], [ 13.8017, 47.9187 ], [ 13.8024, 47.9202 ], [ 13.8027, 47.9219 ], [ 13.8028, 47.9233 ], [ 13.8027, 47.9238 ], [ 13.8025, 47.9247 ], [ 13.8017, 47.9258 ], [ 13.8012, 47.9263 ], [ 13.7988, 47.9285 ], [ 13.7977, 47.9301 ], [ 13.7973, 47.9312 ], [ 13.8019, 47.9308 ], [ 13.8039, 47.9306 ], [ 13.8055, 47.9307 ], [ 13.8057, 47.9307 ], [ 13.8133, 47.9311 ] ] ] ] } },
{ "type": "Feature", "properties": { "id": "AT-04-07" }, "geometry": { "type": "MultiPolygon", "coordinates": [ [ [ [ 14.0599, 47.9301 ], [ 14.0616, 47.9294 ], [ 14.0649, 47.9284 ], [ 14.0683, 47.9281 ], [ 14.0708, 47.928 ], [ 14.0738, 47.9274 ], [ 14.0757, 47.9265 ], [ 14.0776, 47.9255 ], [ 14.0799, 47.9252 ], [ 14.0847, 47.9251 ], [ 14.0898, 47.9257 ], [ 14.0926, 47.9259 ], [ 14.0953, 47.9258 ], [ 14.0946, 47.925 ], [ 14.0944, 47.9243 ], [ 14.0947, 47.923 ], [ 14.0951, 47.9225 ], [ 14.0957, 47.9218 ], [ 14.0971, 47.9206 ], [ 14.0991, 47.9184 ], [ 14.1005, 47.9164 ], [ 14.1019, 47.9131 ], [ 14.1028, 47.9102 ], [ 14.1039, 47.9077 ], [ 14.1059, 47.9048 ], [ 14.1096, 47.9009 ], [ 14.113, 47.8971 ], [ 14.1134, 47.8968 ], [ 14.1163, 47.8942 ], [ 14.1183, 47.893 ], [ 14.1207, 47.8923 ], [ 14.1232, 47.8914 ], [ 14.1242, 47.8905 ], [ 14.1245, 47.8895 ], [ 14.1247, 47.8883 ], [ 14.1252, 47.8874 ], [ 14.1261, 47.8865 ], [ 14.1288, 47.8851 ], [ 14.1307, 47.8839 ], [ 14.132, 47.8821 ], [ 14.1327, 47.88 ], [ 14.1334, 47.8761 ], [ 14.1339, 47.8738 ], [ 14.1342, 47.8729 ], [ 14.1343, 47.8724 ], [ 14.1348, 47.8713 ], [ 14.1357, 47.8702 ], [ 14.1362, 47.8691 ], [ 14.1407, 47.8688 ], [ 14.1434, 47.868 ], [ 14.1466, 47.8666 ], [ 14.1491, 47.8647 ], [ 14.1503, 47.863 ], [ 14.1503, 47.8613 ], [ 14.1493, 47.8589 ], [ 14.1488, 47.8559 ], [ 14.1493, 47.8538 ], [ 14.1514, 47.8518 ], [ 14.1546, 47.8509 ], [ 14.1611, 47.8502 ], [ 14.1674, 47.8503 ], [ 14.1717, 47.8504 ], [ 14.1764, 47.8497 ], [ 14.1789, 47.8489 ], [ 14.1782, 47.8475 ], [ 14.178, 47.8466 ], [ 14.1774, 47.8454 ], [ 14.1761, 47.8441 ], [ 14.175, 47.8433 ], [ 14.1724, 47.8418 ], [ 14.1696, 47.8404 ], [ 14.1661, 47.8388 ], [ 14.165, 47.8381 ], [ 14.1643, 47.8374 ], [ 14.1632, 47.8356 ], [ 14.1627, 47.8347 ], [ 14.1623, 47.8342 ], [ 14.1606, 47.8324 ], [ 14.1589, 47.8307 ], [ 14.158, 47.8296 ], [ 14.1576, 47.8285 ], [ 14.1573, 47.8266 ], [ 14.158, 47.8246 ], [ 14.1587, 47.8227 ], [ 14.1594, 47.8216 ], [ 14.1605, 47.8208 ], [ 14.1633, 47.8193 ], [ 14.1635, 47.8191 ], [ 14.1646, 47.8184 ], [ 14.165, 47.8173 ], [ 14.1651, 47.8164 ], [ 14.1645, 47.8152 ], [ 14.1637, 47.8145 ], [ 14.1631, 47.8139 ], [ 14.1625, 47.8128 ], [ 14.1625, 47.8116 ], [ 14.163, 47.8105 ], [ 14.1642, 47.8094 ], [ 14.1647, 47.809 ], [ 14.1662, 47.8077 ], [ 14.167, 47.8057 ], [ 14.1673, 47.8032 ], [ 14.1673, 47.8001 ], [ 14.1668, 47.7962 ], [ 14.1663, 47.7942 ], [ 14.1662, 47.7938 ], [ 14.1658, 47.7927 ], [ 14.1641, 47.7908 ], [ 14.1627, 47.7892 ], [ 14.1621, 47.7875 ], [ 14.1621, 47.7864 ], [ 14.1625, 47.7855 ], [ 14.1644, 47.784 ], [ 14.1654, 47.7831 ], [ 14.1665, 47.782 ], [ 14.1673, 47.7805 ], [ 14.1678, 47.7784 ], [ 14.1693, 47.776 ], [ 14.1707, 47.7725 ], [ 14.1708, 47.7702 ], [ 14.1708, 47.77 ], [ 14.1702, 47.7675 ], [ 14.1689, 47.7651 ], [ 14.1677, 47.7632 ], [ 14.1663, 47.7616 ], [ 14.1653, 47.7602 ], [ 14.1648, 47.7588 ], [ 14.1644, 47.7573 ], [ 14.159, 47.7576 ], [ 14.1354, 47.7677 ], [ 14.1123, 47.763 ], [ 14.0947, 47.7684 ], [ 14.0821, 47.7686 ], [ 14.0763, 47.7717 ], [ 14.0703, 47.7719 ], [ 14.0512, 47.7645 ], [ 14.0373, 47.7634 ], [ 14.0268, 47.7593 ], [ 14.0135, 47.7581 ], [ 14.0097, 47.7662 ], [ 14.0008, 47.7703 ], [ 13.987, 47.7691 ], [ 13.9738, 47.7559 ], [ 13.9595, 47.7547 ], [ 13.9596, 47.7577 ], [ 13.9585, 47.7597 ], [ 13.9579, 47.761 ], [ 13.9573, 47.7625 ], [ 13.9566, 47.7647 ], [ 13.9561, 47.7664 ], [ 13.9559, 47.7674 ], [ 13.9557, 47.7684 ], [ 13.9557, 47.7694 ], [ 13.9559, 47.77 ], [ 13.9561, 47.7704 ], [ 13.9568, 47.771 ], [ 13.9585, 47.7719 ], [ 13.9586, 47.7719 ], [ 13.9608, 47.773 ], [ 13.9621, 47.7739 ], [ 13.9629, 47.7748 ], [ 13.9638, 47.7763 ], [ 13.9641, 47.7783 ], [ 13.964, 47.7798 ], [ 13.9633, 47.7814 ], [ 13.9612, 47.7833 ], [ 13.9593, 47.7847 ], [ 13.9574, 47.7862 ], [ 13.9533, 47.7901 ], [ 13.9499, 47.7932 ], [ 13.9484, 47.7953 ], [ 13.9475, 47.7978 ], [ 13.9468, 47.8007 ], [ 13.9467, 47.8047 ], [ 13.9471, 47.8082 ], [ 13.9481, 47.8111 ], [ 13.949, 47.8128 ], [ 13.9502, 47.8145 ], [ 13.9508, 47.8162 ], [ 13.9508, 47.8174 ], [ 13.9502, 47.8197 ], [ 13.9493, 47.8222 ], [ 13.9489, 47.824 ], [ 13.9489, 47.8253 ], [ 13.9494, 47.8267 ], [ 13.9505, 47.8284 ], [ 13.9506, 47.8285 ], [ 13.9519, 47.8302 ], [ 13.9524, 47.8313 ], [ 13.9525, 47.8325 ], [ 13.9522, 47.8337 ], [ 13.9513, 47.8353 ], [ 13.95, 47.8371 ], [ 13.9495, 47.8379 ], [ 13.949, 47.8387 ], [ 13.9488, 47.8395 ], [ 13.9488, 47.8405 ], [ 13.9492, 47.8415 ], [ 13.9499, 47.8425 ], [ 13.9504, 47.8436 ], [ 13.9504, 47.8448 ], [ 13.9499, 47.846 ], [ 13.9496, 47.8469 ], [ 13.9496, 47.8477 ], [ 13.9498, 47.8487 ], [ 13.9506, 47.8501 ], [ 13.9517, 47.8514 ], [ 13.9519, 47.8516 ], [ 13.9527, 47.853 ], [ 13.9528, 47.8537 ], [ 13.9527, 47.8543 ], [ 13.9523, 47.8548 ], [ 13.9507, 47.8559 ], [ 13.9484, 47.8569 ], [ 13.9473, 47.8574 ], [ 13.9448, 47.8591 ], [ 13.9433, 47.8607 ], [ 13.9421, 47.8627 ], [ 13.9418, 47.8645 ], [ 13.9419, 47.8669 ], [ 13.942, 47.8678 ], [ 13.9428, 47.8715 ], [ 13.9434, 47.8754 ], [ 13.9433, 47.8782 ], [ 13.9427, 47.8822 ], [ 13.9428, 47.8846 ], [ 13.9432, 47.8865 ], [ 13.9436, 47.8874 ], [ 13.9447, 47.8885 ], [ 13.947, 47.8902 ], [ 13.9487, 47.8917 ], [ 13.9504, 47.8933 ], [ 13.9523, 47.8951 ], [ 13.9545, 47.8965 ], [ 13.9579, 47.8986 ], [ 13.9619, 47.901 ], [ 13.9652, 47.9028 ], [ 13.9662, 47.9036 ], [ 13.9673, 47.9048 ], [ 13.9686, 47.9065 ], [ 13.9691, 47.9074 ], [ 13.9698, 47.9085 ], [ 13.971, 47.9104 ], [ 13.972, 47.9117 ], [ 13.9733, 47.9128 ], [ 13.9748, 47.9138 ], [ 13.9758, 47.9148 ], [ 13.9764, 47.9159 ], [ 13.9766, 47.9168 ], [ 13.9768, 47.9186 ], [ 13.9773, 47.92 ], [ 13.9784, 47.9218 ], [ 13.9799, 47.9231 ], [ 13.9803, 47.9233 ], [ 13.9814, 47.9239 ], [ 13.9835, 47.9246 ], [ 13.9881, 47.9259 ], [ 13.9883, 47.926 ], [ 13.9896, 47.9265 ], [ 13.9906, 47.9271 ], [ 13.9914, 47.9277 ], [ 13.9917, 47.9286 ], [ 13.9917, 47.9301 ], [ 13.9914, 47.9329 ], [ 13.9914, 47.9338 ], [ 13.9943, 47.9343 ], [ 14.0021, 47.9355 ], [ 14.0063, 47.937 ], [ 14.0115, 47.9388 ], [ 14.0195, 47.9387 ], [ 14.0264, 47.937 ], [ 14.0382, 47.9354 ], [ 14.0396, 47.9353 ], [ 14.0462, 47.9345 ], [ 14.0554, 47.9319 ], [ 14.0598, 47.9302 ], [ 14.0599, 47.9301 ] ] ] ] } },
{ "type": "Feature", "properties": { "id": "AT-04-08" }, "geometry": { "type": "MultiPolygon", "coordinates": [ [ [ [ 14.1072, 47.9345 ], [ 14.1077, 47.9364 ], [ 14.1191, 47.9359 ], [ 14.1194, 47.9359 ], [ 14.1306, 47.9348 ], [ 14.1356, 47.9353 ], [ 14.1383, 47.938 ], [ 14.1417, 47.9395 ], [ 14.1442, 47.9393 ], [ 14.1503, 47.9391 ], [ 14.1577, 47.9415 ], [ 14.1617, 47.9437 ], [ 14.1649, 47.9455 ], [ 14.1695, 47.9462 ], [ 14.1719, 47.9461 ], [ 14.178, 47.9459 ], [ 14.1869, 47.944 ], [ 14.1923, 47.9443 ], [ 14.1969, 47.9459 ], [ 14.2076, 47.9481 ], [ 14.2151, 47.9473 ], [ 14.221, 47.9469 ], [ 14.2287, 47.9479 ], [ 14.2302, 47.9479 ], [ 14.2351, 47.9479 ], [ 14.2423, 47.948 ], [ 14.2478, 47.9496 ], [ 14.2507, 47.9528 ], [ 14.2532, 47.9549 ], [ 14.2558, 47.9555 ], [ 14.2563, 47.9542 ], [ 14.2565, 47.9528 ], [ 14.2567, 47.9516 ], [ 14.2571, 47.9507 ], [ 14.2578, 47.95 ], [ 14.2585, 47.9494 ], [ 14.2587, 47.9488 ], [ 14.2588, 47.9482 ], [ 14.2587, 47.9477 ], [ 14.2582, 47.9471 ], [ 14.2567, 47.9456 ], [ 14.2563, 47.9452 ], [ 14.2542, 47.9432 ], [ 14.2524, 47.9415 ], [ 14.251, 47.9402 ], [ 14.2498, 47.9387 ], [ 14.2491, 47.937 ], [ 14.2483, 47.9348 ], [ 14.248, 47.9332 ], [ 14.2482, 47.9316 ], [ 14.2488, 47.9298 ], [ 14.2495, 47.9284 ], [ 14.2499, 47.9272 ], [ 14.2499, 47.9262 ], [ 14.2497, 47.9246 ], [ 14.2487, 47.9225 ], [ 14.2473, 47.9198 ], [ 14.246, 47.9173 ], [ 14.2452, 47.9157 ], [ 14.2444, 47.9148 ], [ 14.2436, 47.9142 ], [ 14.2421, 47.9137 ], [ 14.242, 47.9136 ], [ 14.2405, 47.9132 ], [ 14.2393, 47.9126 ], [ 14.2388, 47.9119 ], [ 14.2384, 47.9112 ], [ 14.2381, 47.9102 ], [ 14.2379, 47.9092 ], [ 14.2374, 47.9084 ], [ 14.2371, 47.9077 ], [ 14.2368, 47.9071 ], [ 14.237, 47.9064 ], [ 14.2371, 47.9059 ], [ 14.2379, 47.9051 ], [ 14.2393, 47.9044 ], [ 14.2405, 47.9038 ], [ 14.2408, 47.9033 ], [ 14.2408, 47.9025 ], [ 14.2405, 47.9019 ], [ 14.24, 47.9011 ], [ 14.2398, 47.9003 ], [ 14.2397, 47.8993 ], [ 14.2401, 47.8986 ], [ 14.2406, 47.8979 ], [ 14.2417, 47.8971 ], [ 14.2423, 47.8965 ], [ 14.2425, 47.8958 ], [ 14.2549, 47.8942 ], [ 14.2677, 47.8949 ], [ 14.2917, 47.8917 ], [ 14.3138, 47.8889 ], [ 14.3228, 47.884 ], [ 14.3287, 47.8713 ], [ 14.3361, 47.8628 ], [ 14.347, 47.86 ], [ 14.3746, 47.8592 ], [ 14.3871, 47.8559 ], [ 14.398, 47.8466 ], [ 14.4099, 47.8418 ], [ 14.4213, 47.8431 ], [ 14.4444, 47.8557 ], [ 14.4548, 47.8564 ], [ 14.4557, 47.855 ], [ 14.457, 47.8538 ], [ 14.4576, 47.8527 ], [ 14.4576, 47.8516 ], [ 14.4573, 47.8506 ], [ 14.4559, 47.8492 ], [ 14.4558, 47.8481 ], [ 14.4561, 47.8472 ], [ 14.4567, 47.8464 ], [ 14.4588, 47.8453 ], [ 14.4617, 47.8441 ], [ 14.4634, 47.8426 ], [ 14.464, 47.8414 ], [ 14.464, 47.8404 ], [ 14.4635, 47.8391 ], [ 14.4622, 47.8383 ], [ 14.4612, 47.8372 ], [ 14.4609, 47.8368 ], [ 14.4602, 47.8347 ], [ 14.4603, 47.832 ], [ 14.4606, 47.8312 ], [ 14.4611, 47.8299 ], [ 14.4622, 47.8282 ], [ 14.4636, 47.8269 ], [ 14.4656, 47.8259 ], [ 14.4658, 47.8259 ], [ 14.468, 47.825 ], [ 14.4691, 47.8241 ], [ 14.4694, 47.8233 ], [ 14.4696, 47.8228 ], [ 14.4701, 47.8204 ], [ 14.4701, 47.8178 ], [ 14.47, 47.8174 ], [ 14.4702, 47.815 ], [ 14.4711, 47.8125 ], [ 14.4715, 47.8118 ], [ 14.4724, 47.8097 ], [ 14.4736, 47.8077 ], [ 14.4748, 47.8067 ], [ 14.4755, 47.8059 ], [ 14.4759, 47.8052 ], [ 14.4761, 47.8043 ], [ 14.4759, 47.8033 ], [ 14.4758, 47.8019 ], [ 14.4761, 47.7997 ], [ 14.4764, 47.7971 ], [ 14.4762, 47.7955 ], [ 14.476, 47.7933 ], [ 14.4754, 47.7901 ], [ 14.4756, 47.7879 ], [ 14.4759, 47.7866 ], [ 14.4775, 47.7847 ], [ 14.4802, 47.783 ], [ 14.4811, 47.7824 ], [ 14.4848, 47.7804 ], [ 14.4865, 47.779 ], [ 14.488, 47.7774 ], [ 14.4888, 47.776 ], [ 14.4888, 47.7745 ], [ 14.4885, 47.773 ], [ 14.4883, 47.7721 ], [ 14.4876, 47.7702 ], [ 14.4875, 47.768 ], [ 14.488, 47.7662 ], [ 14.4892, 47.7648 ], [ 14.4919, 47.7633 ], [ 14.4961, 47.7617 ], [ 14.4988, 47.7606 ], [ 14.5001, 47.7601 ], [ 14.5031, 47.7589 ], [ 14.5054, 47.7574 ], [ 14.5055, 47.7572 ], [ 14.5066, 47.7558 ], [ 14.5082, 47.754 ], [ 14.5093, 47.7528 ], [ 14.5101, 47.7521 ], [ 14.5278, 47.7557 ], [ 14.5363, 47.7523 ], [ 14.5425, 47.7447 ], [ 14.5537, 47.7268 ], [ 14.5539, 47.7199 ], [ 14.5314, 47.7131 ], [ 14.5241, 47.7072 ], [ 14.5215, 47.7035 ], [ 14.5282, 47.6958 ], [ 14.5151, 47.6812 ], [ 14.5006, 47.6785 ], [ 14.489, 47.6825 ], [ 14.4837, 47.6798 ], [ 14.4699, 47.6875 ], [ 14.4598, 47.6975 ], [ 14.436, 47.7032 ], [ 14.4297, 47.7099 ], [ 14.4237, 47.7134 ], [ 14.402, 47.7142 ], [ 14.3897, 47.7124 ], [ 14.3738, 47.7134 ], [ 14.36, 47.7034 ], [ 14.3481, 47.7001 ], [ 14.3216, 47.7019 ], [ 14.3205, 47.7033 ], [ 14.3187, 47.7047 ], [ 14.3158, 47.7061 ], [ 14.3119, 47.7073 ], [ 14.3084, 47.7083 ], [ 14.3064, 47.7092 ], [ 14.3043, 47.7106 ], [ 14.3016, 47.7134 ], [ 14.2861, 47.7066 ], [ 14.2744, 47.7054 ], [ 14.2616, 47.7126 ], [ 14.249, 47.7117 ], [ 14.239, 47.7145 ], [ 14.2181, 47.7098 ], [ 14.2099, 47.7111 ], [ 14.1945, 47.7067 ], [ 14.1864, 47.7072 ], [ 14.1827, 47.7088 ], [ 14.1898, 47.7156 ], [ 14.1925, 47.7201 ], [ 14.1855, 47.7242 ], [ 14.1777, 47.725 ], [ 14.177, 47.7262 ], [ 14.1767, 47.7268 ], [ 14.1761, 47.7282 ], [ 14.1762, 47.7294 ], [ 14.1769, 47.7305 ], [ 14.1771, 47.7306 ], [ 14.178, 47.7313 ], [ 14.1787, 47.7323 ], [ 14.1788, 47.7334 ], [ 14.1783, 47.7346 ], [ 14.1768, 47.7373 ], [ 14.1749, 47.74 ], [ 14.1731, 47.7417 ], [ 14.1708, 47.7432 ], [ 14.1685, 47.7446 ], [ 14.1658, 47.7467 ], [ 14.1642, 47.7488 ], [ 14.1637, 47.7507 ], [ 14.1637, 47.7532 ], [ 14.164, 47.7561 ], [ 14.1644, 47.7573 ], [ 14.1648, 47.7588 ], [ 14.1653, 47.7602 ], [ 14.1663, 47.7616 ], [ 14.1677, 47.7632 ], [ 14.1689, 47.7651 ], [ 14.1702, 47.7675 ], [ 14.1708, 47.77 ], [ 14.1708, 47.7702 ], [ 14.1707, 47.7725 ], [ 14.1693, 47.776 ], [ 14.1678, 47.7784 ], [ 14.1673, 47.7805 ], [ 14.1665, 47.782 ], [ 14.1654, 47.7831 ], [ 14.1644, 47.784 ], [ 14.1625, 47.7855 ], [ 14.1621, 47.7864 ], [ 14.1621, 47.7875 ], [ 14.1627, 47.7892 ], [ 14.1641, 47.7908 ], [ 14.1658, 47.7927 ], [ 14.1662, 47.7938 ], [ 14.1663, 47.7942 ], [ 14.1668, 47.7962 ], [ 14.1673, 47.8001 ], [ 14.1673, 47.8032 ], [ 14.167, 47.8057 ], [ 14.1662, 47.8077 ], [ 14.1647, 47.809 ], [ 14.1642, 47.8094 ], [ 14.163, 47.8105 ], [ 14.1625, 47.8116 ], [ 14.1625, 47.8128 ], [ 14.1631, 47.8139 ], [ 14.1637, 47.8145 ], [ 14.1645, 47.8152 ], [ 14.1651, 47.8164 ], [ 14.165, 47.8173 ], [ 14.1646, 47.8184 ], [ 14.1635, 47.8191 ], [ 14.1633, 47.8193 ], [ 14.1605, 47.8208 ], [ 14.1594, 47.8216 ], [ 14.1587, 47.8227 ], [ 14.158, 47.8246 ], [ 14.1573, 47.8266 ], [ 14.1576, 47.8285 ], [ 14.158, 47.8296 ], [ 14.1589, 47.8307 ], [ 14.1606, 47.8324 ], [ 14.1623, 47.8342 ], [ 14.1627, 47.8347 ], [ 14.1632, 47.8356 ], [ 14.1643, 47.8374 ], [ 14.165, 47.8381 ], [ 14.1661, 47.8388 ], [ 14.1696, 47.8404 ], [ 14.1724, 47.8418 ], [ 14.175, 47.8433 ], [ 14.1761, 47.8441 ], [ 14.1774, 47.8454 ], [ 14.178, 47.8466 ], [ 14.1782, 47.8475 ], [ 14.1789, 47.8489 ], [ 14.1764, 47.8497 ], [ 14.1717, 47.8504 ], [ 14.1674, 47.8503 ], [ 14.1611, 47.8502 ], [ 14.1546, 47.8509 ], [ 14.1514, 47.8518 ], [ 14.1493, 47.8538 ], [ 14.1488, 47.8559 ], [ 14.1493, 47.8589 ], [ 14.1503, 47.8613 ], [ 14.1503, 47.863 ], [ 14.1491, 47.8647 ], [ 14.1466, 47.8666 ], [ 14.1434, 47.868 ], [ 14.1407, 47.8688 ], [ 14.1362, 47.8691 ], [ 14.1357, 47.8702 ], [ 14.1348, 47.8713 ], [ 14.1343, 47.8724 ], [ 14.1342, 47.8729 ], [ 14.1339, 47.8738 ], [ 14.1334, 47.8761 ], [ 14.1327, 47.88 ], [ 14.132, 47.8821 ], [ 14.1307, 47.8839 ], [ 14.1288, 47.8851 ], [ 14.1261, 47.8865 ], [ 14.1252, 47.8874 ], [ 14.1247, 47.8883 ], [ 14.1245, 47.8895 ], [ 14.1242, 47.8905 ], [ 14.1232, 47.8914 ], [ 14.1207, 47.8923 ], [ 14.1183, 47.893 ], [ 14.1163, 47.8942 ], [ 14.1134, 47.8968 ], [ 14.113, 47.8971 ], [ 14.1096, 47.9009 ], [ 14.1059, 47.9048 ], [ 14.1039, 47.9077 ], [ 14.1028, 47.9102 ], [ 14.1019, 47.9131 ], [ 14.1005, 47.9164 ], [ 14.0991, 47.9184 ], [ 14.0971, 47.9206 ], [ 14.0957, 47.9218 ], [ 14.0951, 47.9225 ], [ 14.0947, 47.923 ], [ 14.0944, 47.9243 ], [ 14.0946, 47.925 ], [ 14.0953, 47.9258 ], [ 14.0974, 47.9271 ], [ 14.1011, 47.9295 ], [ 14.1049, 47.9319 ], [ 14.1063, 47.9331 ], [ 14.1072, 47.9345 ] ] ] ] } },
{ "type": "Feature", "properties": { "id": "AT-04-09" }, "geometry": { "type": "MultiPolygon", "coordinates": [ [ [ [ 14.7182, 47.8108 ], [ 14.7305, 47.8046 ], [ 14.7317, 47.7995 ], [ 14.7124, 47.79 ], [ 14.7151, 47.7846 ], [ 14.7225, 47.77 ], [ 14.7321, 47.7613 ], [ 14.7351, 47.7587 ], [ 14.7459, 47.7552 ], [ 14.7378, 47.7486 ], [ 14.731, 47.7517 ], [ 14.72, 47.7565 ], [ 14.7152, 47.7602 ], [ 14.7064, 47.76 ], [ 14.7023, 47.7645 ], [ 14.6949, 47.7641 ], [ 14.6728, 47.743 ], [ 14.6629, 47.7395 ], [ 14.6521, 47.7388 ], [ 14.6519, 47.7371 ], [ 14.6519, 47.737 ], [ 14.6515, 47.7358 ], [ 14.6498, 47.7337 ], [ 14.6487, 47.732 ], [ 14.6481, 47.73 ], [ 14.6478, 47.7279 ], [ 14.6478, 47.7278 ], [ 14.6474, 47.7268 ], [ 14.6466, 47.7257 ], [ 14.6141, 47.7307 ], [ 14.6102, 47.7282 ], [ 14.6028, 47.7294 ], [ 14.5893, 47.7196 ], [ 14.581, 47.7174 ], [ 14.5539, 47.7199 ], [ 14.5537, 47.7268 ], [ 14.5425, 47.7447 ], [ 14.5363, 47.7523 ], [ 14.5278, 47.7557 ], [ 14.5101, 47.7521 ], [ 14.5093, 47.7528 ], [ 14.5082, 47.754 ], [ 14.5066, 47.7558 ], [ 14.5055, 47.7572 ], [ 14.5054, 47.7574 ], [ 14.5031, 47.7589 ], [ 14.5001, 47.7601 ], [ 14.4988, 47.7606 ], [ 14.4961, 47.7617 ], [ 14.4919, 47.7633 ], [ 14.4892, 47.7648 ], [ 14.488, 47.7662 ], [ 14.4875, 47.768 ], [ 14.4876, 47.7702 ], [ 14.4883, 47.7721 ], [ 14.4885, 47.773 ], [ 14.4888, 47.7745 ], [ 14.4888, 47.776 ], [ 14.488, 47.7774 ], [ 14.4865, 47.779 ], [ 14.4848, 47.7804 ], [ 14.4811, 47.7824 ], [ 14.4802, 47.783 ], [ 14.4775, 47.7847 ], [ 14.4759, 47.7866 ], [ 14.4756, 47.7879 ], [ 14.4754, 47.7901 ], [ 14.476, 47.7933 ], [ 14.4762, 47.7955 ], [ 14.4764, 47.7971 ], [ 14.4761, 47.7997 ], [ 14.4758, 47.8019 ], [ 14.4759, 47.8033 ], [ 14.4761, 47.8043 ], [ 14.4759, 47.8052 ], [ 14.4755, 47.8059 ], [ 14.4748, 47.8067 ], [ 14.4736, 47.8077 ], [ 14.4724, 47.8097 ], [ 14.4715, 47.8118 ], [ 14.4711, 47.8125 ], [ 14.4702, 47.815 ], [ 14.47, 47.8174 ], [ 14.4701, 47.8178 ], [ 14.4701, 47.8204 ], [ 14.4696, 47.8228 ], [ 14.4694, 47.8233 ], [ 14.4691, 47.8241 ], [ 14.468, 47.825 ], [ 14.4658, 47.8259 ], [ 14.4656, 47.8259 ], [ 14.4636, 47.8269 ], [ 14.4622, 47.8282 ], [ 14.4611, 47.8299 ], [ 14.4606, 47.8312 ], [ 14.4603, 47.832 ], [ 14.4602, 47.8347 ], [ 14.4609, 47.8368 ], [ 14.4612, 47.8372 ], [ 14.4622, 47.8383 ], [ 14.4635, 47.8391 ], [ 14.464, 47.8404 ], [ 14.464, 47.8414 ], [ 14.4634, 47.8426 ], [ 14.4617, 47.8441 ], [ 14.4588, 47.8453 ], [ 14.4567, 47.8464 ], [ 14.4561, 47.8472 ], [ 14.4558, 47.8481 ], [ 14.4559, 47.8492 ], [ 14.4573, 47.8506 ], [ 14.4576, 47.8516 ], [ 14.4576, 47.8527 ], [ 14.457, 47.8538 ], [ 14.4557, 47.855 ], [ 14.4548, 47.8564 ], [ 14.4444, 47.8557 ], [ 14.4213, 47.8431 ], [ 14.4099, 47.8418 ], [ 14.398, 47.8466 ], [ 14.3871, 47.8559 ], [ 14.3746, 47.8592 ], [ 14.347, 47.86 ], [ 14.3361, 47.8628 ], [ 14.3287, 47.8713 ], [ 14.3228, 47.884 ], [ 14.3138, 47.8889 ], [ 14.2917, 47.8917 ], [ 14.2677, 47.8949 ], [ 14.2549, 47.8942 ], [ 14.2425, 47.8958 ], [ 14.2423, 47.8965 ], [ 14.2417, 47.8971 ], [ 14.2406, 47.8979 ], [ 14.2401, 47.8986 ], [ 14.2397, 47.8993 ], [ 14.2398, 47.9003 ], [ 14.24, 47.9011 ], [ 14.2405, 47.9019 ], [ 14.2408, 47.9025 ], [ 14.2408, 47.9033 ], [ 14.2405, 47.9038 ], [ 14.2393, 47.9044 ], [ 14.2379, 47.9051 ], [ 14.2371, 47.9059 ], [ 14.237, 47.9064 ], [ 14.2368, 47.9071 ], [ 14.2371, 47.9077 ], [ 14.2374, 47.9084 ], [ 14.2379, 47.9092 ], [ 14.2381, 47.9102 ], [ 14.2384, 47.9112 ], [ 14.2388, 47.9119 ], [ 14.2393, 47.9126 ], [ 14.2405, 47.9132 ], [ 14.242, 47.9136 ], [ 14.2421, 47.9137 ], [ 14.2436, 47.9142 ], [ 14.2444, 47.9148 ], [ 14.2452, 47.9157 ], [ 14.246, 47.9173 ], [ 14.2473, 47.9198 ], [ 14.2487, 47.9225 ], [ 14.2497, 47.9246 ], [ 14.2499, 47.9262 ], [ 14.2499, 47.9272 ], [ 14.2495, 47.9284 ], [ 14.2488, 47.9298 ], [ 14.2482, 47.9316 ], [ 14.248, 47.9332 ], [ 14.2483, 47.9348 ], [ 14.2491, 47.937 ], [ 14.2498, 47.9387 ], [ 14.251, 47.9402 ], [ 14.2524, 47.9415 ], [ 14.2542, 47.9432 ], [ 14.2563, 47.9452 ], [ 14.2567, 47.9456 ], [ 14.2582, 47.9471 ], [ 14.2587, 47.9477 ], [ 14.2588, 47.9482 ], [ 14.2587, 47.9488 ], [ 14.2585, 47.9494 ], [ 14.2578, 47.95 ], [ 14.2571, 47.9507 ], [ 14.2567, 47.9516 ], [ 14.2565, 47.9528 ], [ 14.2563, 47.9542 ], [ 14.2558, 47.9555 ], [ 14.2554, 47.9565 ], [ 14.2554, 47.9574 ], [ 14.2558, 47.9583 ], [ 14.2562, 47.9592 ], [ 14.2575, 47.9608 ], [ 14.2586, 47.9623 ], [ 14.259, 47.9629 ], [ 14.2664, 47.9616 ], [ 14.2713, 47.9608 ], [ 14.2842, 47.9599 ], [ 14.2951, 47.9609 ], [ 14.3055, 47.9634 ], [ 14.316, 47.9639 ], [ 14.3169, 47.964 ], [ 14.3256, 47.9656 ], [ 14.3321, 47.9691 ], [ 14.3367, 47.9718 ], [ 14.3403, 47.9729 ], [ 14.3475, 47.9737 ], [ 14.3574, 47.9742 ], [ 14.3576, 47.9758 ], [ 14.3571, 47.9788 ], [ 14.356, 47.9808 ], [ 14.356, 47.9823 ], [ 14.3571, 47.9834 ], [ 14.3578, 47.9838 ], [ 14.3595, 47.9845 ], [ 14.3612, 47.9848 ], [ 14.3622, 47.985 ], [ 14.3625, 47.9849 ], [ 14.3658, 47.9851 ], [ 14.3667, 47.9852 ], [ 14.3675, 47.9857 ], [ 14.368, 47.9864 ], [ 14.3682, 47.9879 ], [ 14.3685, 47.9898 ], [ 14.3695, 47.9911 ], [ 14.3709, 47.992 ], [ 14.3736, 47.9927 ], [ 14.3782, 47.9929 ], [ 14.3828, 47.9927 ], [ 14.3858, 47.9927 ], [ 14.388, 47.993 ], [ 14.3906, 47.9938 ], [ 14.3932, 47.995 ], [ 14.3961, 47.997 ], [ 14.3976, 47.9981 ], [ 14.3987, 47.9989 ], [ 14.4012, 48.0001 ], [ 14.4033, 48.0008 ], [ 14.4042, 48.0012 ], [ 14.4069, 48.0025 ], [ 14.4081, 48.0039 ], [ 14.409, 48.0053 ], [ 14.4091, 48.008 ], [ 14.4091, 48.0082 ], [ 14.4093, 48.0116 ], [ 14.4225, 48.0122 ], [ 14.4233, 48.0121 ], [ 14.4295, 48.0115 ], [ 14.4391, 48.0098 ], [ 14.4445, 48.0097 ], [ 14.4488, 48.0111 ], [ 14.453, 48.0153 ], [ 14.4534, 48.0157 ], [ 14.4583, 48.0202 ], [ 14.4656, 48.0242 ], [ 14.4734, 48.0272 ], [ 14.4923, 48.0105 ], [ 14.4939, 47.9977 ], [ 14.502, 47.9946 ], [ 14.5052, 47.9934 ], [ 14.5326, 47.9897 ], [ 14.5555, 47.9797 ], [ 14.5606, 47.975 ], [ 14.5664, 47.9735 ], [ 14.5693, 47.9728 ], [ 14.5761, 47.971 ], [ 14.5794, 47.9702 ], [ 14.6076, 47.9501 ], [ 14.6159, 47.9485 ], [ 14.6225, 47.9477 ], [ 14.6254, 47.944 ], [ 14.6416, 47.9427 ], [ 14.6492, 47.9421 ], [ 14.6651, 47.9396 ], [ 14.6708, 47.9351 ], [ 14.7033, 47.9257 ], [ 14.7076, 47.9297 ], [ 14.7283, 47.9355 ], [ 14.7294, 47.9244 ], [ 14.7431, 47.9177 ], [ 14.7594, 47.9001 ], [ 14.7722, 47.8831 ], [ 14.7697, 47.8796 ], [ 14.7624, 47.8721 ], [ 14.7555, 47.8669 ], [ 14.7294, 47.8606 ], [ 14.7232, 47.8591 ], [ 14.7101, 47.8503 ], [ 14.7114, 47.8459 ], [ 14.7256, 47.8411 ], [ 14.7091, 47.8193 ], [ 14.7129, 47.8134 ], [ 14.7182, 47.8108 ] ] ] ] } }
]
}
