,Date,Daytime,Region,Subregion,DangerRatingBelow,DangerRatingAbove,DangerRatingElevation,AvalancheProblem1,AvalancheProblem1AspectN,AvalancheProblem1AspectNE,AvalancheProblem1AspectE,AvalancheProblem1AspectSE,AvalancheProblem1AspectS,AvalancheProblem1AspectSW,AvalancheProblem1AspectW,AvalancheProblem1AspectNW
0,2021-01-25,AM,,AT-08-01,2,2,,,,,,,,,,
1,2021-01-25,AM,,AT-08-02,2,2,,,,,,,,,,
2,2021-01-25,AM,,AT-08-03,2,3,2000,,,,,,,,,
3,2021-01-25,AM,,AT-08-04,2,3,2000,,,,,,,,,
4,2021-01-25,AM,,AT-08-05,2,3,2000,,,,,,,,,
5,2021-01-25,AM,,AT-08-06,2,3,2000,,,,,,,,,
6,2021-01-25,AM,,,3,3,,,,,,,,,,
7,2021-01-26,AM,,AT-08-01,2,3,1800,,,,,,,,,
8,2021-01-26,AM,,AT-08-02,2,3,1800,,,,,,,,,
9,2021-01-26,AM,,AT-08-03,2,3,1800,,,,,,,,,
10,2021-01-26,AM,,AT-08-04,2,3,1800,,,,,,,,,
11,2021-01-26,AM,,AT-08-05,2,3,1800,,,,,,,,,
12,2021-01-26,AM,,AT-08-06,2,3,1800,,,,,,,,,
13,2021-01-27,AM,,AT-08-01,2,3,treeline,,,,,,,,,
14,2021-01-27,AM,,AT-08-02,2,3,treeline,,,,,,,,,
15,2021-01-27,AM,,AT-08-03,2,3,treeline,,,,,,,,,
16,2021-01-27,AM,,AT-08-04,2,3,1800,,,,,,,,,
17,2021-01-27,AM,,AT-08-05,2,3,1800,,,,,,,,,
18,2021-01-27,AM,,AT-08-06,2,3,1800,,,,,,,,,
19,2021-01-28,AM,,AT-08-01,3,3,,,,,,,,,,
20,2021-01-28,AM,,AT-08-02,3,3,,,,,,,,,,
21,2021-01-28,AM,,AT-08-03,3,3,,,,,,,,,,
22,2021-01-28,AM,,AT-08-04,3,3,,,,,,,,,,
23,2021-01-28,AM,,AT-08-05,3,3,,,,,,,,,,
24,2021-01-28,AM,,AT-08-06,3,3,,,,,,,,,,
25,2021-01-29,AM,,AT-08-01,4,4,,,,,,,,,,
26,2021-01-29,AM,,AT-08-02,4,4,,,,,,,,,,
27,2021-01-29,AM,,AT-08-03,4,4,,,,,,,,,,
28,2021-01-29,AM,,AT-08-04,4,4,,,,,,,,,,
29,2021-01-29,AM,,AT-08-05,4,4,,,,,,,,,,
30,2021-01-29,AM,,AT-08-06,4,4,,,,,,,,,,
31,2021-01-30,AM,,AT-08-01,3,3,,,,,,,,,,
32,2021-01-30,AM,,AT-08-02,3,4,1800,,,,,,,,,
33,2021-01-30,AM,,AT-08-03,3,4,1800,,,,,,,,,
34,2021-01-30,AM,,AT-08-04,3,4,1800,,,,,,,,,
35,2021-01-30,AM,,AT-08-05,3,4,2000,,,,,,,,,
36,2021-01-30,AM,,AT-08-06,3,4,2000,,,,,,,,,
37,2021-01-31,AM,,AT-08-01,3,3,,,,,,,,,,
38,2021-01-31,AM,,AT-08-02,3,4,2000,,,,,,,,,
39,2021-01-31,AM,,AT-08-03,3,4,2000,,,,,,,,,
40,2021-01-31,AM,,AT-08-04,3,4,2000,,,,,,,,,
41,2021-01-31,AM,,AT-08-05,3,4,2000,,,,,,,,,
42,2021-01-31,AM,,AT-08-06,3,4,2000,,,,,,,,,
43,2021-02-01,AM,,AT-08-01,3,3,,,,,,,,,,
44,2021-02-01,AM,,AT-08-02,3,3,,,,,,,,,,
45,2021-02-01,AM,,AT-08-03,3,3,,,,,,,,,,
46,2021-02-01,AM,,AT-08-04,3,3,,,,,,,,,,
47,2021-02-01,AM,,AT-08-05,3,3,,,,,,,,,,
48,2021-02-01,AM,,AT-08-06,3,3,,,,,,,,,,
49,2021-02-02,AM,,AT-08-01,3,3,,,,,,,,,,
50,2021-02-02,AM,,AT-08-02,3,3,,,,,,,,,,
51,2021-02-02,AM,,AT-08-03,3,3,,,,,,,,,,
52,2021-02-02,AM,,AT-08-04,3,3,,,,,,,,,,
53,2021-02-02,AM,,AT-08-05,3,3,,,,,,,,,,
54,2021-02-02,AM,,AT-08-06,3,3,,,,,,,,,,
55,2021-02-03,AM,,AT-08-01,3,3,,,,,,,,,,
56,2021-02-03,AM,,AT-08-02,3,3,,,,,,,,,,
57,2021-02-03,AM,,AT-08-03,3,3,,,,,,,,,,
58,2021-02-03,AM,,AT-08-04,3,3,,,,,,,,,,
59,2021-02-03,AM,,AT-08-05,3,3,,,,,,,,,,
60,2021-02-03,AM,,AT-08-06,3,3,,,,,,,,,,
61,2021-02-04,AM,,AT-08-01,3,3,,,,,,,,,,
62,2021-02-04,AM,,AT-08-02,3,3,,,,,,,,,,
63,2021-02-04,AM,,AT-08-03,3,3,,,,,,,,,,
64,2021-02-04,AM,,AT-08-04,3,3,,,,,,,,,,
65,2021-02-04,AM,,AT-08-05,3,3,,,,,,,,,,
66,2021-02-04,AM,,AT-08-06,3,3,,,,,,,,,,
67,2021-02-06,AM,,AT-08-01,2,2,,,,,,,,,,
68,2021-02-06,AM,,AT-08-02,2,2,,,,,,,,,,
69,2021-02-06,AM,,AT-08-03,2,2,,,,,,,,,,
70,2021-02-06,AM,,AT-08-04,2,2,,,,,,,,,,
71,2021-02-06,AM,,AT-08-05,2,2,,,,,,,,,,
72,2021-02-06,AM,,AT-08-06,2,2,,,,,,,,,,
73,2021-02-07,AM,,AT-08-01,2,2,,,,,,,,,,
74,2021-02-07,AM,,AT-08-02,2,2,,,,,,,,,,
75,2021-02-07,AM,,AT-08-03,2,2,,,,,,,,,,
76,2021-02-07,AM,,AT-08-04,2,2,,,,,,,,,,
77,2021-02-07,AM,,AT-08-05,2,2,,,,,,,,,,
78,2021-02-07,AM,,AT-08-06,2,2,,,,,,,,,,
79,2021-02-08,AM,,AT-08-01,2,2,,,,,,,,,,
80,2021-02-08,AM,,AT-08-02,2,2,,,,,,,,,,
81,2021-02-08,AM,,AT-08-03,2,2,,,,,,,,,,
82,2021-02-08,AM,,AT-08-04,2,2,,,,,,,,,,
83,2021-02-08,AM,,AT-08-05,2,2,,,,,,,,,,
84,2021-02-08,AM,,AT-08-06,2,2,,,,,,,,,,
85,2021-02-09,AM,,AT-08-01,2,2,,,,,,,,,,
86,2021-02-09,AM,,AT-08-02,2,2,,,,,,,,,,
87,2021-02-09,AM,,AT-08-03,2,3,2200,,,,,,,,,
88,2021-02-09,AM,,AT-08-04,2,3,2200,,,,,,,,,
89,2021-02-09,AM,,AT-08-05,2,2,,,,,,,,,,
90,2021-02-09,AM,,AT-08-06,2,3,2200,,,,,,,,,
91,2021-02-10,AM,,AT-08-01,1,2,1500,,,,,,,,,
92,2021-02-10,AM,,AT-08-02,1,2,1500,,,,,,,,,
93,2021-02-10,AM,,AT-08-03,2,3,2200,,,,,,,,,
94,2021-02-10,AM,,AT-08-04,2,3,2200,,,,,,,,,
95,2021-02-10,AM,,AT-08-05,1,2,1500,,,,,,,,,
96,2021-02-10,AM,,AT-08-06,2,3,2200,,,,,,,,,
97,2021-02-11,AM,,AT-08-01,1,2,1600,,,,,,,,,
98,2021-02-11,AM,,AT-08-02,2,3,2000,,,,,,,,,
99,2021-02-11,AM,,AT-08-03,2,3,2000,,,,,,,,,
100,2021-02-11,AM,,AT-08-04,2,3,2200,,,,,,,,,
101,2021-02-11,AM,,AT-08-05,2,3,2200,,,,,,,,,
102,2021-02-11,AM,,AT-08-06,2,3,2200,,,,,,,,,
103,2021-02-12,AM,,AT-08-01,1,2,1600,,,,,,,,,
104,2021-02-12,AM,,AT-08-02,1,2,1600,,,,,,,,,
105,2021-02-12,AM,,AT-08-03,2,3,2000,,,,,,,,,
106,2021-02-12,AM,,AT-08-04,2,3,2200,,,,,,,,,
107,2021-02-12,AM,,AT-08-05,2,3,2200,,,,,,,,,
108,2021-02-12,AM,,AT-08-06,2,3,2200,,,,,,,,,
109,2021-02-13,AM,,AT-08-01,1,2,1600,,,,,,,,,
110,2021-02-13,AM,,AT-08-02,1,2,1600,,,,,,,,,
111,2021-02-13,AM,,AT-08-03,2,3,2200,,,,,,,,,
112,2021-02-13,AM,,AT-08-04,2,3,2200,,,,,,,,,
113,2021-02-13,AM,,AT-08-05,1,2,1600,,,,,,,,,
114,2021-02-13,AM,,AT-08-06,2,3,2200,,,,,,,,,
115,2021-02-14,AM,,AT-08-01,1,2,1800,,,,,,,,,
116,2021-02-14,AM,,AT-08-02,1,2,1800,,,,,,,,,
117,2021-02-14,AM,,AT-08-03,2,3,2000,,,,,,,,,
118,2021-02-14,AM,,AT-08-04,2,3,2000,,,,,,,,,
119,2021-02-14,AM,,AT-08-05,1,2,1800,,,,,,,,,
120,2021-02-14,AM,,AT-08-06,1,2,1800,,,,,,,,,
121,2021-02-15,AM,,AT-08-01,1,2,1800,,,,,,,,,
122,2021-02-15,AM,,AT-08-02,1,2,1800,,,,,,,,,
123,2021-02-15,AM,,AT-08-03,2,3,2000,,,,,,,,,
124,2021-02-15,AM,,AT-08-04,2,3,2000,,,,,,,,,
125,2021-02-15,AM,,AT-08-05,1,2,1800,,,,,,,,,
126,2021-02-15,AM,,AT-08-06,1,2,1800,,,,,,,,,
127,2021-02-16,AM,,AT-08-01,1,2,1800,,,,,,,,,
128,2021-02-16,AM,,AT-08-02,1,2,1800,,,,,,,,,
129,2021-02-16,AM,,AT-08-03,2,3,2200,,,,,,,,,
130,2021-02-16,AM,,AT-08-04,1,2,1800,,,,,,,,,
131,2021-02-16,AM,,AT-08-05,1,2,1800,,,,,,,,,
132,2021-02-16,AM,,AT-08-06,1,2,1800,,,,,,,,,
133,2021-02-17,AM,,AT-08-01,2,2,,,,,,,,,,
134,2021-02-17,AM,,AT-08-02,2,2,,,,,,,,,,
135,2021-02-17,AM,,AT-08-03,2,2,,,,,,,,,,
136,2021-02-17,AM,,AT-08-04,2,2,,,,,,,,,,
137,2021-02-17,AM,,AT-08-05,2,2,,,,,,,,,,
138,2021-02-17,AM,,AT-08-06,2,2,,,,,,,,,,
139,2021-02-18,AM,,AT-08-01,2,2,,,,,,,,,,
140,2021-02-18,AM,,AT-08-02,2,2,,,,,,,,,,
141,2021-02-18,AM,,AT-08-03,2,2,,,,,,,,,,
142,2021-02-18,AM,,AT-08-04,2,2,,,,,,,,,,
143,2021-02-18,AM,,AT-08-05,2,2,,,,,,,,,,
144,2021-02-18,AM,,AT-08-06,2,2,,,,,,,,,,
145,2021-02-19,AM,,AT-08-01,1,2,2000,,,,,,,,,
146,2021-02-19,AM,,AT-08-02,1,2,2000,,,,,,,,,
147,2021-02-19,AM,,AT-08-03,1,2,2000,,,,,,,,,
148,2021-02-19,AM,,AT-08-04,1,2,2000,,,,,,,,,
149,2021-02-19,AM,,AT-08-05,1,2,2000,,,,,,,,,
150,2021-02-19,AM,,AT-08-06,1,2,2000,,,,,,,,,
151,2021-02-20,AM,,AT-08-01,1,1,,,,,,,,,,
152,2021-02-20,AM,,AT-08-02,1,2,2200,,,,,,,,,
153,2021-02-20,AM,,AT-08-03,1,2,2200,,,,,,,,,
154,2021-02-20,AM,,AT-08-04,1,2,2200,,,,,,,,,
155,2021-02-20,AM,,AT-08-05,1,2,2200,,,,,,,,,
156,2021-02-20,AM,,AT-08-06,1,2,2200,,,,,,,,,
157,2021-02-20,PM,,AT-08-01,2,2,,,,,,,,,,
158,2021-02-20,PM,,AT-08-02,2,2,,,,,,,,,,
159,2021-02-20,PM,,AT-08-03,2,2,,,,,,,,,,
160,2021-02-20,PM,,AT-08-04,2,2,,,,,,,,,,
161,2021-02-20,PM,,AT-08-05,2,2,,,,,,,,,,
162,2021-02-20,PM,,AT-08-06,2,2,,,,,,,,,,
163,2021-02-21,AM,,AT-08-01,1,1,,,,,,,,,,
164,2021-02-21,AM,,AT-08-02,1,2,2200,,,,,,,,,
165,2021-02-21,AM,,AT-08-03,1,2,2200,,,,,,,,,
166,2021-02-21,AM,,AT-08-04,1,2,2200,,,,,,,,,
167,2021-02-21,AM,,AT-08-05,1,2,2200,,,,,,,,,
168,2021-02-21,AM,,AT-08-06,1,2,2200,,,,,,,,,
169,2021-02-21,PM,,AT-08-01,2,2,,,,,,,,,,
170,2021-02-21,PM,,AT-08-02,2,2,,,,,,,,,,
171,2021-02-21,PM,,AT-08-03,2,2,,,,,,,,,,
172,2021-02-21,PM,,AT-08-04,2,2,,,,,,,,,,
173,2021-02-21,PM,,AT-08-05,2,2,,,,,,,,,,
174,2021-02-21,PM,,AT-08-06,2,2,,,,,,,,,,
175,2021-02-22,AM,,AT-08-01,1,1,,,,,,,,,,
176,2021-02-22,AM,,AT-08-02,1,2,2200,,,,,,,,,
177,2021-02-22,AM,,AT-08-03,1,2,2200,,,,,,,,,
178,2021-02-22,AM,,AT-08-04,1,2,2200,,,,,,,,,
179,2021-02-22,AM,,AT-08-05,1,2,2200,,,,,,,,,
180,2021-02-22,AM,,AT-08-06,1,2,2200,,,,,,,,,
181,2021-02-22,PM,,AT-08-01,2,2,,,,,,,,,,
182,2021-02-22,PM,,AT-08-02,2,2,,,,,,,,,,
183,2021-02-22,PM,,AT-08-03,2,2,,,,,,,,,,
184,2021-02-22,PM,,AT-08-04,2,2,,,,,,,,,,
185,2021-02-22,PM,,AT-08-05,2,2,,,,,,,,,,
186,2021-02-22,PM,,AT-08-06,2,2,,,,,,,,,,
187,2021-02-23,AM,,AT-08-01,1,1,,,,,,,,,,
188,2021-02-23,AM,,AT-08-02,1,2,2200,,,,,,,,,
189,2021-02-23,AM,,AT-08-03,1,2,2200,,,,,,,,,
190,2021-02-23,AM,,AT-08-04,1,2,2200,,,,,,,,,
191,2021-02-23,AM,,AT-08-05,1,2,2200,,,,,,,,,
192,2021-02-23,AM,,AT-08-06,1,2,2200,,,,,,,,,
193,2021-02-23,PM,,AT-08-01,2,2,,,,,,,,,,
194,2021-02-23,PM,,AT-08-02,2,2,,,,,,,,,,
195,2021-02-23,PM,,AT-08-03,2,2,,,,,,,,,,
196,2021-02-23,PM,,AT-08-04,2,2,,,,,,,,,,
197,2021-02-23,PM,,AT-08-05,2,2,,,,,,,,,,
198,2021-02-23,PM,,AT-08-06,2,2,,,,,,,,,,
199,2021-02-24,AM,,AT-08-01,1,1,,,,,,,,,,
200,2021-02-24,AM,,AT-08-02,1,2,2400,,,,,,,,,
201,2021-02-24,AM,,AT-08-03,1,2,2400,,,,,,,,,
202,2021-02-24,AM,,AT-08-04,1,2,2400,,,,,,,,,
203,2021-02-24,AM,,AT-08-05,1,2,2400,,,,,,,,,
204,2021-02-24,AM,,AT-08-06,1,2,2400,,,,,,,,,
205,2021-02-24,PM,,AT-08-01,2,2,,,,,,,,,,
206,2021-02-24,PM,,AT-08-02,2,2,,,,,,,,,,
207,2021-02-24,PM,,AT-08-03,2,2,,,,,,,,,,
208,2021-02-24,PM,,AT-08-04,2,2,,,,,,,,,,
209,2021-02-24,PM,,AT-08-05,2,2,,,,,,,,,,
210,2021-02-24,PM,,AT-08-06,2,2,,,,,,,,,,
211,2021-02-25,AM,,AT-08-01,1,1,,,,,,,,,,
212,2021-02-25,AM,,AT-08-02,1,1,,,,,,,,,,
213,2021-02-25,AM,,AT-08-03,1,1,,,,,,,,,,
214,2021-02-25,AM,,AT-08-04,1,1,,,,,,,,,,
215,2021-02-25,AM,,AT-08-05,1,1,,,,,,,,,,
216,2021-02-25,AM,,AT-08-06,1,1,,,,,,,,,,
217,2021-02-25,PM,,AT-08-01,3,3,,,,,,,,,,
218,2021-02-25,PM,,AT-08-02,3,3,,,,,,,,,,
219,2021-02-25,PM,,AT-08-03,3,3,,,,,,,,,,
220,2021-02-25,PM,,AT-08-04,3,3,,,,,,,,,,
221,2021-02-25,PM,,AT-08-05,3,3,,,,,,,,,,
222,2021-02-25,PM,,AT-08-06,3,3,,,,,,,,,,
223,2021-02-26,AM,,AT-08-01,1,1,,,,,,,,,,
224,2021-02-26,AM,,AT-08-02,1,1,,,,,,,,,,
225,2021-02-26,AM,,AT-08-03,1,1,,,,,,,,,,
226,2021-02-26,AM,,AT-08-04,1,1,,,,,,,,,,
227,2021-02-26,AM,,AT-08-05,1,1,,,,,,,,,,
228,2021-02-26,AM,,AT-08-06,1,1,,,,,,,,,,
229,2021-02-26,PM,,AT-08-01,2,2,,,,,,,,,,
230,2021-02-26,PM,,AT-08-02,2,2,,,,,,,,,,
231,2021-02-26,PM,,AT-08-03,3,3,,,,,,,,,,
232,2021-02-26,PM,,AT-08-04,3,3,,,,,,,,,,
233,2021-02-26,PM,,AT-08-05,3,3,,,,,,,,,,
234,2021-02-26,PM,,AT-08-06,3,3,,,,,,,,,,
235,2021-02-27,AM,,AT-08-01,1,1,,,,,,,,,,
236,2021-02-27,AM,,AT-08-02,1,1,,,,,,,,,,
237,2021-02-27,AM,,AT-08-03,1,1,,,,,,,,,,
238,2021-02-27,AM,,AT-08-04,1,1,,,,,,,,,,
239,2021-02-27,AM,,AT-08-05,1,1,,,,,,,,,,
240,2021-02-27,AM,,AT-08-06,1,1,,,,,,,,,,
241,2021-02-27,PM,,AT-08-01,2,1,2000,,,,,,,,,
242,2021-02-27,PM,,AT-08-02,2,1,2400,,,,,,,,,
243,2021-02-27,PM,,AT-08-03,2,1,2400,,,,,,,,,
244,2021-02-27,PM,,AT-08-04,2,1,2400,,,,,,,,,
245,2021-02-27,PM,,AT-08-05,2,1,2400,,,,,,,,,
246,2021-02-27,PM,,AT-08-06,2,1,2400,,,,,,,,,
247,2021-02-28,AM,,AT-08-01,1,1,,,,,,,,,,
248,2021-02-28,AM,,AT-08-02,1,1,,,,,,,,,,
249,2021-02-28,AM,,AT-08-03,1,1,,,,,,,,,,
250,2021-02-28,AM,,AT-08-04,1,1,,,,,,,,,,
251,2021-02-28,AM,,AT-08-05,1,1,,,,,,,,,,
252,2021-02-28,AM,,AT-08-06,1,1,,,,,,,,,,
253,2021-02-28,PM,,AT-08-01,2,1,2000,,,,,,,,,
254,2021-02-28,PM,,AT-08-02,2,1,2400,,,,,,,,,
255,2021-02-28,PM,,AT-08-03,2,1,2400,,,,,,,,,
256,2021-02-28,PM,,AT-08-04,2,1,2400,,,,,,,,,
257,2021-02-28,PM,,AT-08-05,2,1,2400,,,,,,,,,
258,2021-02-28,PM,,AT-08-06,2,1,2400,,,,,,,,,
259,2021-03-01,AM,,AT-08-01,1,1,,,,,,,,,,
260,2021-03-01,AM,,AT-08-02,1,1,,,,,,,,,,
261,2021-03-01,AM,,AT-08-03,1,1,,,,,,,,,,
262,2021-03-01,AM,,AT-08-04,1,1,,,,,,,,,,
263,2021-03-01,AM,,AT-08-05,1,1,,,,,,,,,,
264,2021-03-01,AM,,AT-08-06,1,1,,,,,,,,,,
265,2021-03-02,AM,,AT-08-01,1,1,,,,,,,,,,
266,2021-03-02,AM,,AT-08-02,1,1,,,,,,,,,,
267,2021-03-02,AM,,AT-08-03,1,1,,,,,,,,,,
268,2021-03-02,AM,,AT-08-04,1,1,,,,,,,,,,
269,2021-03-02,AM,,AT-08-05,1,1,,,,,,,,,,
270,2021-03-02,AM,,AT-08-06,1,1,,,,,,,,,,
271,2021-03-03,AM,,AT-08-01,1,1,,,,,,,,,,
272,2021-03-03,AM,,AT-08-02,1,1,,,,,,,,,,
273,2021-03-03,AM,,AT-08-03,1,1,,,,,,,,,,
274,2021-03-03,AM,,AT-08-04,1,1,,,,,,,,,,
275,2021-03-03,AM,,AT-08-05,1,1,,,,,,,,,,
276,2021-03-03,AM,,AT-08-06,1,1,,,,,,,,,,
277,2021-03-04,AM,,AT-08-01,1,1,,,,,,,,,,
278,2021-03-04,AM,,AT-08-02,1,1,,,,,,,,,,
279,2021-03-04,AM,,AT-08-03,1,1,,,,,,,,,,
280,2021-03-04,AM,,AT-08-04,1,1,,,,,,,,,,
281,2021-03-04,AM,,AT-08-05,1,1,,,,,,,,,,
282,2021-03-04,AM,,AT-08-06,1,1,,,,,,,,,,
283,2021-03-05,AM,,AT-08-01,1,2,1800,,,,,,,,,
284,2021-03-05,AM,,AT-08-02,1,2,1800,,,,,,,,,
285,2021-03-05,AM,,AT-08-03,1,2,1800,,,,,,,,,
286,2021-03-05,AM,,AT-08-04,1,2,1800,,,,,,,,,
287,2021-03-05,AM,,AT-08-05,1,2,1800,,,,,,,,,
288,2021-03-05,AM,,AT-08-06,1,2,1800,,,,,,,,,
289,2021-03-06,AM,,AT-08-01,1,2,2000,,,,,,,,,
290,2021-03-06,AM,,AT-08-02,1,2,2000,,,,,,,,,
291,2021-03-06,AM,,AT-08-03,1,2,2000,,,,,,,,,
292,2021-03-06,AM,,AT-08-04,1,2,2000,,,,,,,,,
293,2021-03-06,AM,,AT-08-05,1,2,2000,,,,,,,,,
294,2021-03-06,AM,,AT-08-06,1,2,2000,,,,,,,,,
295,2021-03-07,AM,,AT-08-01,1,2,2000,,,,,,,,,
296,2021-03-07,AM,,AT-08-02,1,2,2000,,,,,,,,,
297,2021-03-07,AM,,AT-08-03,1,2,2000,,,,,,,,,
298,2021-03-07,AM,,AT-08-04,1,2,2000,,,,,,,,,
299,2021-03-07,AM,,AT-08-05,1,2,2000,,,,,,,,,
300,2021-03-07,AM,,AT-08-06,1,2,2000,,,,,,,,,
301,2021-03-08,AM,,AT-08-01,1,1,,,,,,,,,,
302,2021-03-08,AM,,AT-08-02,1,2,2000,,,,,,,,,
303,2021-03-08,AM,,AT-08-03,1,2,2000,,,,,,,,,
304,2021-03-08,AM,,AT-08-04,1,2,2000,,,,,,,,,
305,2021-03-08,AM,,AT-08-05,1,2,2000,,,,,,,,,
306,2021-03-08,AM,,AT-08-06,1,2,2000,,,,,,,,,
307,2021-03-09,AM,,AT-08-01,1,1,,,,,,,,,,
308,2021-03-09,AM,,AT-08-02,1,2,2000,,,,,,,,,
309,2021-03-09,AM,,AT-08-03,1,2,2000,,,,,,,,,
310,2021-03-09,AM,,AT-08-04,1,2,2000,,,,,,,,,
311,2021-03-09,AM,,AT-08-05,1,2,2000,,,,,,,,,
312,2021-03-09,AM,,AT-08-06,1,2,2000,,,,,,,,,
313,2021-03-10,AM,,AT-08-01,1,1,,,,,,,,,,
314,2021-03-10,AM,,AT-08-02,1,2,2200,,,,,,,,,
315,2021-03-10,AM,,AT-08-03,1,2,2200,,,,,,,,,
316,2021-03-10,AM,,AT-08-04,1,2,2200,,,,,,,,,
317,2021-03-10,AM,,AT-08-05,1,2,2000,,,,,,,,,
318,2021-03-10,AM,,AT-08-06,1,2,2000,,,,,,,,,
319,2021-03-11,AM,,AT-08-01,2,2,,,,,,,,,,
320,2021-03-11,AM,,AT-08-02,2,2,,,,,,,,,,
321,2021-03-11,AM,,AT-08-03,2,2,,,,,,,,,,
322,2021-03-11,AM,,AT-08-04,2,2,,,,,,,,,,
323,2021-03-11,AM,,AT-08-05,2,2,,,,,,,,,,
324,2021-03-11,AM,,AT-08-06,2,2,,,,,,,,,,
325,2021-03-12,AM,,AT-08-01,1,2,1800,,,,,,,,,
326,2021-03-12,AM,,AT-08-02,1,2,1800,,,,,,,,,
327,2021-03-12,AM,,AT-08-03,1,2,1800,,,,,,,,,
328,2021-03-12,AM,,AT-08-04,1,2,1800,,,,,,,,,
329,2021-03-12,AM,,AT-08-05,1,2,1800,,,,,,,,,
330,2021-03-12,AM,,AT-08-06,1,2,1800,,,,,,,,,
331,2021-03-13,AM,,AT-08-01,2,2,,,,,,,,,,
332,2021-03-13,AM,,AT-08-02,2,2,,,,,,,,,,
333,2021-03-13,AM,,AT-08-03,1,2,2000,,,,,,,,,
334,2021-03-13,AM,,AT-08-04,1,2,2000,,,,,,,,,
335,2021-03-13,AM,,AT-08-05,1,2,2000,,,,,,,,,
336,2021-03-13,AM,,AT-08-06,1,2,2000,,,,,,,,,
337,2021-03-14,AM,,AT-08-01,2,3,treeline,,,,,,,,,
338,2021-03-14,AM,,AT-08-02,2,3,treeline,,,,,,,,,
339,2021-03-14,AM,,AT-08-03,2,3,treeline,,,,,,,,,
340,2021-03-14,AM,,AT-08-04,2,3,180,,,,,,,,,
341,2021-03-14,AM,,AT-08-05,2,3,180,,,,,,,,,
342,2021-03-14,AM,,AT-08-06,2,3,180,,,,,,,,,
343,2021-03-15,AM,,AT-08-01,2,3,treeline,,,,,,,,,
344,2021-03-15,AM,,AT-08-02,2,3,treeline,,,,,,,,,
345,2021-03-15,AM,,AT-08-03,2,3,treeline,,,,,,,,,
346,2021-03-15,AM,,AT-08-04,2,3,treeline,,,,,,,,,
347,2021-03-15,AM,,AT-08-05,2,3,treeline,,,,,,,,,
348,2021-03-15,AM,,AT-08-06,2,3,treeline,,,,,,,,,
349,2021-03-16,AM,,AT-08-01,3,4,1800,,,,,,,,,
350,2021-03-16,AM,,AT-08-02,3,4,treeline,,,,,,,,,
351,2021-03-16,AM,,AT-08-03,3,4,treeline,,,,,,,,,
352,2021-03-16,AM,,AT-08-04,3,4,treeline,,,,,,,,,
353,2021-03-16,AM,,AT-08-05,3,4,1800,,,,,,,,,
354,2021-03-16,AM,,AT-08-06,3,4,1800,,,,,,,,,
355,2021-03-17,AM,,AT-08-01,3,3,,,,,,,,,,
356,2021-03-17,AM,,AT-08-02,3,4,treeline,,,,,,,,,
357,2021-03-17,AM,,AT-08-03,3,4,treeline,,,,,,,,,
358,2021-03-17,AM,,AT-08-04,3,4,2000,,,,,,,,,
359,2021-03-17,AM,,AT-08-05,3,3,,,,,,,,,,
360,2021-03-17,AM,,AT-08-06,3,4,2000,,,,,,,,,
361,2021-03-18,AM,,AT-08-01,2,3,1800,,,,,,,,,
362,2021-03-18,AM,,AT-08-02,3,3,,,,,,,,,,
363,2021-03-18,AM,,AT-08-03,3,3,,,,,,,,,,
364,2021-03-18,AM,,AT-08-04,2,3,1800,,,,,,,,,
365,2021-03-18,AM,,AT-08-05,2,3,1800,,,,,,,,,
366,2021-03-18,AM,,AT-08-06,2,3,1800,,,,,,,,,
367,2021-03-19,AM,,AT-08-01,2,3,2000,,,,,,,,,
368,2021-03-19,AM,,AT-08-02,2,3,2000,,,,,,,,,
369,2021-03-19,AM,,AT-08-03,2,3,2000,,,,,,,,,
370,2021-03-19,AM,,AT-08-04,2,3,2000,,,,,,,,,
371,2021-03-19,AM,,AT-08-05,2,3,2000,,,,,,,,,
372,2021-03-19,AM,,AT-08-06,2,3,2000,,,,,,,,,
373,2021-03-20,AM,,AT-08-01,2,3,1800,,,,,,,,,
374,2021-03-20,AM,,AT-08-02,2,3,1800,,,,,,,,,
375,2021-03-20,AM,,AT-08-03,2,3,1800,,,,,,,,,
376,2021-03-20,AM,,AT-08-04,2,3,1800,,,,,,,,,
377,2021-03-20,AM,,AT-08-05,2,3,1800,,,,,,,,,
378,2021-03-20,AM,,AT-08-06,2,3,1800,,,,,,,,,
379,2021-03-21,AM,,AT-08-01,2,3,2000,,,,,,,,,
380,2021-03-21,AM,,AT-08-02,2,3,2000,,,,,,,,,
381,2021-03-21,AM,,AT-08-03,2,3,2000,,,,,,,,,
382,2021-03-21,AM,,AT-08-04,2,3,2000,,,,,,,,,
383,2021-03-21,AM,,AT-08-05,2,3,2000,,,,,,,,,
384,2021-03-21,AM,,AT-08-06,2,3,2000,,,,,,,,,
385,2021-03-22,AM,,AT-08-01,2,3,2000,,,,,,,,,
386,2021-03-22,AM,,AT-08-02,2,3,2000,,,,,,,,,
387,2021-03-22,AM,,AT-08-03,2,3,2000,,,,,,,,,
388,2021-03-22,AM,,AT-08-04,2,3,2000,,,,,,,,,
389,2021-03-22,AM,,AT-08-05,2,3,2000,,,,,,,,,
390,2021-03-22,AM,,AT-08-06,2,3,2000,,,,,,,,,
391,2021-03-23,AM,,AT-08-01,2,2,,,,,,,,,,
392,2021-03-23,AM,,AT-08-02,2,2,,,,,,,,,,
393,2021-03-23,AM,,AT-08-03,2,3,2200,,,,,,,,,
394,2021-03-23,AM,,AT-08-04,2,3,2200,,,,,,,,,
395,2021-03-23,AM,,AT-08-05,2,3,2200,,,,,,,,,
396,2021-03-23,AM,,AT-08-06,2,3,2200,,,,,,,,,
397,2021-03-24,AM,,AT-08-01,2,2,,,,,,,,,,
398,2021-03-24,AM,,AT-08-02,2,2,,,,,,,,,,
399,2021-03-24,AM,,AT-08-03,2,2,,,,,,,,,,
400,2021-03-24,AM,,AT-08-04,2,2,,,,,,,,,,
401,2021-03-24,AM,,AT-08-05,2,2,,,,,,,,,,
402,2021-03-24,AM,,AT-08-06,2,2,,,,,,,,,,
403,2021-03-25,AM,,AT-08-01,2,2,,,,,,,,,,
404,2021-03-25,AM,,AT-08-02,2,2,,,,,,,,,,
405,2021-03-25,AM,,AT-08-03,2,2,,,,,,,,,,
406,2021-03-25,AM,,AT-08-04,2,2,,,,,,,,,,
407,2021-03-25,AM,,AT-08-05,2,2,,,,,,,,,,
408,2021-03-25,AM,,AT-08-06,2,2,,,,,,,,,,
409,2021-03-26,AM,,AT-08-01,2,2,,,,,,,,,,
410,2021-03-26,AM,,AT-08-02,2,2,,,,,,,,,,
411,2021-03-26,AM,,AT-08-03,2,2,,,,,,,,,,
412,2021-03-26,AM,,AT-08-04,2,2,,,,,,,,,,
413,2021-03-26,AM,,AT-08-05,2,2,,,,,,,,,,
414,2021-03-26,AM,,AT-08-06,2,2,,,,,,,,,,
415,2021-03-27,AM,,AT-08-01,2,2,,,,,,,,,,
416,2021-03-27,AM,,AT-08-02,2,2,,,,,,,,,,
417,2021-03-27,AM,,AT-08-03,2,2,,,,,,,,,,
418,2021-03-27,AM,,AT-08-04,2,2,,,,,,,,,,
419,2021-03-27,AM,,AT-08-05,2,2,,,,,,,,,,
420,2021-03-27,AM,,AT-08-06,2,2,,,,,,,,,,
421,2021-03-28,AM,,AT-08-01,2,2,,,,,,,,,,
422,2021-03-28,AM,,AT-08-02,2,2,,,,,,,,,,
423,2021-03-28,AM,,AT-08-03,2,2,,,,,,,,,,
424,2021-03-28,AM,,AT-08-04,2,2,,,,,,,,,,
425,2021-03-28,AM,,AT-08-05,2,2,,,,,,,,,,
426,2021-03-28,AM,,AT-08-06,2,2,,,,,,,,,,
427,2021-03-29,AM,,AT-08-01,1,1,,,,,,,,,,
428,2021-03-29,AM,,AT-08-02,1,2,2200,,,,,,,,,
429,2021-03-29,AM,,AT-08-03,1,2,2200,,,,,,,,,
430,2021-03-29,AM,,AT-08-04,1,2,2200,,,,,,,,,
431,2021-03-29,AM,,AT-08-05,1,2,2200,,,,,,,,,
432,2021-03-29,AM,,AT-08-06,1,2,2200,,,,,,,,,
433,2021-03-29,PM,,AT-08-01,2,2,,,,,,,,,,
434,2021-03-29,PM,,AT-08-02,2,2,,,,,,,,,,
435,2021-03-29,PM,,AT-08-03,2,2,,,,,,,,,,
436,2021-03-29,PM,,AT-08-04,2,2,,,,,,,,,,
437,2021-03-29,PM,,AT-08-05,2,2,,,,,,,,,,
438,2021-03-29,PM,,AT-08-06,2,2,,,,,,,,,,
439,2021-03-30,AM,,AT-08-01,1,1,,,,,,,,,,
440,2021-03-30,AM,,AT-08-02,1,2,2200,,,,,,,,,
441,2021-03-30,AM,,AT-08-03,1,2,2200,,,,,,,,,
442,2021-03-30,AM,,AT-08-04,1,2,2200,,,,,,,,,
443,2021-03-30,AM,,AT-08-05,1,2,2200,,,,,,,,,
444,2021-03-30,AM,,AT-08-06,1,2,2200,,,,,,,,,
445,2021-03-30,PM,,AT-08-01,3,3,,,,,,,,,,
446,2021-03-30,PM,,AT-08-02,3,3,,,,,,,,,,
447,2021-03-30,PM,,AT-08-03,3,3,,,,,,,,,,
448,2021-03-30,PM,,AT-08-04,3,3,,,,,,,,,,
449,2021-03-30,PM,,AT-08-05,3,3,,,,,,,,,,
450,2021-03-30,PM,,AT-08-06,3,3,,,,,,,,,,
451,2021-03-31,AM,,AT-08-01,1,1,,,,,,,,,,
452,2021-03-31,AM,,AT-08-02,1,1,,,,,,,,,,
453,2021-03-31,AM,,AT-08-03,1,2,2200,,,,,,,,,
454,2021-03-31,AM,,AT-08-04,1,2,2200,,,,,,,,,
455,2021-03-31,AM,,AT-08-05,1,2,2200,,,,,,,,,
456,2021-03-31,AM,,AT-08-06,1,2,2200,,,,,,,,,
457,2021-03-31,PM,,AT-08-01,2,2,,,,,,,,,,
458,2021-03-31,PM,,AT-08-02,2,2,,,,,,,,,,
459,2021-03-31,PM,,AT-08-03,3,3,,,,,,,,,,
460,2021-03-31,PM,,AT-08-04,3,3,,,,,,,,,,
461,2021-03-31,PM,,AT-08-05,3,3,,,,,,,,,,
462,2021-03-31,PM,,AT-08-06,3,2,3000,,,,,,,,,
463,2021-04-01,AM,,AT-08-01,1,1,,,,,,,,,,
464,2021-04-01,AM,,AT-08-02,1,1,,,,,,,,,,
465,2021-04-01,AM,,AT-08-03,1,2,2200,,,,,,,,,
466,2021-04-01,AM,,AT-08-04,1,2,2200,,,,,,,,,
467,2021-04-01,AM,,AT-08-05,1,2,2200,,,,,,,,,
468,2021-04-01,AM,,AT-08-06,1,2,2200,,,,,,,,,
469,2021-04-01,PM,,AT-08-01,2,2,,,,,,,,,,
470,2021-04-01,PM,,AT-08-02,2,2,,,,,,,,,,
471,2021-04-01,PM,,AT-08-03,3,3,,,,,,,,,,
472,2021-04-01,PM,,AT-08-04,3,3,,,,,,,,,,
473,2021-04-01,PM,,AT-08-05,3,3,,,,,,,,,,
474,2021-04-01,PM,,AT-08-06,3,2,2800,,,,,,,,,
475,2021-04-02,AM,,AT-08-01,2,2,,,,,,,,,,
476,2021-04-02,AM,,AT-08-02,2,2,,,,,,,,,,
477,2021-04-02,AM,,AT-08-03,3,3,,,,,,,,,,
478,2021-04-02,AM,,AT-08-04,3,3,,,,,,,,,,
479,2021-04-02,AM,,AT-08-05,3,3,,,,,,,,,,
480,2021-04-02,AM,,AT-08-06,3,3,,,,,,,,,,
481,2021-04-03,AM,,AT-08-01,2,2,,,,,,,,,,
482,2021-04-03,AM,,AT-08-02,2,2,,,,,,,,,,
483,2021-04-03,AM,,AT-08-03,2,2,,,,,,,,,,
484,2021-04-03,AM,,AT-08-04,2,2,,,,,,,,,,
485,2021-04-03,AM,,AT-08-05,2,2,,,,,,,,,,
486,2021-04-03,AM,,AT-08-06,2,2,,,,,,,,,,
487,2021-04-04,AM,,AT-08-01,1,1,,,,,,,,,,
488,2021-04-04,AM,,AT-08-02,1,1,,,,,,,,,,
489,2021-04-04,AM,,AT-08-03,1,1,,,,,,,,,,
490,2021-04-04,AM,,AT-08-04,1,1,,,,,,,,,,
491,2021-04-04,AM,,AT-08-05,1,1,,,,,,,,,,
492,2021-04-04,AM,,AT-08-06,1,1,,,,,,,,,,
493,2021-04-04,PM,,AT-08-01,2,2,,,,,,,,,,
494,2021-04-04,PM,,AT-08-02,2,2,,,,,,,,,,
495,2021-04-04,PM,,AT-08-03,2,2,,,,,,,,,,
496,2021-04-04,PM,,AT-08-04,2,2,,,,,,,,,,
497,2021-04-04,PM,,AT-08-05,2,2,,,,,,,,,,
498,2021-04-04,PM,,AT-08-06,2,2,,,,,,,,,,
499,2021-04-05,AM,,AT-08-01,1,1,,,,,,,,,,
500,2021-04-05,AM,,AT-08-02,1,1,,,,,,,,,,
501,2021-04-05,AM,,AT-08-03,1,1,,,,,,,,,,
502,2021-04-05,AM,,AT-08-04,1,1,,,,,,,,,,
503,2021-04-05,AM,,AT-08-05,1,1,,,,,,,,,,
504,2021-04-05,AM,,AT-08-06,1,1,,,,,,,,,,
505,2021-04-05,PM,,AT-08-01,2,2,,,,,,,,,,
506,2021-04-05,PM,,AT-08-02,2,2,,,,,,,,,,
507,2021-04-05,PM,,AT-08-03,2,2,,,,,,,,,,
508,2021-04-05,PM,,AT-08-04,2,2,,,,,,,,,,
509,2021-04-05,PM,,AT-08-05,2,2,,,,,,,,,,
510,2021-04-05,PM,,AT-08-06,2,2,,,,,,,,,,
511,2021-04-06,AM,,AT-08-01,1,2,Treeline,,,,,,,,,
512,2021-04-06,AM,,AT-08-02,2,3,2000,,,,,,,,,
513,2021-04-06,AM,,AT-08-03,1,2,Treeline,,,,,,,,,
514,2021-04-06,AM,,AT-08-04,1,2,Treeline,,,,,,,,,
515,2021-04-06,AM,,AT-08-05,2,3,2000,,,,,,,,,
516,2021-04-06,AM,,AT-08-06,2,3,2000,,,,,,,,,
517,2021-04-07,AM,,AT-08-01,2,2,,,,,,,,,,
518,2021-04-07,AM,,AT-08-02,2,3,2000,,,,,,,,,
519,2021-04-07,AM,,AT-08-03,2,2,,,,,,,,,,
520,2021-04-07,AM,,AT-08-04,2,2,,,,,,,,,,
521,2021-04-07,AM,,AT-08-05,2,3,2000,,,,,,,,,
522,2021-04-07,AM,,AT-08-06,2,3,2000,,,,,,,,,
523,2021-04-08,AM,,AT-08-01,2,3,1800,,,,,,,,,
524,2021-04-08,AM,,AT-08-02,2,3,1800,,,,,,,,,
525,2021-04-08,AM,,AT-08-03,2,3,1800,,,,,,,,,
526,2021-04-08,AM,,AT-08-04,2,3,2000,,,,,,,,,
527,2021-04-08,AM,,AT-08-05,2,3,2000,,,,,,,,,
528,2021-04-08,AM,,AT-08-06,2,3,2000,,,,,,,,,
529,2021-04-09,AM,,AT-08-01,2,2,,,,,,,,,,
530,2021-04-09,AM,,AT-08-02,2,2,,,,,,,,,,
531,2021-04-09,AM,,AT-08-03,2,3,2000,,,,,,,,,
532,2021-04-09,AM,,AT-08-04,2,3,2200,,,,,,,,,
533,2021-04-09,AM,,AT-08-05,2,3,2200,,,,,,,,,
534,2021-04-09,AM,,AT-08-06,2,2,,,,,,,,,,
535,2021-04-10,AM,,AT-08-01,2,2,,,,,,,,,,
536,2021-04-10,AM,,AT-08-02,2,2,,,,,,,,,,
537,2021-04-10,AM,,AT-08-03,2,3,2200,,,,,,,,,
538,2021-04-10,AM,,AT-08-04,2,3,2200,,,,,,,,,
539,2021-04-10,AM,,AT-08-05,2,3,2200,,,,,,,,,
540,2021-04-10,AM,,AT-08-06,2,2,,,,,,,,,,
541,2021-04-11,AM,,AT-08-01,2,2,,,,,,,,,,
542,2021-04-11,AM,,AT-08-02,2,2,,,,,,,,,,
543,2021-04-11,AM,,AT-08-03,2,2,,,,,,,,,,
544,2021-04-11,AM,,AT-08-04,2,2,,,,,,,,,,
545,2021-04-11,AM,,AT-08-05,2,2,,,,,,,,,,
546,2021-04-11,AM,,AT-08-06,2,2,,,,,,,,,,
547,2021-04-12,AM,,AT-08-01,2,2,,,,,,,,,,
548,2021-04-12,AM,,AT-08-02,2,2,,,,,,,,,,
549,2021-04-12,AM,,AT-08-03,2,2,,,,,,,,,,
550,2021-04-12,AM,,AT-08-04,2,2,,,,,,,,,,
551,2021-04-12,AM,,AT-08-05,2,2,,,,,,,,,,
552,2021-04-12,AM,,AT-08-06,2,2,,,,,,,,,,
553,2021-04-13,AM,,AT-08-01,1,2,1600,,,,,,,,,
554,2021-04-13,AM,,AT-08-02,1,2,1600,,,,,,,,,
555,2021-04-13,AM,,AT-08-03,1,2,1600,,,,,,,,,
556,2021-04-13,AM,,AT-08-04,1,2,1800,,,,,,,,,
557,2021-04-13,AM,,AT-08-05,1,2,1800,,,,,,,,,
558,2021-04-13,AM,,AT-08-06,1,2,1800,,,,,,,,,
559,2021-04-14,AM,,AT-08-01,1,2,1600,,,,,,,,,
560,2021-04-14,AM,,AT-08-02,1,2,1600,,,,,,,,,
561,2021-04-14,AM,,AT-08-03,1,2,1600,,,,,,,,,
562,2021-04-14,AM,,AT-08-04,1,2,1800,,,,,,,,,
563,2021-04-14,AM,,AT-08-05,1,2,1800,,,,,,,,,
564,2021-04-14,AM,,AT-08-06,1,2,1800,,,,,,,,,
565,2021-04-15,AM,,AT-08-01,1,2,2000,,,,,,,,,
566,2021-04-15,AM,,AT-08-02,1,2,1800,,,,,,,,,
567,2021-04-15,AM,,AT-08-03,1,2,1800,,,,,,,,,
568,2021-04-15,AM,,AT-08-04,1,2,2000,,,,,,,,,
569,2021-04-15,AM,,AT-08-05,1,2,2000,,,,,,,,,
570,2021-04-15,AM,,AT-08-06,1,2,2000,,,,,,,,,
571,2021-04-16,AM,,AT-08-01,1,2,2000,,,,,,,,,
572,2021-04-16,AM,,AT-08-02,1,2,2000,,,,,,,,,
573,2021-04-16,AM,,AT-08-03,1,2,2000,,,,,,,,,
574,2021-04-16,AM,,AT-08-04,1,2,2000,,,,,,,,,
575,2021-04-16,AM,,AT-08-05,1,2,2000,,,,,,,,,
576,2021-04-16,AM,,AT-08-06,1,2,2000,,,,,,,,,
577,2021-04-17,AM,,AT-08-01,1,1,,,,,,,,,,
578,2021-04-17,AM,,AT-08-02,1,2,2200,,,,,,,,,
579,2021-04-17,AM,,AT-08-03,1,2,2200,,,,,,,,,
580,2021-04-17,AM,,AT-08-04,1,2,2200,,,,,,,,,
581,2021-04-17,AM,,AT-08-05,1,2,2200,,,,,,,,,
582,2021-04-17,AM,,AT-08-06,1,2,2200,,,,,,,,,
583,2021-04-18,AM,,AT-08-01,1,1,,,,,,,,,,
584,2021-04-18,AM,,AT-08-02,1,2,2200,,,,,,,,,
585,2021-04-18,AM,,AT-08-03,1,2,2200,,,,,,,,,
586,2021-04-18,AM,,AT-08-04,1,2,2200,,,,,,,,,
587,2021-04-18,AM,,AT-08-05,1,2,2200,,,,,,,,,
588,2021-04-18,AM,,AT-08-06,1,2,2200,,,,,,,,,
