[
  {
    "valid_regions": [
      "AT-05-01",
      "AT-05-02",
      "AT-05-03"
    ],
    "danger_main": [
      {
        "main_value": 2,
        "valid_elevation": ">1800"
      },
      {
        "main_value": 1,
        "valid_elevation": "<1800"
      }
    ],
    "dangerpattern": [],
    "problem_list": [
      {
        "problem_type": "old snow",
        "aspect": [
          "N",
          "NE",
          "E",
          "NW"
        ],
        "valid_elevation": null
      },
      {
        "problem_type": "drifting snow",
        "aspect": [
          "SE",
          "S",
          "SW"
        ],
        "valid_elevation": null
      }
    ],
    "report_texts": null,
    "report_id": "RID180RGR1",
    "rep_date": "2021-01-11T17:00:00+00:00",
    "validity_begin": "2021-01-11T23:00:00+00:00",
    "validity_end": "2021-01-12T23:00:00+00:00"
  },
  {
    "valid_regions": [
      "AT-05-07",
      "AT-05-06",
      "AT-05-05",
      "AT-05-10",
      "AT-05-11"
    ],
    "danger_main": [
      {
        "main_value": 2,
        "valid_elevation": ">2300"
      },
      {
        "main_value": 1,
        "valid_elevation": "<2300"
      }
    ],
    "dangerpattern": [],
    "problem_list": [
      {
        "problem_type": "old snow",
        "aspect": [
          "N",
          "NE",
          "E",
          "W",
          "NW"
        ],
        "valid_elevation": null
      },
      {
        "problem_type": "drifting snow",
        "aspect": [
          "NE",
          "E",
          "SE",
          "S",
          "SW"
        ],
        "valid_elevation": null
      }
    ],
    "report_texts": null,
    "report_id": "RID180RGR2",
    "rep_date": "2021-01-11T17:00:00+00:00",
    "validity_begin": "2021-01-11T23:00:00+00:00",
    "validity_end": "2021-01-12T23:00:00+00:00"
  },
  {
    "valid_regions": [
      "AT-05-15",
      "AT-05-14",
      "AT-05-17",
      "AT-05-21",
      "AT-05-13",
      "AT-05-09",
      "AT-05-18",
      "AT-05-19",
      "AT-05-20",
      "AT-05-12",
      "AT-05-16",
      "AT-05-08",
      "AT-05-04"
    ],
    "danger_main": [
      {
        "main_value": 1,
        "valid_elevation": null
      }
    ],
    "dangerpattern": [],
    "problem_list": [
      {
        "problem_type": "old snow",
        "aspect": [
          "N",
          "NE",
          "NW"
        ],
        "valid_elevation": null
      },
      {
        "problem_type": "drifting snow",
        "aspect": [
          "NE",
          "E",
          "SE"
        ],
        "valid_elevation": null
      }
    ],
    "report_texts": null,
    "report_id": "RID180RGR3",
    "rep_date": "2021-01-11T17:00:00+00:00",
    "validity_begin": "2021-01-11T23:00:00+00:00",
    "validity_end": "2021-01-12T23:00:00+00:00"
  }
]