{
"type": "FeatureCollection",
"name": "DE-BY_micro-regions",
"crs": { "type": "name", "properties": { "name": "urn:ogc:def:crs:OGC:1.3:CRS84" } },
"features": [
{ "type": "Feature", "properties": { "id": "BYALL" }, "geometry": { "type": "MultiPolygon", "coordinates": [ [ [ [ 10.037, 47.4889 ], [ 10.0307, 47.4871 ], [ 10.030703146853147, 47.487114685314687 ], [ 10.0109, 47.4815 ], [ 9.9993, 47.4828 ], [ 9.9878, 47.4984 ], [ 9.9954, 47.5028 ], [ 9.9656, 47.5231 ], [ 9.9683, 47.5252 ], [ 9.9669, 47.5349 ], [ 9.9696, 47.5421 ], [ 9.9689, 47.5442 ], [ 9.9901, 47.547 ], [ 10.0164, 47.5547 ], [ 10.0454, 47.552 ], [ 10.0668, 47.5489 ], [ 10.1076, 47.556 ], [ 10.1695, 47.5712 ], [ 10.1929, 47.5722 ], [ 10.217, 47.5674 ], [ 10.2515, 47.5548 ], [ 10.2772, 47.5554 ], [ 10.3033, 47.5685 ], [ 10.3237, 47.5813 ], [ 10.3498, 47.5878 ], [ 10.37, 47.5798 ], [ 10.3894, 47.5828 ], [ 10.4054, 47.5912 ], [ 10.4197, 47.5958 ], [ 10.4407, 47.6072 ], [ 10.4609, 47.6156 ], [ 10.4702, 47.6194 ], [ 10.482, 47.6265 ], [ 10.5085, 47.6278 ], [ 10.527, 47.6206 ], [ 10.5409, 47.6122 ], [ 10.5556, 47.5958 ], [ 10.5826, 47.5815 ], [ 10.6087, 47.5756 ], [ 10.6268, 47.5769 ], [ 10.6369, 47.576 ], [ 10.6583, 47.5714 ], [ 10.6802, 47.5676 ], [ 10.6937, 47.5665 ], [ 10.6911, 47.5592 ], [ 10.6879, 47.5584 ], [ 10.6856, 47.5579 ], [ 10.6835, 47.5571 ], [ 10.6814, 47.5562 ], [ 10.6799, 47.5557 ], [ 10.6783, 47.5555 ], [ 10.6769, 47.5589 ], [ 10.6349, 47.5593 ], [ 10.6262, 47.561 ], [ 10.6185, 47.5673 ], [ 10.6114, 47.5655 ], [ 10.5982, 47.5698 ], [ 10.5903, 47.56 ], [ 10.5801, 47.555 ], [ 10.5814, 47.5467 ], [ 10.5729, 47.5336 ], [ 10.5638, 47.5339 ], [ 10.563, 47.536 ], [ 10.5244, 47.5352 ], [ 10.489, 47.5403 ], [ 10.484, 47.5437 ], [ 10.4564, 47.5529 ], [ 10.4539, 47.5544 ], [ 10.4538, 47.5564 ], [ 10.4635, 47.5644 ], [ 10.466, 47.5653 ], [ 10.4719, 47.5702 ], [ 10.4711, 47.5799 ], [ 10.479, 47.5805 ], [ 10.482, 47.5845 ], [ 10.4695, 47.5873 ], [ 10.4567, 47.5829 ], [ 10.4353, 47.5839 ], [ 10.4294, 47.5775 ], [ 10.4332, 47.5697 ], [ 10.4452, 47.5669 ], [ 10.4511, 47.5549 ], [ 10.4394, 47.5244 ], [ 10.441, 47.5146 ], [ 10.4406, 47.5142 ], [ 10.4313, 47.5039 ], [ 10.4356, 47.4953 ], [ 10.4444, 47.484 ], [ 10.4515, 47.4859 ], [ 10.4634, 47.483 ], [ 10.4681, 47.468 ], [ 10.4657, 47.4529 ], [ 10.4731, 47.4429 ], [ 10.4767, 47.4321 ], [ 10.4582, 47.4282 ], [ 10.4547, 47.4186 ], [ 10.4353, 47.4112 ], [ 10.4371, 47.4071 ], [ 10.4311, 47.4029 ], [ 10.4342, 47.3999 ], [ 10.4292, 47.3909 ], [ 10.4367, 47.3804 ], [ 10.4303, 47.3839 ], [ 10.4194, 47.3844 ], [ 10.4147, 47.379 ], [ 10.3942, 47.3756 ], [ 10.3863, 47.3564 ], [ 10.3566, 47.3366 ], [ 10.3458, 47.3213 ], [ 10.3488, 47.3175 ], [ 10.3303, 47.3046 ], [ 10.3146, 47.3063 ], [ 10.3031, 47.2998 ], [ 10.2958, 47.2995 ], [ 10.2819, 47.2884 ], [ 10.2661, 47.2882 ], [ 10.2599, 47.2817 ], [ 10.2452, 47.2786 ], [ 10.2334, 47.2707 ], [ 10.2231, 47.2759 ], [ 10.2016, 47.2772 ], [ 10.1788, 47.2702 ], [ 10.1744, 47.2703 ], [ 10.1726, 47.2793 ], [ 10.1798, 47.2962 ], [ 10.1898, 47.2941 ], [ 10.2087, 47.3044 ], [ 10.2124, 47.3109 ], [ 10.2165, 47.3104 ], [ 10.2111, 47.3191 ], [ 10.1995, 47.3265 ], [ 10.2078, 47.3327 ], [ 10.2044, 47.3367 ], [ 10.2175, 47.3506 ], [ 10.2165, 47.3543 ], [ 10.2248, 47.3589 ], [ 10.2371, 47.3738 ], [ 10.2357, 47.3751 ], [ 10.2317, 47.379 ], [ 10.2363, 47.3818 ], [ 10.2272, 47.3892 ], [ 10.2127, 47.3804 ], [ 10.2001, 47.3833 ], [ 10.1953, 47.3893 ], [ 10.1818, 47.3924 ], [ 10.1825, 47.388 ], [ 10.1714, 47.3861 ], [ 10.1695, 47.3858 ], [ 10.1694, 47.3806 ], [ 10.1694, 47.3788 ], [ 10.1693, 47.3706 ], [ 10.1658, 47.3686 ], [ 10.1419, 47.367 ], [ 10.1348, 47.3697 ], [ 10.1195, 47.3755 ], [ 10.0998, 47.3548 ], [ 10.0923, 47.3727 ], [ 10.092243916626275, 47.372932961706248 ], [ 10.0834, 47.3939 ], [ 10.0853, 47.3998 ], [ 10.069, 47.4093 ], [ 10.0748, 47.4149 ], [ 10.0952, 47.4177 ], [ 10.1045, 47.4302 ], [ 10.0934, 47.4419 ], [ 10.0913, 47.4583 ], [ 10.0884, 47.4601 ], [ 10.0702, 47.4555 ], [ 10.0645, 47.4636 ], [ 10.054, 47.4665 ], [ 10.0472, 47.4863 ], [ 10.037, 47.4889 ] ] ] ] } },
{ "type": "Feature", "properties": { "id": "BYCHG" }, "geometry": { "type": "MultiPolygon", "coordinates": [ [ [ [ 12.6301, 47.6762 ], [ 12.617, 47.6724 ], [ 12.6048, 47.6732 ], [ 12.5992, 47.6667 ], [ 12.5856, 47.6512 ], [ 12.5754, 47.6323 ], [ 12.5359, 47.6366 ], [ 12.5127, 47.6247 ], [ 12.4991, 47.6247 ], [ 12.4914, 47.6368 ], [ 12.4658, 47.6496 ], [ 12.4524, 47.6681 ], [ 12.4391, 47.676 ], [ 12.4428, 47.6922 ], [ 12.44, 47.6955 ], [ 12.4293, 47.6968 ], [ 12.4006, 47.6928 ], [ 12.364, 47.6839 ], [ 12.3532, 47.691 ], [ 12.339, 47.6909 ], [ 12.3351, 47.6931 ], [ 12.3339, 47.6965 ], [ 12.2848, 47.6899 ], [ 12.2632, 47.6781 ], [ 12.257, 47.6793 ], [ 12.2433, 47.6921 ], [ 12.247, 47.7113 ], [ 12.2653, 47.7325 ], [ 12.2569, 47.7432 ], [ 12.2495, 47.7416 ], [ 12.2266, 47.7183 ], [ 12.2036, 47.7073 ], [ 12.1964, 47.7083 ], [ 12.1843, 47.7005 ], [ 12.1641, 47.7004 ], [ 12.1512, 47.7181 ], [ 12.1514, 47.7366 ], [ 12.1464, 47.7581 ], [ 12.1598, 47.7682 ], [ 12.1792, 47.7762 ], [ 12.2015, 47.7867 ], [ 12.2211, 47.7911 ], [ 12.2436, 47.7877 ], [ 12.2768, 47.7879 ], [ 12.2958, 47.7936 ], [ 12.3099, 47.7947 ], [ 12.3246, 47.7795 ], [ 12.3385, 47.7837 ], [ 12.3513, 47.7943 ], [ 12.3642, 47.8069 ], [ 12.3739, 47.8107 ], [ 12.3896, 47.805 ], [ 12.4061, 47.7955 ], [ 12.4166, 47.7909 ], [ 12.4282, 47.7863 ], [ 12.4399, 47.7806 ], [ 12.4482, 47.7736 ], [ 12.4547, 47.7637 ], [ 12.4784, 47.7647 ], [ 12.4879, 47.7654 ], [ 12.4995, 47.7667 ], [ 12.5207, 47.768 ], [ 12.5403, 47.7778 ], [ 12.5513, 47.7894 ], [ 12.5641, 47.7989 ], [ 12.5837, 47.8107 ], [ 12.6028, 47.8151 ], [ 12.6175, 47.8212 ], [ 12.6325, 47.8227 ], [ 12.6434, 47.8225 ], [ 12.6559, 47.8195 ], [ 12.6742, 47.8124 ], [ 12.6929, 47.8037 ], [ 12.7028, 47.7991 ], [ 12.7202, 47.8025 ], [ 12.7348, 47.8063 ], [ 12.7518, 47.8052 ], [ 12.7695, 47.8071 ], [ 12.7878, 47.8103 ], [ 12.8069, 47.8168 ], [ 12.8187, 47.8189 ], [ 12.8236, 47.8206 ], [ 12.8345, 47.8201 ], [ 12.8507, 47.8128 ], [ 12.8699, 47.8016 ], [ 12.8827, 47.7903 ], [ 12.8907, 47.7795 ], [ 12.908, 47.7732 ], [ 12.9242, 47.7701 ], [ 12.9277, 47.7701 ], [ 12.9347, 47.7716 ], [ 12.9419, 47.7704 ], [ 12.9435, 47.7629 ], [ 12.9367, 47.7584 ], [ 12.9352, 47.7488 ], [ 12.9303, 47.7451 ], [ 12.9198, 47.7432 ], [ 12.9136, 47.7374 ], [ 12.9053, 47.7243 ], [ 12.8816, 47.718 ], [ 12.8699, 47.7225 ], [ 12.8226, 47.717 ], [ 12.8018, 47.7049 ], [ 12.802, 47.6919 ], [ 12.7725, 47.6804 ], [ 12.7643, 47.6736 ], [ 12.7615, 47.6695 ], [ 12.7566, 47.6674 ], [ 12.7544, 47.6661 ], [ 12.7457, 47.6752 ], [ 12.7318, 47.6797 ], [ 12.7152, 47.6763 ], [ 12.7051, 47.6811 ], [ 12.683, 47.6827 ], [ 12.6661, 47.681 ], [ 12.6482, 47.6701 ], [ 12.6456, 47.6735 ], [ 12.6301, 47.6762 ] ] ] ] } },
{ "type": "Feature", "properties": { "id": "BYBGD" }, "geometry": { "type": "MultiPolygon", "coordinates": [ [ [ [ 12.7809, 47.6327 ], [ 12.7586, 47.6515 ], [ 12.7607, 47.6549 ], [ 12.7782, 47.6608 ], [ 12.7819, 47.6688 ], [ 12.7789, 47.6703 ], [ 12.776, 47.6679 ], [ 12.7736, 47.6662 ], [ 12.7717, 47.6652 ], [ 12.7705, 47.665 ], [ 12.7689, 47.665 ], [ 12.7679, 47.6651 ], [ 12.7665, 47.6654 ], [ 12.7653, 47.6656 ], [ 12.7642, 47.6657 ], [ 12.7633, 47.6657 ], [ 12.7624, 47.6655 ], [ 12.7614, 47.6652 ], [ 12.7589, 47.6642 ], [ 12.7569, 47.6634 ], [ 12.7544, 47.6661 ], [ 12.7566, 47.6674 ], [ 12.7615, 47.6695 ], [ 12.7643, 47.6736 ], [ 12.7725, 47.6804 ], [ 12.802, 47.6919 ], [ 12.8018, 47.7049 ], [ 12.8226, 47.717 ], [ 12.8699, 47.7225 ], [ 12.8816, 47.718 ], [ 12.9053, 47.7243 ], [ 12.9131, 47.7177 ], [ 12.9177, 47.7151 ], [ 12.9248, 47.7103 ], [ 12.9435, 47.7119 ], [ 12.9462, 47.7121 ], [ 12.9469, 47.7118 ], [ 12.9555, 47.7078 ], [ 12.9872, 47.7074 ], [ 12.995, 47.713 ], [ 13.0023, 47.7134 ], [ 13.0105, 47.7229 ], [ 13.0146, 47.7229 ], [ 13.018, 47.7229 ], [ 13.0265, 47.7176 ], [ 13.0453, 47.7127 ], [ 13.0608, 47.6971 ], [ 13.0807, 47.6869 ], [ 13.0769, 47.6709 ], [ 13.08, 47.6625 ], [ 13.0897, 47.654 ], [ 13.0885, 47.6491 ], [ 13.0982, 47.6338 ], [ 13.0958, 47.6279 ], [ 13.0799, 47.6184 ], [ 13.0748, 47.6117 ], [ 13.0695, 47.6048 ], [ 13.0626, 47.6015 ], [ 13.0715, 47.5899 ], [ 13.0685, 47.5858 ], [ 13.0437, 47.5834 ], [ 13.0424, 47.5737 ], [ 13.0502, 47.5637 ], [ 13.0575, 47.5622 ], [ 13.031, 47.5326 ], [ 13.0462, 47.5239 ], [ 13.046513242009134, 47.516807305936069 ], [ 13.0468, 47.5148 ], [ 13.0476, 47.4922 ], [ 13.0269, 47.4867 ], [ 13.0178, 47.4746 ], [ 13.0039, 47.4634 ], [ 12.9935, 47.4716 ], [ 12.9947, 47.4787 ], [ 12.9774, 47.4848 ], [ 12.9697, 47.4742 ], [ 12.9319, 47.4878 ], [ 12.9121, 47.4957 ], [ 12.8858, 47.5125 ], [ 12.8806, 47.5219 ], [ 12.857, 47.5271 ], [ 12.8517, 47.5308 ], [ 12.8477, 47.546 ], [ 12.8177, 47.5449 ], [ 12.8102, 47.5472 ], [ 12.8031, 47.5516 ], [ 12.7943, 47.557 ], [ 12.7892, 47.5659 ], [ 12.7791, 47.5791 ], [ 12.7953, 47.5931 ], [ 12.7913, 47.5982 ], [ 12.8074, 47.6103 ], [ 12.8133, 47.612 ], [ 12.8229, 47.6096 ], [ 12.8244, 47.6121 ], [ 12.7994, 47.6272 ], [ 12.7897, 47.6332 ], [ 12.7809, 47.6327 ] ] ] ] } },
{ "type": "Feature", "properties": { "id": "BYBVA" }, "geometry": { "type": "MultiPolygon", "coordinates": [ [ [ [ 11.6071, 47.5815 ], [ 11.6112, 47.5811 ], [ 11.6144, 47.5808 ], [ 11.6157, 47.5808 ], [ 11.6174, 47.5811 ], [ 11.6214, 47.5823 ], [ 11.6246, 47.5823 ], [ 11.6267, 47.5819 ], [ 11.6327, 47.5798 ], [ 11.6304, 47.5844 ], [ 11.6362, 47.5949 ], [ 11.66, 47.5837 ], [ 11.6812, 47.5837 ], [ 11.7004, 47.5892 ], [ 11.7338, 47.5884 ], [ 11.7475, 47.588 ], [ 11.775, 47.5904 ], [ 11.8171, 47.5846 ], [ 11.8285, 47.5857 ], [ 11.8302, 47.582 ], [ 11.8442, 47.5813 ], [ 11.8478, 47.5825 ], [ 11.8533, 47.5969 ], [ 11.8553, 47.6022 ], [ 11.8656, 47.6016 ], [ 11.8713, 47.6029 ], [ 11.8946, 47.6084 ], [ 11.903, 47.6085 ], [ 11.9145, 47.6139 ], [ 11.9337, 47.6128 ], [ 11.9689, 47.6172 ], [ 11.9767, 47.6147 ], [ 11.9813, 47.6189 ], [ 12.0085, 47.6252 ], [ 12.0214, 47.6112 ], [ 12.028, 47.6112 ], [ 12.0351, 47.6172 ], [ 12.0497, 47.6149 ], [ 12.0598, 47.6176 ], [ 12.0777, 47.6135 ], [ 12.0828, 47.6096 ], [ 12.1154, 47.6114 ], [ 12.1292, 47.6059 ], [ 12.1403, 47.6055 ], [ 12.1493, 47.6085 ], [ 12.162, 47.6132 ], [ 12.1788, 47.6147 ], [ 12.1813, 47.6108 ], [ 12.1779, 47.6011 ], [ 12.1824, 47.6041 ], [ 12.1843, 47.6046 ], [ 12.1866, 47.605 ], [ 12.1893, 47.6049 ], [ 12.1942, 47.6053 ], [ 12.1978, 47.6056 ], [ 12.2012, 47.606 ], [ 12.2038, 47.6066 ], [ 12.2059, 47.6079 ], [ 12.2073, 47.6093 ], [ 12.2081, 47.612 ], [ 12.2081, 47.6152 ], [ 12.2063, 47.6189 ], [ 12.2041, 47.6241 ], [ 12.2027, 47.6299 ], [ 12.2023, 47.6335 ], [ 12.2015, 47.636 ], [ 12.1999, 47.6396 ], [ 12.1991, 47.6414 ], [ 12.1958, 47.6455 ], [ 12.1929, 47.6488 ], [ 12.1898, 47.6528 ], [ 12.1867, 47.6572 ], [ 12.1852, 47.6596 ], [ 12.1842, 47.6627 ], [ 12.1826, 47.6666 ], [ 12.181, 47.669 ], [ 12.1785, 47.6725 ], [ 12.1753, 47.676 ], [ 12.1706, 47.6816 ], [ 12.1683, 47.6857 ], [ 12.1671, 47.6882 ], [ 12.1657, 47.6924 ], [ 12.1646, 47.6969 ], [ 12.1641, 47.7004 ], [ 12.1512, 47.7181 ], [ 12.1472, 47.7168 ], [ 12.1344, 47.7164 ], [ 12.1154, 47.7206 ], [ 12.1036, 47.7307 ], [ 12.0963, 47.7484 ], [ 12.0624, 47.7671 ], [ 12.0283, 47.7696 ], [ 12.0106, 47.7707 ], [ 11.9936, 47.7625 ], [ 11.9744, 47.7572 ], [ 11.9557, 47.76 ], [ 11.9412, 47.7669 ], [ 11.9227, 47.7671 ], [ 11.9075, 47.7619 ], [ 11.8932, 47.753 ], [ 11.8705, 47.7459 ], [ 11.8511, 47.7454 ], [ 11.8332, 47.7421 ], [ 11.8233, 47.7328 ], [ 11.7945, 47.7269 ], [ 11.7638, 47.7294 ], [ 11.7442, 47.7404 ], [ 11.7318, 47.7505 ], [ 11.7084, 47.7629 ], [ 11.675, 47.7671 ], [ 11.5958, 47.7557 ], [ 11.5601, 47.7467 ], [ 11.5264, 47.7459 ], [ 11.4818, 47.744 ], [ 11.4618, 47.736 ], [ 11.4416, 47.7162 ], [ 11.4349, 47.7015 ], [ 11.4224, 47.6787 ], [ 11.4067, 47.6573 ], [ 11.3915, 47.6495 ], [ 11.3616, 47.6499 ], [ 11.3362, 47.6404 ], [ 11.3183, 47.6524 ], [ 11.3013, 47.6682 ], [ 11.2869, 47.6674 ], [ 11.2764, 47.6419 ], [ 11.2705, 47.6225 ], [ 11.2541, 47.6175 ], [ 11.2318, 47.6173 ], [ 11.2093, 47.607 ], [ 11.1921, 47.592 ], [ 11.2983, 47.5677 ], [ 11.2908, 47.5465 ], [ 11.2758, 47.4907 ], [ 11.2858, 47.5045 ], [ 11.3112, 47.5308 ], [ 11.3404, 47.5386 ], [ 11.3818, 47.5517 ], [ 11.4275, 47.5555 ], [ 11.4819, 47.5592 ], [ 11.5189, 47.5623 ], [ 11.5384, 47.5778 ], [ 11.5492, 47.5855 ], [ 11.5622, 47.5854 ], [ 11.5837, 47.5819 ], [ 11.596, 47.5828 ], [ 11.6071, 47.5815 ] ] ] ] } },
{ "type": "Feature", "properties": { "id": "BYWFK" }, "geometry": { "type": "MultiPolygon", "coordinates": [ [ [ [ 10.9384, 47.4793 ], [ 10.9283, 47.4723 ], [ 10.9327, 47.4679 ], [ 10.9832, 47.4301 ], [ 10.9848, 47.4212 ], [ 10.9717, 47.4166 ], [ 10.9702, 47.4036 ], [ 10.9778, 47.3978 ], [ 11.006, 47.3943 ], [ 11.0159, 47.3963 ], [ 11.0239, 47.3971 ], [ 11.0286, 47.3935 ], [ 11.0553, 47.3958 ], [ 11.116, 47.3957 ], [ 11.124, 47.3988 ], [ 11.1225, 47.4072 ], [ 11.1292, 47.4126 ], [ 11.139, 47.4135 ], [ 11.1575, 47.4214 ], [ 11.1984, 47.4276 ], [ 11.2017, 47.4303 ], [ 11.1984, 47.4276 ], [ 11.2017, 47.4303 ], [ 11.201675757186596, 47.430322714317242 ], [ 11.2061, 47.434 ], [ 11.2214, 47.4305 ], [ 11.2496, 47.4326 ], [ 11.254, 47.4276 ], [ 11.2405, 47.4194 ], [ 11.2224, 47.3971 ], [ 11.2267, 47.3951 ], [ 11.2352, 47.3981 ], [ 11.2711, 47.3979 ], [ 11.2793, 47.4002 ], [ 11.2811, 47.4008 ], [ 11.2901, 47.4075 ], [ 11.2917, 47.4279 ], [ 11.3012, 47.4314 ], [ 11.3113, 47.4301 ], [ 11.3217, 47.4376 ], [ 11.3297, 47.438 ], [ 11.3318, 47.4456 ], [ 11.338, 47.4496 ], [ 11.3575, 47.4488 ], [ 11.3649, 47.4449 ], [ 11.381, 47.4492 ], [ 11.3936, 47.4458 ], [ 11.4017, 47.4485 ], [ 11.4212, 47.4445 ], [ 11.4123, 47.455 ], [ 11.4092, 47.467 ], [ 11.3939, 47.4661 ], [ 11.3833, 47.4724 ], [ 11.3903, 47.4821 ], [ 11.4072, 47.4906 ], [ 11.4135, 47.4996 ], [ 11.4366, 47.5161 ], [ 11.4419, 47.5182 ], [ 11.4428, 47.5157 ], [ 11.4438, 47.5142 ], [ 11.4456, 47.5121 ], [ 11.4473, 47.5099 ], [ 11.4495, 47.5072 ], [ 11.4814, 47.5091 ], [ 11.4748, 47.5087 ], [ 11.4814, 47.5091 ], [ 11.5057, 47.5047 ], [ 11.519, 47.5109 ], [ 11.5329, 47.5088 ], [ 11.5728, 47.5147 ], [ 11.5877, 47.5254 ], [ 11.5877, 47.5359 ], [ 11.5877, 47.5429 ], [ 11.5876, 47.5552 ], [ 11.6007, 47.5677 ], [ 11.6071, 47.5815 ], [ 11.596, 47.5828 ], [ 11.5837, 47.5819 ], [ 11.5622, 47.5854 ], [ 11.5492, 47.5855 ], [ 11.5384, 47.5778 ], [ 11.5189, 47.5623 ], [ 11.4819, 47.5592 ], [ 11.4275, 47.5555 ], [ 11.3818, 47.5517 ], [ 11.3404, 47.5386 ], [ 11.3112, 47.5308 ], [ 11.2858, 47.5045 ], [ 11.2758, 47.4907 ], [ 11.2908, 47.5465 ], [ 11.2983, 47.5677 ], [ 11.1921, 47.592 ], [ 11.1748, 47.5858 ], [ 11.1699, 47.5804 ], [ 11.1498, 47.5701 ], [ 11.1444, 47.5627 ], [ 11.1267, 47.55 ], [ 11.1069, 47.5574 ], [ 11.0953, 47.5512 ], [ 11.0654, 47.5439 ], [ 11.0566, 47.5471 ], [ 11.0514, 47.549 ], [ 11.0475, 47.539 ], [ 11.0325, 47.5345 ], [ 11.0264, 47.5299 ], [ 11.009, 47.5301 ], [ 11.0004, 47.5242 ], [ 10.9982, 47.522 ], [ 10.9823, 47.5063 ], [ 10.9776, 47.4942 ], [ 10.9775, 47.494 ], [ 10.9749, 47.4872 ], [ 10.9651, 47.4843 ], [ 10.9384, 47.4793 ] ] ] ] } },
{ "type": "Feature", "properties": { "id": "BYAMM" }, "geometry": { "type": "MultiPolygon", "coordinates": [ [ [ [ 11.1921, 47.592 ], [ 11.1643, 47.597 ], [ 11.1554, 47.619 ], [ 11.1474, 47.6282 ], [ 11.1362, 47.6381 ], [ 11.1253, 47.6516 ], [ 11.1083, 47.6634 ], [ 11.0859, 47.665 ], [ 11.0533, 47.6678 ], [ 11.0455, 47.6663 ], [ 11.0241, 47.6619 ], [ 11.0047, 47.6573 ], [ 10.9957, 47.6537 ], [ 10.9885, 47.6526 ], [ 10.9702, 47.6531 ], [ 10.9567, 47.6522 ], [ 10.9243, 47.6497 ], [ 10.8936, 47.6438 ], [ 10.8561, 47.6324 ], [ 10.8208, 47.6131 ], [ 10.7888, 47.5979 ], [ 10.7816, 47.5929 ], [ 10.7661, 47.5748 ], [ 10.7408, 47.5668 ], [ 10.7036, 47.5657 ], [ 10.6937, 47.5665 ], [ 10.6911, 47.5592 ], [ 10.6949, 47.5443 ], [ 10.7082, 47.5437 ], [ 10.719, 47.5382 ], [ 10.7405, 47.5384 ], [ 10.7362, 47.5384 ], [ 10.7405, 47.5384 ], [ 10.7588, 47.5345 ], [ 10.765, 47.5249 ], [ 10.7638, 47.5196 ], [ 10.7773, 47.514 ], [ 10.7919, 47.5198 ], [ 10.7953, 47.5212 ], [ 10.8125, 47.5204 ], [ 10.8129, 47.5266 ], [ 10.8129, 47.5266 ], [ 10.8299, 47.5285 ], [ 10.8314, 47.5287 ], [ 10.8385, 47.5257 ], [ 10.8537, 47.5344 ], [ 10.8901, 47.5376 ], [ 10.9042, 47.5185 ], [ 10.9157, 47.5194 ], [ 10.9179, 47.5134 ], [ 10.9028, 47.5097 ], [ 10.8784, 47.5036 ], [ 10.8715, 47.4969 ], [ 10.8709, 47.4817 ], [ 10.8854, 47.479 ], [ 10.9108, 47.4857 ], [ 10.9349, 47.4827 ], [ 10.9384, 47.4793 ], [ 10.9651, 47.4843 ], [ 10.9749, 47.4872 ], [ 10.9775, 47.494 ], [ 10.9776, 47.4942 ], [ 10.9823, 47.5063 ], [ 10.9982, 47.522 ], [ 11.0004, 47.5242 ], [ 11.009, 47.5301 ], [ 11.0264, 47.5299 ], [ 11.0325, 47.5345 ], [ 11.0475, 47.539 ], [ 11.0514, 47.549 ], [ 11.0566, 47.5471 ], [ 11.0654, 47.5439 ], [ 11.0953, 47.5512 ], [ 11.1069, 47.5574 ], [ 11.1267, 47.55 ], [ 11.1444, 47.5627 ], [ 11.1498, 47.5701 ], [ 11.1699, 47.5804 ], [ 11.1748, 47.5858 ], [ 11.1921, 47.592 ] ] ] ] } }
]
}
