[
  {
    "valid_regions": [
      "AT-03-05",
      "AT-03-04",
      "AT-03-06",
      "AT-03-02",
      "AT-03-01"
    ],
    "danger_main": [
      {
        "main_value": 1,
        "valid_elevation": null
      }
    ],
    "dangerpattern": [],
    "problem_list": [
      {
        "problem_type": "wet snow",
        "aspect": [
          "SE",
          "S",
          "SW",
          "W"
        ],
        "valid_elevation": null
      }
    ],
    "report_texts": null,
    "report_id": "RID479RGR1",
    "rep_date": "2021-02-24T17:00:00+00:00",
    "validity_begin": "2021-02-24T23:00:00+00:00",
    "validity_end": "2021-02-25T11:00:00+00:00"
  },
  {
    "valid_regions": [
      "AT-03-05",
      "AT-03-04",
      "AT-03-06",
      "AT-03-02",
      "AT-03-01"
    ],
    "danger_main": [
      {
        "main_value": 2,
        "valid_elevation": null
      }
    ],
    "dangerpattern": [],
    "problem_list": [
      {
        "problem_type": "wet snow",
        "aspect": [
          "SE",
          "S",
          "SW",
          "W"
        ],
        "valid_elevation": null
      }
    ],
    "report_texts": null,
    "report_id": "RID479RGR1_PM",
    "rep_date": "2021-02-24T17:00:00+00:00",
    "validity_begin": "2021-02-25T11:00:00+00:00",
    "validity_end": "2021-02-25T23:00:00+00:00",
    "predecessor_id": "RID479RGR1"
  }
]