{
"type": "FeatureCollection",
"generator": "overpass-ide",
"copyright": "The data included in this document is from www.openstreetmap.org. The data is made available under ODbL.",
"timestamp": "2020-03-31T15:31:02Z",
"name": "Trentino_Peaks",
"features": [
{ "type": "Feature", "id": "node\/26862693", "properties": { "@id": "node\/26862693", "ele": "2847", "name": "Cima d'Asta", "natural": "peak", "wikidata": "Q501840", "wikipedia": "it:Cima d'Asta", "summit:cross": "yes" }, "geometry": { "type": "Point", "coordinates": [ 11.6052937, 46.1766183 ] } },
{ "type": "Feature", "id": "node\/26862712", "properties": { "@id": "node\/26862712", "ele": "3173", "name": "Cima Tosa", "natural": "peak", "wikidata": "Q594670", "wikipedia": "it:Cima Tosa", "prominence": "1521" }, "geometry": { "type": "Point", "coordinates": [ 10.8711276, 46.1565222 ] } },
{ "type": "Feature", "id": "node\/26862734", "properties": { "@id": "node\/26862734", "ele": "2178", "name": "Monte Cornetto", "natural": "peak", "prominence": "1685", "importance": "regional", "source:prominence": "https:\/\/www.ii.uib.no\/~petter\/mountains\/italy.html" }, "geometry": { "type": "Point", "coordinates": [ 11.0317717, 45.9880488 ] } },
{ "type": "Feature", "id": "node\/26863482", "properties": { "@id": "node\/26863482", "ele": "2125", "name": "La Paganella", "natural": "peak", "wikidata": "Q2046117", "wikipedia": "it:Paganella", "prominence": "1099", "importance": "regional" }, "geometry": { "type": "Point", "coordinates": [ 11.0374405, 46.1432672 ] } },
{ "type": "Feature", "id": "node\/26863801", "properties": { "@id": "node\/26863801", "ele": "2250", "name": "Monte Cadria", "natural": "peak", "wikidata": "Q1545440", "wikipedia": "it:Monte Cadria", "prominence": "1434", "alt_name": "Monte Geometra" }, "geometry": { "type": "Point", "coordinates": [ 10.6983253, 45.9385884 ] } },
{ "type": "Feature", "id": "node\/26863811", "properties": { "@id": "node\/26863811", "ele": "1976", "name": "Monte Caplone", "natural": "peak", "wikidata": "Q3861306", "wikipedia": "it:Monte Caplone", "prominence": "1234", "alt_name": "Cima della Guardia" }, "geometry": { "type": "Point", "coordinates": [ 10.641351, 45.8021777 ] } },
{ "type": "Feature", "id": "node\/26863836", "properties": { "@id": "node\/26863836", "ele": "1781", "name": "Monte Corno - Trudner Horn", "natural": "peak", "wikidata": "Q2456159", "wikipedia": "it:Monte Corno (Bolzano)", "name:de": "Trudner Horn", "name:it": "Monte Corno" }, "geometry": { "type": "Point", "coordinates": [ 11.3238241, 46.2898752 ] } },
{ "type": "Feature", "id": "node\/253472403", "properties": { "@id": "node\/253472403", "ele": "2161", "name": "Mulat", "natural": "peak", "importance": "urban", "source:ele": "3rd Military Mapping Survey of Austria-Hungary", "is_in": "Predazzo, Trento, Trentino-Alto Adige, Italy" }, "geometry": { "type": "Point", "coordinates": [ 11.6325908, 46.3270122 ] } },
{ "type": "Feature", "id": "node\/253480188", "properties": { "@id": "node\/253480188", "ele": "2301", "name": "Sas de Mezdì", "natural": "peak", "is_in": "Moena, Trento, Trentino-Alto Adige, Italy" }, "geometry": { "type": "Point", "coordinates": [ 11.6704242, 46.3562573 ] } },
{ "type": "Feature", "id": "node\/267702683", "properties": { "@id": "node\/267702683", "ele": "460", "name": "Dosso San Rocco", "natural": "peak", "importance": "suburban" }, "geometry": { "type": "Point", "coordinates": [ 11.141443, 46.0336672 ] } },
{ "type": "Feature", "id": "node\/282201814", "properties": { "@id": "node\/282201814", "ele": "2229", "name": "Paion del Cermis", "natural": "peak", "wikidata": "Q2576260", "wikipedia": "it:Alpe Cermis", "importance": "regional", "source:ele": "3rd Military Mapping Survey of Austria-Hungary" }, "geometry": { "type": "Point", "coordinates": [ 11.5035518, 46.2413696 ] } },
{ "type": "Feature", "id": "node\/286954450", "properties": { "@id": "node\/286954450", "ele": "2368", "name": "Monte Valpiana", "natural": "peak", "importance": "suburban", "source:ele": "IGM Trentino e Carta Topografica Tabacco 058 ed.2015" }, "geometry": { "type": "Point", "coordinates": [ 11.480299, 46.1629253 ] } },
{ "type": "Feature", "id": "node\/290885237", "properties": { "@id": "node\/290885237", "ele": "2045", "name": "Antecima Cornetto", "natural": "peak" }, "geometry": { "type": "Point", "coordinates": [ 11.1866036, 45.9409544 ] } },
{ "type": "Feature", "id": "node\/292092355", "properties": { "@id": "node\/292092355", "ele": "1416", "name": "Solombo", "natural": "peak" }, "geometry": { "type": "Point", "coordinates": [ 11.4163781, 46.3030588 ] } },
{ "type": "Feature", "id": "node\/292279083", "properties": { "@id": "node\/292279083", "ele": "2060", "name": "Buffaure", "natural": "peak" }, "geometry": { "type": "Point", "coordinates": [ 11.7172219, 46.4265516 ] } },
{ "type": "Feature", "id": "node\/298291892", "properties": { "@id": "node\/298291892", "ele": "2582", "name": "Cima Tamalè", "natural": "peak" }, "geometry": { "type": "Point", "coordinates": [ 10.6842505, 46.1824426 ] } },
{ "type": "Feature", "id": "node\/298291985", "properties": { "@id": "node\/298291985", "ele": "3036", "name": "Lobbia di Mezzo", "natural": "peak" }, "geometry": { "type": "Point", "coordinates": [ 10.5709738, 46.1795614 ] } },
{ "type": "Feature", "id": "node\/301458487", "properties": { "@id": "node\/301458487", "ele": "841", "name": "Monte Tombio", "natural": "peak" }, "geometry": { "type": "Point", "coordinates": [ 10.8242256, 45.9088496 ] } },
{ "type": "Feature", "id": "node\/301563250", "properties": { "@id": "node\/301563250", "ele": "1803", "name": "Monte Misone", "natural": "peak", "prominence": "1040" }, "geometry": { "type": "Point", "coordinates": [ 10.8336682, 45.9552217 ] } },
{ "type": "Feature", "id": "node\/310199149", "properties": { "@id": "node\/310199149", "ele": "2054", "name": "Monte Stivo", "natural": "peak", "wikidata": "Q1945934", "wikipedia": "it:Monte Stivo" }, "geometry": { "type": "Point", "coordinates": [ 10.9636915, 45.9201274 ] } },
{ "type": "Feature", "id": "node\/313155440", "properties": { "@id": "node\/313155440", "ele": "1618", "name": "Monte Biaena", "natural": "peak", "wikidata": "Q3861230", "wikipedia": "it:Monte Biaena" }, "geometry": { "type": "Point", "coordinates": [ 10.970971, 45.8827083 ] } },
{ "type": "Feature", "id": "node\/374292023", "properties": { "@id": "node\/374292023", "ele": "1096", "name": "Monte Calisio", "natural": "peak", "wikidata": "Q3861272", "wikipedia": "it:Monte Calisio", "importance": "regional" }, "geometry": { "type": "Point", "coordinates": [ 11.1434237, 46.0981134 ] } },
{ "type": "Feature", "id": "node\/388112267", "properties": { "@id": "node\/388112267", "ele": "3064", "name": "Punta Orco", "natural": "peak" }, "geometry": { "type": "Point", "coordinates": [ 10.5968144, 46.1722058 ] } },
{ "type": "Feature", "id": "node\/388118380", "properties": { "@id": "node\/388118380", "ele": "2870", "name": "Monte Coel", "natural": "peak" }, "geometry": { "type": "Point", "coordinates": [ 10.6262626, 46.1267407 ] } },
{ "type": "Feature", "id": "node\/388120071", "properties": { "@id": "node\/388120071", "ele": "2488", "name": "Fornace", "natural": "peak" }, "geometry": { "type": "Point", "coordinates": [ 10.6756581, 46.1241233 ] } },
{ "type": "Feature", "id": "node\/391038683", "properties": { "@id": "node\/391038683", "ele": "998", "name": "Cima Celva", "natural": "peak", "importance": "urban", "tourism": "viewpoint" }, "geometry": { "type": "Point", "coordinates": [ 11.1840592, 46.073892 ] } },
{ "type": "Feature", "id": "node\/393892582", "properties": { "@id": "node\/393892582", "ele": "3346", "name": "Cima Marmotta", "natural": "peak", "wikidata": "Q1092002", "name:de": "Köllkuppe", "fixme": "In Österreich heißt dieser Berg tatsächlich \"Köllkuppe\". In Deutschland aber wird er meines Wissens oft auch übersetzt \"Murmeltierspitze\" genannt?!? Bitte prüfen!", "name:at": "Köllkuppe" }, "geometry": { "type": "Point", "coordinates": [ 10.6828445, 46.4496807 ] } },
{ "type": "Feature", "id": "node\/411553131", "properties": { "@id": "node\/411553131", "ele": "1879", "name": "Mazza di Pichea", "natural": "peak", "summit:cross": "yes", "summit:register": "yes" }, "geometry": { "type": "Point", "coordinates": [ 10.7639085, 45.9322342 ] } },
{ "type": "Feature", "id": "node\/450174244", "properties": { "@id": "node\/450174244", "ele": "859", "name": "Nodice", "natural": "peak" }, "geometry": { "type": "Point", "coordinates": [ 10.8227, 45.8566038 ] } },
{ "type": "Feature", "id": "node\/456036439", "properties": { "@id": "node\/456036439", "ele": "2749", "name": "Monte Listino", "natural": "peak" }, "geometry": { "type": "Point", "coordinates": [ 10.4533655, 45.9768256 ] } },
{ "type": "Feature", "id": "node\/457885188", "properties": { "@id": "node\/457885188", "ele": "1835", "name": "Cima Durmont", "natural": "peak" }, "geometry": { "type": "Point", "coordinates": [ 10.7599265, 46.0835767 ] } },
{ "type": "Feature", "id": "node\/474987188", "properties": { "@id": "node\/474987188", "ele": "2003", "name": "Dossone", "natural": "peak" }, "geometry": { "type": "Point", "coordinates": [ 10.7291836, 46.1524635 ] } },
{ "type": "Feature", "id": "node\/482730723", "properties": { "@id": "node\/482730723", "ele": "608", "name": "Dos del Cuco", "natural": "peak" }, "geometry": { "type": "Point", "coordinates": [ 11.2452409, 46.0492418 ] } },
{ "type": "Feature", "id": "node\/482766921", "properties": { "@id": "node\/482766921", "ele": "1618", "name": "Malgola", "natural": "peak", "importance": "suburban", "source:ele": "3rd Military Mapping Survey of Austria-Hungary" }, "geometry": { "type": "Point", "coordinates": [ 11.6236559, 46.301123 ] } },
{ "type": "Feature", "id": "node\/487082706", "properties": { "@id": "node\/487082706", "ele": "851", "name": "Casteller", "natural": "peak" }, "geometry": { "type": "Point", "coordinates": [ 11.2402045, 46.0828068 ] } },
{ "type": "Feature", "id": "node\/497543209", "properties": { "@id": "node\/497543209", "ele": "2484", "name": "Col Rodella", "natural": "peak", "wikidata": "Q3682472" }, "geometry": { "type": "Point", "coordinates": [ 11.7486236, 46.4953446 ] } },
{ "type": "Feature", "id": "node\/517695110", "properties": { "@id": "node\/517695110", "ele": "2118", "name": "Dos de Portole", "natural": "peak", "alt_name": "Dosso di Portole" }, "geometry": { "type": "Point", "coordinates": [ 10.5022185, 45.8811795 ] } },
{ "type": "Feature", "id": "node\/517874443", "properties": { "@id": "node\/517874443", "ele": "1668", "name": "Rocca Fredda", "natural": "peak" }, "geometry": { "type": "Point", "coordinates": [ 10.5986772, 45.8607807 ] } },
{ "type": "Feature", "id": "node\/518977195", "properties": { "@id": "node\/518977195", "ele": "1821", "name": "Cima Spessa", "natural": "peak" }, "geometry": { "type": "Point", "coordinates": [ 10.590281, 45.8212743 ] } },
{ "type": "Feature", "id": "node\/523391623", "properties": { "@id": "node\/523391623", "ele": "2891", "name": "Monte Re di Castello", "natural": "peak", "wikidata": "Q3861895", "wikipedia": "it:Monte Re di Castello", "summit:cross": "yes", "source": "Regione Lombardia - La banca dati territoriali CTR10000 e' prodotta da Regione Lombardia - Infrastruttura per l'Informazione Territoriale" }, "geometry": { "type": "Point", "coordinates": [ 10.4834601, 46.0216799 ] } },
{ "type": "Feature", "id": "node\/523391640", "properties": { "@id": "node\/523391640", "ele": "2396", "name": "Corno della Vecchia", "natural": "peak", "source": "Regione Lombardia - La banca dati territoriali CTR10000 e' prodotta da Regione Lombardia - Infrastruttura per l'Informazione Territoriale" }, "geometry": { "type": "Point", "coordinates": [ 10.4826283, 46.0410535 ] } },
{ "type": "Feature", "id": "node\/523391928", "properties": { "@id": "node\/523391928", "ele": "2879", "name": "Pilastro", "natural": "peak", "source": "Regione Lombardia - La banca dati territoriali CTR10000 e' prodotta da Regione Lombardia - Infrastruttura per l'Informazione Territoriale" }, "geometry": { "type": "Point", "coordinates": [ 10.5424086, 46.1074384 ] } },
{ "type": "Feature", "id": "node\/529087732", "properties": { "@id": "node\/529087732", "ele": "1193", "name": "Monte Calva", "natural": "peak" }, "geometry": { "type": "Point", "coordinates": [ 10.5396101, 45.7881648 ] } },
{ "type": "Feature", "id": "node\/529691506", "properties": { "@id": "node\/529691506", "ele": "3090", "name": "Corno di Casamadre", "natural": "peak", "source": "Regione Lombardia - La banca dati territoriali CTR10000 e' prodotta da Regione Lombardia - Infrastruttura per l'Informazione Territoriale" }, "geometry": { "type": "Point", "coordinates": [ 10.5710899, 46.2263231 ] } },
{ "type": "Feature", "id": "node\/530831149", "properties": { "@id": "node\/530831149", "ele": "1899", "name": "Monte Cornetto", "natural": "peak", "wikidata": "Q2737193", "wikipedia": "it:Monte Cornetto" }, "geometry": { "type": "Point", "coordinates": [ 11.1761914, 45.7469759 ] } },
{ "type": "Feature", "id": "node\/533994016", "properties": { "@id": "node\/533994016", "ele": "1807", "name": "Cima del Dil", "natural": "peak", "source": "Regione Lombardia - La banca dati territoriali CTR10000 e' prodotta da Regione Lombardia - Infrastruttura per l'Informazione Territoriale" }, "geometry": { "type": "Point", "coordinates": [ 10.6807808, 45.8323698 ] } },
{ "type": "Feature", "id": "node\/534682274", "properties": { "@id": "node\/534682274", "ele": "2865", "name": "Cima Vagliana", "natural": "peak" }, "geometry": { "type": "Point", "coordinates": [ 10.8933736, 46.2362585 ] } },
{ "type": "Feature", "id": "node\/534683207", "properties": { "@id": "node\/534683207", "ele": "2294", "name": "Mondifrà Basso", "natural": "peak" }, "geometry": { "type": "Point", "coordinates": [ 10.8756963, 46.2549117 ] } },
{ "type": "Feature", "id": "node\/543523594", "properties": { "@id": "node\/543523594", "ele": "1074", "name": "Cima Speggia o Piz dele Agole", "natural": "peak", "tourism": "viewpoint" }, "geometry": { "type": "Point", "coordinates": [ 11.2040717, 46.1717341 ] } },
{ "type": "Feature", "id": "node\/552883079", "properties": { "@id": "node\/552883079", "ele": "1528", "name": "Cima Castion", "natural": "peak" }, "geometry": { "type": "Point", "coordinates": [ 11.2335932, 46.2181695 ] } },
{ "type": "Feature", "id": "node\/582010150", "properties": { "@id": "node\/582010150", "ele": "564", "name": "Mere Spiz", "natural": "peak", "historic": "wayside_cross" }, "geometry": { "type": "Point", "coordinates": [ 11.0680994, 45.8877808 ] } },
{ "type": "Feature", "id": "node\/648548894", "properties": { "@id": "node\/648548894", "ele": "1855", "name": "Malghet Aut", "natural": "peak" }, "geometry": { "type": "Point", "coordinates": [ 10.8510677, 46.290552 ] } },
{ "type": "Feature", "id": "node\/677379995", "properties": { "@id": "node\/677379995", "ele": "2063", "name": "Cima Pissola", "natural": "peak", "summit:cross": "yes", "cross:material": "metal" }, "geometry": { "type": "Point", "coordinates": [ 10.566972, 45.9335592 ] } },
{ "type": "Feature", "id": "node\/717482164", "properties": { "@id": "node\/717482164", "ele": "2210", "name": "Cima Posta", "natural": "peak" }, "geometry": { "type": "Point", "coordinates": [ 11.122496, 45.7274185 ] } },
{ "type": "Feature", "id": "node\/729651433", "properties": { "@id": "node\/729651433", "ele": "2665", "name": "Monte Bruffione", "natural": "peak", "summit:cross": "yes", "cross:material": "metal" }, "geometry": { "type": "Point", "coordinates": [ 10.4915216, 45.9420933 ] } },
{ "type": "Feature", "id": "node\/730760666", "properties": { "@id": "node\/730760666", "ele": "2192", "name": "Grotta Rossa", "natural": "peak" }, "geometry": { "type": "Point", "coordinates": [ 10.5256361, 45.904033 ] } },
{ "type": "Feature", "id": "node\/747049937", "properties": { "@id": "node\/747049937", "ele": "1090", "name": "Cima Rocca", "natural": "peak", "summit:cross": "yes" }, "geometry": { "type": "Point", "coordinates": [ 10.8219577, 45.8722955 ] } },
{ "type": "Feature", "id": "node\/747055529", "properties": { "@id": "node\/747055529", "ele": "2151", "name": "Monte Tofino", "natural": "peak", "wikidata": "Q3862073", "wikipedia": "it:Monte Tofino" }, "geometry": { "type": "Point", "coordinates": [ 10.7726487, 45.9481916 ] } },
{ "type": "Feature", "id": "node\/747055546", "properties": { "@id": "node\/747055546", "ele": "2047", "name": "Gavardina", "natural": "peak" }, "geometry": { "type": "Point", "coordinates": [ 10.7515709, 45.9699393 ] } },
{ "type": "Feature", "id": "node\/752596124", "properties": { "@id": "node\/752596124", "ele": "1382", "name": "Melino", "natural": "peak" }, "geometry": { "type": "Point", "coordinates": [ 10.6084919, 45.9266092 ] } },
{ "type": "Feature", "id": "node\/813173102", "properties": { "@id": "node\/813173102", "ele": "1736", "name": "Corna Piana", "natural": "peak" }, "geometry": { "type": "Point", "coordinates": [ 10.9001876, 45.7927069 ] } },
{ "type": "Feature", "id": "node\/833159826", "properties": { "@id": "node\/833159826", "ele": "1802", "name": "Cima Oro", "natural": "peak", "man_made": "cairn" }, "geometry": { "type": "Point", "coordinates": [ 10.7896992, 45.889617 ] } },
{ "type": "Feature", "id": "node\/835950984", "properties": { "@id": "node\/835950984", "ele": "880", "name": "Col Beo", "natural": "peak", "alt_name": "Dos Beo" }, "geometry": { "type": "Point", "coordinates": [ 10.9159143, 46.0790808 ] } },
{ "type": "Feature", "id": "node\/858400926", "properties": { "@id": "node\/858400926", "ele": "1606", "name": "Monte Vignola", "natural": "peak" }, "geometry": { "type": "Point", "coordinates": [ 10.9691168, 45.7707716 ] } },
{ "type": "Feature", "id": "node\/870273895", "properties": { "@id": "node\/870273895", "ele": "1667", "name": "Cima d'Arza", "natural": "peak" }, "geometry": { "type": "Point", "coordinates": [ 11.1343787, 46.280454 ] } },
{ "type": "Feature", "id": "node\/875513756", "properties": { "@id": "node\/875513756", "ele": "2802", "name": "Cima della Madonna", "natural": "peak", "wikidata": "Q1092013", "source": "dati.trentino.it" }, "geometry": { "type": "Point", "coordinates": [ 11.8487983, 46.2321115 ] } },
{ "type": "Feature", "id": "node\/877597958", "properties": { "@id": "node\/877597958", "ele": "2334", "name": "Hoabonti", "natural": "peak", "summit:cross": "yes" }, "geometry": { "type": "Point", "coordinates": [ 11.3739496, 46.0937167 ] } },
{ "type": "Feature", "id": "node\/910551524", "properties": { "@id": "node\/910551524", "ele": "1287", "name": "Cima Vai", "natural": "peak" }, "geometry": { "type": "Point", "coordinates": [ 10.6854195, 45.8793185 ] } },
{ "type": "Feature", "id": "node\/940214139", "properties": { "@id": "node\/940214139", "ele": "1913", "name": "Palon", "natural": "peak" }, "geometry": { "type": "Point", "coordinates": [ 10.9882526, 45.941583 ] } },
{ "type": "Feature", "id": "node\/982066250", "properties": { "@id": "node\/982066250", "ele": "853", "name": "Venticcia", "natural": "peak" }, "geometry": { "type": "Point", "coordinates": [ 11.2610203, 46.1976116 ] } },
{ "type": "Feature", "id": "node\/982403619", "properties": { "@id": "node\/982403619", "ele": "2084", "name": "Monte Rocca", "natural": "peak" }, "geometry": { "type": "Point", "coordinates": [ 10.9908359, 46.2216204 ] } },
{ "type": "Feature", "id": "node\/982569835", "properties": { "@id": "node\/982569835", "ele": "1896", "name": "Monte Alto", "natural": "peak" }, "geometry": { "type": "Point", "coordinates": [ 10.966572, 46.254136 ] } },
{ "type": "Feature", "id": "node\/982571041", "properties": { "@id": "node\/982571041", "ele": "1961", "name": "Monte Corno", "natural": "peak" }, "geometry": { "type": "Point", "coordinates": [ 10.9792535, 46.2767283 ] } },
{ "type": "Feature", "id": "node\/982574077", "properties": { "@id": "node\/982574077", "ele": "2397", "name": "Cima Vallina", "natural": "peak" }, "geometry": { "type": "Point", "coordinates": [ 10.9338849, 46.2870804 ] } },
{ "type": "Feature", "id": "node\/1028876817", "properties": { "@id": "node\/1028876817", "ele": "1545", "name": "Postemon", "natural": "peak" }, "geometry": { "type": "Point", "coordinates": [ 10.9267321, 45.7728929 ] } },
{ "type": "Feature", "id": "node\/1071250094", "properties": { "@id": "node\/1071250094", "ele": "2062", "name": "Monte Agaro", "natural": "peak" }, "geometry": { "type": "Point", "coordinates": [ 11.6556704, 46.0952518 ] } },
{ "type": "Feature", "id": "node\/1153324675", "properties": { "@id": "node\/1153324675", "ele": "1585", "name": "Cima Borei", "natural": "peak" }, "geometry": { "type": "Point", "coordinates": [ 10.6373362, 45.8797537 ] } },
{ "type": "Feature", "id": "node\/1193226171", "properties": { "@id": "node\/1193226171", "ele": "1929", "name": "Dosso alto", "natural": "peak" }, "geometry": { "type": "Point", "coordinates": [ 11.1415472, 45.841889 ] } },
{ "type": "Feature", "id": "node\/1193243297", "properties": { "@id": "node\/1193243297", "ele": "1968", "name": "Bisorte", "natural": "peak", "loc_name": "Capel de Fer" }, "geometry": { "type": "Point", "coordinates": [ 11.1756803, 45.8286043 ] } },
{ "type": "Feature", "id": "node\/1262475458", "properties": { "@id": "node\/1262475458", "ele": "1405", "name": "Monte Cocca", "natural": "peak" }, "geometry": { "type": "Point", "coordinates": [ 10.7502985, 45.8955845 ] } },
{ "type": "Feature", "id": "node\/1287800195", "properties": { "@id": "node\/1287800195", "ele": "1051", "name": "Rocca Pia", "natural": "peak" }, "geometry": { "type": "Point", "coordinates": [ 10.9330004, 45.6771542 ] } },
{ "type": "Feature", "id": "node\/1290187066", "properties": { "@id": "node\/1290187066", "ele": "2467", "name": "Cima Scanaiòl", "natural": "peak" }, "geometry": { "type": "Point", "coordinates": [ 11.7664607, 46.2148405 ] } },
{ "type": "Feature", "id": "node\/1331070278", "properties": { "@id": "node\/1331070278", "ele": "2346", "name": "Cima Inferno", "natural": "peak", "source": "3rd Military Mapping Survey of Austria-Hungary" }, "geometry": { "type": "Point", "coordinates": [ 11.4546558, 46.2148419 ] } },
{ "type": "Feature", "id": "node\/1331133148", "properties": { "@id": "node\/1331133148", "ele": "1471", "name": "Doss dei Corvi", "natural": "peak", "source:ele": "3rd Military Mapping Survey of Austria-Hungary" }, "geometry": { "type": "Point", "coordinates": [ 11.1875173, 46.0452704 ] } },
{ "type": "Feature", "id": "node\/1363007493", "properties": { "@id": "node\/1363007493", "ele": "2940", "name": "Piz Selva", "natural": "peak" }, "geometry": { "type": "Point", "coordinates": [ 11.7910475, 46.5148198 ] } },
{ "type": "Feature", "id": "node\/1386754060", "properties": { "@id": "node\/1386754060", "ele": "889", "name": "Cima del Doss", "natural": "peak" }, "geometry": { "type": "Point", "coordinates": [ 10.9547666, 46.127048 ] } },
{ "type": "Feature", "id": "node\/1389912649", "properties": { "@id": "node\/1389912649", "ele": "1630", "name": "Monte Casale", "natural": "peak", "wikidata": "Q1506899", "man_made": "cross", "height": "10" }, "geometry": { "type": "Point", "coordinates": [ 10.9276592, 46.031499 ] } },
{ "type": "Feature", "id": "node\/1393597346", "properties": { "@id": "node\/1393597346", "ele": "1576", "name": "Monte dell'Orso", "natural": "peak" }, "geometry": { "type": "Point", "coordinates": [ 11.2796713, 46.2498888 ] } },
{ "type": "Feature", "id": "node\/1395679400", "properties": { "@id": "node\/1395679400", "ele": "2685", "name": "Cima Boai", "natural": "peak" }, "geometry": { "type": "Point", "coordinates": [ 10.6691151, 46.3193281 ] } },
{ "type": "Feature", "id": "node\/1395854840", "properties": { "@id": "node\/1395854840", "ele": "291", "name": "Dosso Santa Margherita", "natural": "peak" }, "geometry": { "type": "Point", "coordinates": [ 11.0610141, 46.2394867 ] } },
{ "type": "Feature", "id": "node\/1398901228", "properties": { "@id": "node\/1398901228", "ele": "1938", "name": "Becco della Zeriola", "natural": "peak" }, "geometry": { "type": "Point", "coordinates": [ 11.1574169, 45.9776726 ] } },
{ "type": "Feature", "id": "node\/1414854971", "properties": { "@id": "node\/1414854971", "ele": "2320", "name": "Monte Peller", "natural": "peak", "wikidata": "Q3861821", "wikipedia": "it:Monte Peller" }, "geometry": { "type": "Point", "coordinates": [ 10.9456837, 46.3150067 ] } },
{ "type": "Feature", "id": "node\/1417512141", "properties": { "@id": "node\/1417512141", "ele": "2408", "name": "Cima Lasteati", "natural": "peak" }, "geometry": { "type": "Point", "coordinates": [ 11.5682732, 46.161021 ] } },
{ "type": "Feature", "id": "node\/1417512162", "properties": { "@id": "node\/1417512162", "ele": "1583", "name": "Col Tramenaga", "natural": "peak" }, "geometry": { "type": "Point", "coordinates": [ 11.4889809, 46.1340351 ] } },
{ "type": "Feature", "id": "node\/1417512167", "properties": { "@id": "node\/1417512167", "ele": "2114", "name": "Col della Palazzina", "natural": "peak" }, "geometry": { "type": "Point", "coordinates": [ 11.5366136, 46.177734 ] } },
{ "type": "Feature", "id": "node\/1417512173", "properties": { "@id": "node\/1417512173", "ele": "2278", "name": "Monte Cenon", "natural": "peak", "summit:cross": "yes" }, "geometry": { "type": "Point", "coordinates": [ 11.5290937, 46.1260302 ] } },
{ "type": "Feature", "id": "node\/1417512180", "properties": { "@id": "node\/1417512180", "ele": "2498", "name": "Monte Montalon", "natural": "peak" }, "geometry": { "type": "Point", "coordinates": [ 11.5060823, 46.1909191 ] } },
{ "type": "Feature", "id": "node\/1422507891", "properties": { "@id": "node\/1422507891", "ele": "1381", "name": "Dosso Cristina", "natural": "peak", "summit:cross": "yes", "historic": "wayside_cross" }, "geometry": { "type": "Point", "coordinates": [ 11.14744, 45.8898119 ] } },
{ "type": "Feature", "id": "node\/1429927571", "properties": { "@id": "node\/1429927571", "ele": "1702", "name": "Monte Spil", "natural": "peak" }, "geometry": { "type": "Point", "coordinates": [ 11.1095594, 45.8258136 ] } },
{ "type": "Feature", "id": "node\/1434836595", "properties": { "@id": "node\/1434836595", "ele": "1778", "name": "Corno Battisti", "natural": "peak", "wikidata": "Q3861483", "wikipedia": "it:Monte Corno Battisti" }, "geometry": { "type": "Point", "coordinates": [ 11.1233623, 45.811739 ] } },
{ "type": "Feature", "id": "node\/1446244749", "properties": { "@id": "node\/1446244749", "ele": "2715", "name": "Monte Colac", "natural": "peak" }, "geometry": { "type": "Point", "coordinates": [ 11.782724, 46.4410262 ] } },
{ "type": "Feature", "id": "node\/1447971848", "properties": { "@id": "node\/1447971848", "ele": "1258", "name": "Zugna Torta", "natural": "peak" }, "geometry": { "type": "Point", "coordinates": [ 11.0528231, 45.8376504 ] } },
{ "type": "Feature", "id": "node\/1489426274", "properties": { "@id": "node\/1489426274", "ele": "1097", "name": "Tamazol", "natural": "peak", "place": "locality" }, "geometry": { "type": "Point", "coordinates": [ 11.2592308, 45.9708781 ] } },
{ "type": "Feature", "id": "node\/1531722549", "properties": { "@id": "node\/1531722549", "ele": "1644", "name": "Cima Mezzana", "natural": "peak" }, "geometry": { "type": "Point", "coordinates": [ 11.0852324, 45.7707331 ] } },
{ "type": "Feature", "id": "node\/1531768590", "properties": { "@id": "node\/1531768590", "ele": "1708", "name": "Cima Selvata", "natural": "peak" }, "geometry": { "type": "Point", "coordinates": [ 11.0717862, 45.7862506 ] } },
{ "type": "Feature", "id": "node\/1538301051", "properties": { "@id": "node\/1538301051", "ele": "2200", "name": "Piz Meda", "natural": "peak" }, "geometry": { "type": "Point", "coordinates": [ 11.690552, 46.3789381 ] } },
{ "type": "Feature", "id": "node\/1563100645", "properties": { "@id": "node\/1563100645", "ele": "1491", "name": "Cima Redasega", "natural": "peak", "source": "dati.trentino.it" }, "geometry": { "type": "Point", "coordinates": [ 11.7806541, 46.1642942 ] } },
{ "type": "Feature", "id": "node\/1574052368", "properties": { "@id": "node\/1574052368", "ele": "1667", "name": "Monte Campo", "natural": "peak", "wikidata": "Q18026175" }, "geometry": { "type": "Point", "coordinates": [ 10.9140261, 45.8108748 ] } },
{ "type": "Feature", "id": "node\/1586368291", "properties": { "@id": "node\/1586368291", "ele": "1837", "name": "La Rosta", "natural": "peak" }, "geometry": { "type": "Point", "coordinates": [ 11.0240195, 46.0162643 ] } },
{ "type": "Feature", "id": "node\/1589793268", "properties": { "@id": "node\/1589793268", "ele": "1244", "name": "Monte Dozza", "natural": "peak" }, "geometry": { "type": "Point", "coordinates": [ 11.1166496, 46.2629944 ] } },
{ "type": "Feature", "id": "node\/1594462493", "properties": { "@id": "node\/1594462493", "ele": "1957", "name": "Cima Pontara", "natural": "peak" }, "geometry": { "type": "Point", "coordinates": [ 11.334345, 46.1465975 ] } },
{ "type": "Feature", "id": "node\/1680328405", "properties": { "@id": "node\/1680328405", "ele": "1223", "name": "Dos Remit", "natural": "peak" }, "geometry": { "type": "Point", "coordinates": [ 10.8995707, 45.8443124 ] } },
{ "type": "Feature", "id": "node\/1738443687", "properties": { "@id": "node\/1738443687", "ele": "380", "name": "Dos de Gàrdole", "natural": "peak" }, "geometry": { "type": "Point", "coordinates": [ 11.0529761, 45.9105714 ] } },
{ "type": "Feature", "id": "node\/1743505628", "properties": { "@id": "node\/1743505628", "ele": "717", "name": "Monte Croce", "natural": "peak", "summit:cross": "yes", "historic": "wayside_cross", "man_made": "cross", "loc_name": "XIVa stazione" }, "geometry": { "type": "Point", "coordinates": [ 11.0505846, 46.0763349 ] } },
{ "type": "Feature", "id": "node\/1775862125", "properties": { "@id": "node\/1775862125", "ele": "1350", "name": "Dos Pagano", "natural": "peak", "tourism": "viewpoint" }, "geometry": { "type": "Point", "coordinates": [ 11.0655991, 45.9592768 ] } },
{ "type": "Feature", "id": "node\/1775976838", "properties": { "@id": "node\/1775976838", "ele": "1866", "name": "Gantkofel - Macaion", "natural": "peak", "wikidata": "Q499264", "wikipedia": "it:Monte Macaion", "name:de": "Gantkofel", "name:it": "Monte Macaion", "tourism": "viewpoint" }, "geometry": { "type": "Point", "coordinates": [ 11.2094293, 46.4943919 ] } },
{ "type": "Feature", "id": "node\/1817645261", "properties": { "@id": "node\/1817645261", "ele": "1670", "name": "Dosso delle Somme", "natural": "peak" }, "geometry": { "type": "Point", "coordinates": [ 11.1881343, 45.8790265 ] } },
{ "type": "Feature", "id": "node\/1817647310", "properties": { "@id": "node\/1817647310", "ele": "1705", "name": "Monte Maronia", "natural": "peak" }, "geometry": { "type": "Point", "coordinates": [ 11.2124703, 45.8705678 ] } },
{ "type": "Feature", "id": "node\/1819124627", "properties": { "@id": "node\/1819124627", "ele": "2791", "name": "Cima di Val di Roda", "natural": "peak", "fixme": "check exact position" }, "geometry": { "type": "Point", "coordinates": [ 11.8398668, 46.2463073 ] } },
{ "type": "Feature", "id": "node\/1829954583", "properties": { "@id": "node\/1829954583", "ele": "2318", "name": "Cima Lancia", "natural": "peak", "summit:cross": "yes" }, "geometry": { "type": "Point", "coordinates": [ 10.7400505, 46.191052 ] } },
{ "type": "Feature", "id": "node\/1835218898", "properties": { "@id": "node\/1835218898", "ele": "2182", "name": "Cingolo Rosso", "natural": "peak" }, "geometry": { "type": "Point", "coordinates": [ 10.5336335, 45.9248176 ] } },
{ "type": "Feature", "id": "node\/1868700830", "properties": { "@id": "node\/1868700830", "ele": "3354", "name": "Crozzon di Lares", "natural": "peak", "wikidata": "Q3698743", "wikipedia": "it:Crozzon di Lares" }, "geometry": { "type": "Point", "coordinates": [ 10.5921452, 46.1485487 ] } },
{ "type": "Feature", "id": "node\/1881387397", "properties": { "@id": "node\/1881387397", "ele": "950", "name": "La Padella", "natural": "peak" }, "geometry": { "type": "Point", "coordinates": [ 11.1106163, 45.9195235 ] } },
{ "type": "Feature", "id": "node\/1890686749", "properties": { "@id": "node\/1890686749", "ele": "1788", "name": "Col Santo", "natural": "peak" }, "geometry": { "type": "Point", "coordinates": [ 11.7989967, 46.2074138 ] } },
{ "type": "Feature", "id": "node\/1918994431", "properties": { "@id": "node\/1918994431", "ele": "1052", "name": "Doss Da Bugo", "natural": "peak", "source": "map - i 60 km dell'altopiano della vigolana" }, "geometry": { "type": "Point", "coordinates": [ 11.2056224, 45.9840822 ] } },
{ "type": "Feature", "id": "node\/1920533025", "properties": { "@id": "node\/1920533025", "ele": "1577", "name": "Parolet", "natural": "peak" }, "geometry": { "type": "Point", "coordinates": [ 11.0760313, 46.0238319 ] } },
{ "type": "Feature", "id": "node\/1923765101", "properties": { "@id": "node\/1923765101", "ele": "851", "name": "Sommi", "natural": "peak", "source": "Kompass - 631 - Altipiani di Folgaria Lavarone e Luserna" }, "geometry": { "type": "Point", "coordinates": [ 11.2435183, 45.9883896 ] } },
{ "type": "Feature", "id": "node\/1970573624", "properties": { "@id": "node\/1970573624", "ele": "2420", "name": "Monte Pin", "natural": "peak" }, "geometry": { "type": "Point", "coordinates": [ 10.9670801, 46.4344631 ] } },
{ "type": "Feature", "id": "node\/1970751374", "properties": { "@id": "node\/1970751374", "ele": "2650", "name": "Stübele - Cima Stubele", "natural": "peak", "wikidata": "Q3676768", "wikipedia": "it:Cima Stubele" }, "geometry": { "type": "Point", "coordinates": [ 10.9379094, 46.4669534 ] } },
{ "type": "Feature", "id": "node\/2000632578", "properties": { "@id": "node\/2000632578", "ele": "1885", "name": "Dos di Laven", "natural": "peak", "wikidata": "Q31647648" }, "geometry": { "type": "Point", "coordinates": [ 10.5596392, 45.8954814 ] } },
{ "type": "Feature", "id": "node\/2084543779", "properties": { "@id": "node\/2084543779", "ele": "1566", "name": "Monte Ozol", "natural": "peak", "wikidata": "Q3861802", "wikipedia": "it:Monte Ozol" }, "geometry": { "type": "Point", "coordinates": [ 11.0538299, 46.4191932 ] } },
{ "type": "Feature", "id": "node\/2084544761", "properties": { "@id": "node\/2084544761", "ele": "1520", "name": "Rufer", "natural": "peak" }, "geometry": { "type": "Point", "coordinates": [ 11.074897, 46.4411141 ] } },
{ "type": "Feature", "id": "node\/2185939771", "properties": { "@id": "node\/2185939771", "ele": "1867", "name": "Cimon di Fradusta", "natural": "peak", "summit:cross": "yes" }, "geometry": { "type": "Point", "coordinates": [ 11.86704, 46.1658692 ] } },
{ "type": "Feature", "id": "node\/2208275958", "properties": { "@id": "node\/2208275958", "ele": "2305", "name": "Cima Valles o Venegia", "natural": "peak", "tourism": "information" }, "geometry": { "type": "Point", "coordinates": [ 11.8029931, 46.3327604 ] } },
{ "type": "Feature", "id": "node\/2231885340", "properties": { "@id": "node\/2231885340", "ele": "2446", "name": "Sasso delle Dodici", "natural": "peak", "summit:cross": "yes" }, "geometry": { "type": "Point", "coordinates": [ 11.7007536, 46.4080754 ] } },
{ "type": "Feature", "id": "node\/2235869443", "properties": { "@id": "node\/2235869443", "ele": "2206", "name": "Cima dei Paradisi", "natural": "peak" }, "geometry": { "type": "Point", "coordinates": [ 11.6627627, 46.2301089 ] } },
{ "type": "Feature", "id": "node\/2235869457", "properties": { "@id": "node\/2235869457", "ele": "963", "name": "Pecolet", "natural": "peak" }, "geometry": { "type": "Point", "coordinates": [ 11.7735853, 46.1470163 ] } },
{ "type": "Feature", "id": "node\/2367637735", "properties": { "@id": "node\/2367637735", "ele": "2973", "name": "Redival", "natural": "peak", "summit:cross": "yes" }, "geometry": { "type": "Point", "coordinates": [ 10.6137921, 46.3086948 ] } },
{ "type": "Feature", "id": "node\/2371033647", "properties": { "@id": "node\/2371033647", "ele": "2975", "name": "Cima Cop di Casa", "natural": "peak", "wikidata": "Q31635170", "source": "dati.trentino.it" }, "geometry": { "type": "Point", "coordinates": [ 10.5847924, 46.0684932 ] } },
{ "type": "Feature", "id": "node\/2371033648", "properties": { "@id": "node\/2371033648", "ele": "2291", "name": "Cima Larga", "natural": "peak", "source": "dati.trentino.it" }, "geometry": { "type": "Point", "coordinates": [ 10.4891748, 46.0065709 ] } },
{ "type": "Feature", "id": "node\/2371033650", "properties": { "@id": "node\/2371033650", "ele": "2889", "name": "Cima Valbona", "natural": "peak", "source": "dati.trentino.it" }, "geometry": { "type": "Point", "coordinates": [ 10.5712678, 46.0242172 ] } },
{ "type": "Feature", "id": "node\/2371033652", "properties": { "@id": "node\/2371033652", "ele": "2658", "name": "Cima d'Avolo", "natural": "peak", "source": "dati.trentino.it" }, "geometry": { "type": "Point", "coordinates": [ 10.4943455, 46.0547116 ] } },
{ "type": "Feature", "id": "node\/2371033655", "properties": { "@id": "node\/2371033655", "ele": "2820", "name": "Corno di Trivena", "natural": "peak" }, "geometry": { "type": "Point", "coordinates": [ 10.569321, 46.052418 ] } },
{ "type": "Feature", "id": "node\/2371033656", "properties": { "@id": "node\/2371033656", "ele": "2939", "name": "Corno di Vigo", "natural": "peak", "source": "dati.trentino.it" }, "geometry": { "type": "Point", "coordinates": [ 10.5917038, 46.0869259 ] } },
{ "type": "Feature", "id": "node\/2371033658", "properties": { "@id": "node\/2371033658", "ele": "2058", "name": "La Piramide", "natural": "peak", "source": "dati.trentino.it" }, "geometry": { "type": "Point", "coordinates": [ 10.5091601, 45.9920718 ] } },
{ "type": "Feature", "id": "node\/2371177754", "properties": { "@id": "node\/2371177754", "ele": "2015", "name": "Cingol del Sal", "natural": "peak" }, "geometry": { "type": "Point", "coordinates": [ 10.6019113, 45.9874007 ] } },
{ "type": "Feature", "id": "node\/2371177755", "properties": { "@id": "node\/2371177755", "ele": "2193", "name": "Monte Benna", "natural": "peak", "source": "dati.trentino.it" }, "geometry": { "type": "Point", "coordinates": [ 10.6263114, 46.0078642 ] } },
{ "type": "Feature", "id": "node\/2381716737", "properties": { "@id": "node\/2381716737", "ele": "981", "name": "Dos de Trat", "natural": "peak" }, "geometry": { "type": "Point", "coordinates": [ 10.7542474, 45.8671627 ] } },
{ "type": "Feature", "id": "node\/2384660859", "properties": { "@id": "node\/2384660859", "ele": "1778", "name": "Monte Varagna", "natural": "peak" }, "geometry": { "type": "Point", "coordinates": [ 10.8948388, 45.8259357 ] } },
{ "type": "Feature", "id": "node\/2387629752", "properties": { "@id": "node\/2387629752", "ele": "1662", "name": "Toval", "natural": "peak" }, "geometry": { "type": "Point", "coordinates": [ 11.2013883, 46.4266705 ] } },
{ "type": "Feature", "id": "node\/2401446694", "properties": { "@id": "node\/2401446694", "ele": "1603", "name": "Monte Aguz", "natural": "peak" }, "geometry": { "type": "Point", "coordinates": [ 11.0446504, 45.7224622 ] } },
{ "type": "Feature", "id": "node\/2420718078", "properties": { "@id": "node\/2420718078", "ele": "1279", "name": "San Lorenzo", "natural": "peak" }, "geometry": { "type": "Point", "coordinates": [ 11.438837, 46.0275331 ] } },
{ "type": "Feature", "id": "node\/2421046515", "properties": { "@id": "node\/2421046515", "ele": "1030", "name": "Monte Civeron", "natural": "peak" }, "geometry": { "type": "Point", "coordinates": [ 11.4860218, 46.0356318 ] } },
{ "type": "Feature", "id": "node\/2426949808", "properties": { "@id": "node\/2426949808", "ele": "2969", "name": "Punta d'Albiolo", "natural": "peak" }, "geometry": { "type": "Point", "coordinates": [ 10.5793619, 46.2981966 ] } },
{ "type": "Feature", "id": "node\/2440325468", "properties": { "@id": "node\/2440325468", "ele": "1677", "name": "Monte Salvat", "natural": "peak" }, "geometry": { "type": "Point", "coordinates": [ 10.7538424, 46.2931049 ] } },
{ "type": "Feature", "id": "node\/2447924989", "properties": { "@id": "node\/2447924989", "ele": "1856", "name": "Cerva - Paterkopf", "natural": "peak", "name:de": "Paterkopf", "name:it": "Cerva" }, "geometry": { "type": "Point", "coordinates": [ 11.2051769, 46.3671874 ] } },
{ "type": "Feature", "id": "node\/2489783195", "properties": { "@id": "node\/2489783195", "ele": "1256", "name": "Col Camoz", "natural": "peak" }, "geometry": { "type": "Point", "coordinates": [ 11.8074852, 46.1284606 ] } },
{ "type": "Feature", "id": "node\/2489823666", "properties": { "@id": "node\/2489823666", "ele": "1561", "name": "Agheré", "natural": "peak" }, "geometry": { "type": "Point", "coordinates": [ 11.85924, 46.1250785 ] } },
{ "type": "Feature", "id": "node\/2489823707", "properties": { "@id": "node\/2489823707", "ele": "1731", "name": "Colfierech", "natural": "peak" }, "geometry": { "type": "Point", "coordinates": [ 11.8797632, 46.1468809 ] } },
{ "type": "Feature", "id": "node\/2489823710", "properties": { "@id": "node\/2489823710", "ele": "1313", "name": "Cordognè", "natural": "peak" }, "geometry": { "type": "Point", "coordinates": [ 11.8362445, 46.1433497 ] } },
{ "type": "Feature", "id": "node\/2489823730", "properties": { "@id": "node\/2489823730", "ele": "2229", "name": "Monte Neva", "natural": "peak", "summit:register": "yes" }, "geometry": { "type": "Point", "coordinates": [ 11.9093502, 46.1561816 ] } },
{ "type": "Feature", "id": "node\/2491762671", "properties": { "@id": "node\/2491762671", "ele": "2220", "name": "Cima Tognòla", "natural": "peak", "upload": "yes" }, "geometry": { "type": "Point", "coordinates": [ 11.7719141, 46.2321808 ] } },
{ "type": "Feature", "id": "node\/2491762761", "properties": { "@id": "node\/2491762761", "ele": "1003", "name": "Col di Muri", "natural": "peak" }, "geometry": { "type": "Point", "coordinates": [ 11.7820331, 46.1134723 ] } },
{ "type": "Feature", "id": "node\/2491762814", "properties": { "@id": "node\/2491762814", "ele": "2006", "name": "Dalàibol", "natural": "peak", "upload": "yes" }, "geometry": { "type": "Point", "coordinates": [ 11.8946695, 46.2011865 ] } },
{ "type": "Feature", "id": "node\/2491762885", "properties": { "@id": "node\/2491762885", "ele": "2044", "name": "Pale del Garfol", "natural": "peak", "upload": "yes" }, "geometry": { "type": "Point", "coordinates": [ 11.9224158, 46.1825464 ] } },
{ "type": "Feature", "id": "node\/2491762930", "properties": { "@id": "node\/2491762930", "ele": "2275", "name": "Punta Caldrolon", "natural": "peak", "upload": "yes" }, "geometry": { "type": "Point", "coordinates": [ 11.9116864, 46.2256385 ] } },
{ "type": "Feature", "id": "node\/2491762937", "properties": { "@id": "node\/2491762937", "ele": "2229", "name": "Punta Cés", "natural": "peak", "upload": "yes" }, "geometry": { "type": "Point", "coordinates": [ 11.7556107, 46.2682316 ] } },
{ "type": "Feature", "id": "node\/2491763038", "properties": { "@id": "node\/2491763038", "ele": "2207", "name": "Tognazza", "natural": "peak", "upload": "yes" }, "geometry": { "type": "Point", "coordinates": [ 11.7865908, 46.2879833 ] } },
{ "type": "Feature", "id": "node\/2491763045", "properties": { "@id": "node\/2491763045", "ele": "2185", "name": "Tognòla", "natural": "peak", "upload": "yes" }, "geometry": { "type": "Point", "coordinates": [ 11.7263169, 46.2334155 ] } },
{ "type": "Feature", "id": "node\/2491763060", "properties": { "@id": "node\/2491763060", "ele": "2382", "name": "Tognòla", "natural": "peak", "upload": "yes" }, "geometry": { "type": "Point", "coordinates": [ 11.7535236, 46.2512687 ] } },
{ "type": "Feature", "id": "node\/2638134915", "properties": { "@id": "node\/2638134915", "ele": "862", "name": "Monte Corona", "natural": "peak" }, "geometry": { "type": "Point", "coordinates": [ 11.0311697, 45.9424247 ] } },
{ "type": "Feature", "id": "node\/2661346320", "properties": { "@id": "node\/2661346320", "ele": "1404", "name": "Col della Cimogna", "natural": "peak" }, "geometry": { "type": "Point", "coordinates": [ 11.6641593, 46.0189579 ] } },
{ "type": "Feature", "id": "node\/2745704163", "properties": { "@id": "node\/2745704163", "ele": "2034", "name": "Canfedin", "natural": "peak", "tourism": "viewpoint" }, "geometry": { "type": "Point", "coordinates": [ 11.0138787, 46.1191074 ] } },
{ "type": "Feature", "id": "node\/2870620656", "properties": { "@id": "node\/2870620656", "ele": "2144", "name": "Roite", "natural": "peak" }, "geometry": { "type": "Point", "coordinates": [ 11.1608203, 45.8090152 ] } },
{ "type": "Feature", "id": "node\/2875982368", "properties": { "@id": "node\/2875982368", "ele": "1282", "name": "Monte Rust", "natural": "peak" }, "geometry": { "type": "Point", "coordinates": [ 11.2446995, 45.9383814 ] } },
{ "type": "Feature", "id": "node\/2876204002", "properties": { "@id": "node\/2876204002", "ele": "645", "name": "Monte Giovo", "natural": "peak" }, "geometry": { "type": "Point", "coordinates": [ 10.9635715, 45.8374041 ] } },
{ "type": "Feature", "id": "node\/2926157214", "properties": { "@id": "node\/2926157214", "ele": "1991", "name": "Monte Plische", "natural": "peak", "wikidata": "Q3861853", "wikipedia": "it:Monte Plische" }, "geometry": { "type": "Point", "coordinates": [ 11.1359975, 45.7018955 ] } },
{ "type": "Feature", "id": "node\/2955903183", "properties": { "@id": "node\/2955903183", "ele": "2800", "name": "Cima Baselga", "natural": "peak" }, "geometry": { "type": "Point", "coordinates": [ 10.7533452, 46.2519142 ] } },
{ "type": "Feature", "id": "node\/2955903185", "properties": { "@id": "node\/2955903185", "ele": "2619", "name": "Cima di Stavei", "natural": "peak" }, "geometry": { "type": "Point", "coordinates": [ 10.7158933, 46.2661998 ] } },
{ "type": "Feature", "id": "node\/2999363304", "properties": { "@id": "node\/2999363304", "ele": "2696", "name": "Monte Tonale Orientale", "natural": "peak" }, "geometry": { "type": "Point", "coordinates": [ 10.5945757, 46.2851249 ] } },
{ "type": "Feature", "id": "node\/3016351063", "properties": { "@id": "node\/3016351063", "ele": "2713", "name": "Cima Ghez", "natural": "peak", "man_made": "cross", "height": "10" }, "geometry": { "type": "Point", "coordinates": [ 10.9037207, 46.1240552 ] } },
{ "type": "Feature", "id": "node\/3052528911", "properties": { "@id": "node\/3052528911", "ele": "2969", "name": "Punte di Campiglio", "natural": "peak" }, "geometry": { "type": "Point", "coordinates": [ 10.881255, 46.1813698 ] } },
{ "type": "Feature", "id": "node\/3060820454", "properties": { "@id": "node\/3060820454", "ele": "2525", "name": "Corno Alto", "natural": "peak" }, "geometry": { "type": "Point", "coordinates": [ 10.6388, 46.0975 ] } },
{ "type": "Feature", "id": "node\/3060820461", "properties": { "@id": "node\/3060820461", "ele": "2023", "name": "Palette", "natural": "peak" }, "geometry": { "type": "Point", "coordinates": [ 10.7077, 46.1128 ] } },
{ "type": "Feature", "id": "node\/3060883521", "properties": { "@id": "node\/3060883521", "ele": "2230", "name": "Col Dal Baranchie", "natural": "peak" }, "geometry": { "type": "Point", "coordinates": [ 11.8483, 46.4571 ] } },
{ "type": "Feature", "id": "node\/3082301426", "properties": { "@id": "node\/3082301426", "ele": "3630", "name": "Punta Linke", "natural": "peak" }, "geometry": { "type": "Point", "coordinates": [ 10.6274317, 46.4006862 ] } },
{ "type": "Feature", "id": "node\/3092058095", "properties": { "@id": "node\/3092058095", "ele": "2320", "name": "Sasso Rosso", "natural": "peak", "name:mhn": "Auzerschrum" }, "geometry": { "type": "Point", "coordinates": [ 11.3996317, 46.12133 ] } },
{ "type": "Feature", "id": "node\/3110186438", "properties": { "@id": "node\/3110186438", "ele": "1804", "name": "Campidei", "natural": "peak" }, "geometry": { "type": "Point", "coordinates": [ 11.3291281, 46.1628595 ] } },
{ "type": "Feature", "id": "node\/3110857756", "properties": { "@id": "node\/3110857756", "ele": "1982.5", "name": "Stocher", "natural": "peak" }, "geometry": { "type": "Point", "coordinates": [ 11.3706209, 46.1207161 ] } },
{ "type": "Feature", "id": "node\/3115293193", "properties": { "@id": "node\/3115293193", "ele": "2171", "name": "Costa Onchieli", "natural": "peak" }, "geometry": { "type": "Point", "coordinates": [ 11.4428679, 46.186833 ] } },
{ "type": "Feature", "id": "node\/3115484810", "properties": { "@id": "node\/3115484810", "ele": "1450", "name": "Punta Polse", "natural": "peak", "wikidata": "Q3925705", "wikipedia": "it:Punta Polse", "summit:cross": "yes" }, "geometry": { "type": "Point", "coordinates": [ 11.5587841, 46.2924375 ] } },
{ "type": "Feature", "id": "node\/3133542108", "properties": { "@id": "node\/3133542108", "ele": "1392", "name": "Bocca di Valle", "natural": "peak" }, "geometry": { "type": "Point", "coordinates": [ 10.5821264, 45.7940647 ] } },
{ "type": "Feature", "id": "node\/3141907201", "properties": { "@id": "node\/3141907201", "ele": "1867", "name": "Cima Laste", "natural": "peak" }, "geometry": { "type": "Point", "coordinates": [ 11.4074106, 45.9818638 ] } },
{ "type": "Feature", "id": "node\/3156436318", "properties": { "@id": "node\/3156436318", "ele": "1705", "name": "Dosso Dell'asino", "natural": "peak" }, "geometry": { "type": "Point", "coordinates": [ 10.9918, 46.369 ] } },
{ "type": "Feature", "id": "node\/3156436328", "properties": { "@id": "node\/3156436328", "ele": "1376", "name": "Monte Vezzena", "natural": "peak" }, "geometry": { "type": "Point", "coordinates": [ 10.9391, 46.3396 ] } },
{ "type": "Feature", "id": "node\/3156436329", "properties": { "@id": "node\/3156436329", "ele": "2242", "name": "Pale Di Sadron", "natural": "peak" }, "geometry": { "type": "Point", "coordinates": [ 10.9095, 46.2982 ] } },
{ "type": "Feature", "id": "node\/3191416743", "properties": { "@id": "node\/3191416743", "ele": "2542", "name": "Cima De Copola", "natural": "peak" }, "geometry": { "type": "Point", "coordinates": [ 11.559428, 46.2219212 ] } },
{ "type": "Feature", "id": "node\/3212603017", "properties": { "@id": "node\/3212603017", "ele": "1387", "name": "Monte Cucco", "natural": "peak" }, "geometry": { "type": "Point", "coordinates": [ 11.5939392, 45.9795705 ] } },
{ "type": "Feature", "id": "node\/3329621990", "properties": { "@id": "node\/3329621990", "ele": "816", "name": "Dos Croz", "natural": "peak", "description": "Nome alternativo: \"Dos de S.Cros\"", "cross": "yes" }, "geometry": { "type": "Point", "coordinates": [ 10.9665143, 45.9829354 ] } },
{ "type": "Feature", "id": "node\/3338285555", "properties": { "@id": "node\/3338285555", "ele": "1375", "name": "Croz delle Ore", "natural": "peak" }, "geometry": { "type": "Point", "coordinates": [ 11.1806545, 46.017563 ] } },
{ "type": "Feature", "id": "node\/3351626574", "properties": { "@id": "node\/3351626574", "ele": "1705", "name": "Cima del Casaret", "natural": "peak" }, "geometry": { "type": "Point", "coordinates": [ 11.3529932, 46.1895051 ] } },
{ "type": "Feature", "id": "node\/3383660640", "properties": { "@id": "node\/3383660640", "ele": "2186", "name": "Monte Ciste", "natural": "peak" }, "geometry": { "type": "Point", "coordinates": [ 11.4470812, 46.1131815 ] } },
{ "type": "Feature", "id": "node\/3439438295", "properties": { "@id": "node\/3439438295", "ele": "1074", "name": "Col delle Mandre", "natural": "peak" }, "geometry": { "type": "Point", "coordinates": [ 11.683548, 45.9860604 ] } },
{ "type": "Feature", "id": "node\/3440144398", "properties": { "@id": "node\/3440144398", "ele": "1421", "name": "Monte Picosta", "natural": "peak" }, "geometry": { "type": "Point", "coordinates": [ 11.6760598, 46.0516795 ] } },
{ "type": "Feature", "id": "node\/3440144399", "properties": { "@id": "node\/3440144399", "ele": "1291", "name": "Monte Valnappe", "natural": "peak" }, "geometry": { "type": "Point", "coordinates": [ 11.6476173, 46.0320187 ] } },
{ "type": "Feature", "id": "node\/3496962199", "properties": { "@id": "node\/3496962199", "ele": "759", "name": "Dos de la Popa", "natural": "peak" }, "geometry": { "type": "Point", "coordinates": [ 10.9936056, 45.9745724 ] } },
{ "type": "Feature", "id": "node\/3497045844", "properties": { "@id": "node\/3497045844", "ele": "1737", "name": "La Becca", "natural": "peak" }, "geometry": { "type": "Point", "coordinates": [ 11.014421, 45.9641181 ] } },
{ "type": "Feature", "id": "node\/3599077077", "properties": { "@id": "node\/3599077077", "ele": "2780", "name": "Molignon di Fuori", "natural": "peak", "source": "Geobrowser der Autonomen Provinz Bozen" }, "geometry": { "type": "Point", "coordinates": [ 11.6440589, 46.4877559 ] } },
{ "type": "Feature", "id": "node\/3648501133", "properties": { "@id": "node\/3648501133", "ele": "2427", "name": "Monte Zeledria", "natural": "peak" }, "geometry": { "type": "Point", "coordinates": [ 10.8027903, 46.2506775 ] } },
{ "type": "Feature", "id": "node\/3676444925", "properties": { "@id": "node\/3676444925", "ele": "2494", "name": "Monte Cauriol", "natural": "peak", "wikidata": "Q3861427", "wikipedia": "it:Monte Cauriol", "summit:cross": "yes" }, "geometry": { "type": "Point", "coordinates": [ 11.5964133, 46.2353094 ] } },
{ "type": "Feature", "id": "node\/3679207854", "properties": { "@id": "node\/3679207854", "ele": "1858", "name": "Il Camin", "natural": "peak" }, "geometry": { "type": "Point", "coordinates": [ 11.3522589, 45.9765185 ] } },
{ "type": "Feature", "id": "node\/3679225110", "properties": { "@id": "node\/3679225110", "ele": "1305", "name": "Monte Naspo", "natural": "peak" }, "geometry": { "type": "Point", "coordinates": [ 11.3214022, 45.9776289 ] } },
{ "type": "Feature", "id": "node\/3679464481", "properties": { "@id": "node\/3679464481", "ele": "2300", "name": "Pala de la Madòna", "natural": "peak" }, "geometry": { "type": "Point", "coordinates": [ 11.3923268, 46.2031454 ] } },
{ "type": "Feature", "id": "node\/3700033257", "properties": { "@id": "node\/3700033257", "ele": "1852", "name": "Monte Maggio", "natural": "peak", "wikidata": "Q16579632", "wikipedia": "it:Monte Maggio", "summit:cross": "yes", "man_made": "cross" }, "geometry": { "type": "Point", "coordinates": [ 11.221881, 45.849049 ] } },
{ "type": "Feature", "id": "node\/3721293356", "properties": { "@id": "node\/3721293356", "ele": "2901", "name": "Cima di Bon", "natural": "peak" }, "geometry": { "type": "Point", "coordinates": [ 10.7133167, 46.241494 ] } },
{ "type": "Feature", "id": "node\/3721331632", "properties": { "@id": "node\/3721331632", "ele": "2542", "name": "Craper di Stracciola", "natural": "peak" }, "geometry": { "type": "Point", "coordinates": [ 10.6386712, 46.0631906 ] } },
{ "type": "Feature", "id": "node\/3733140520", "properties": { "@id": "node\/3733140520", "ele": "967", "name": "Piccolo Dain", "natural": "peak" }, "geometry": { "type": "Point", "coordinates": [ 10.9491312, 46.0549178 ] } },
{ "type": "Feature", "id": "node\/3740395129", "properties": { "@id": "node\/3740395129", "ele": "2816", "name": "Creper Vac", "natural": "peak" }, "geometry": { "type": "Point", "coordinates": [ 10.5841106, 46.0406401 ] } },
{ "type": "Feature", "id": "node\/3740395130", "properties": { "@id": "node\/3740395130", "ele": "2678", "name": "la Uzza", "natural": "peak" }, "geometry": { "type": "Point", "coordinates": [ 10.5780522, 46.0131303 ] } },
{ "type": "Feature", "id": "node\/3824775271", "properties": { "@id": "node\/3824775271", "ele": "3140", "name": "Cavaion", "natural": "peak" }, "geometry": { "type": "Point", "coordinates": [ 10.7222172, 46.4185063 ] } },
{ "type": "Feature", "id": "node\/3871656818", "properties": { "@id": "node\/3871656818", "ele": "2168", "name": "La Roda", "natural": "peak" }, "geometry": { "type": "Point", "coordinates": [ 10.71049, 45.9540231 ] } },
{ "type": "Feature", "id": "node\/3871656819", "properties": { "@id": "node\/3871656819", "ele": "1339", "name": "Monte Giovo", "natural": "peak" }, "geometry": { "type": "Point", "coordinates": [ 10.637798, 45.9019126 ] } },
{ "type": "Feature", "id": "node\/3873798600", "properties": { "@id": "node\/3873798600", "ele": "1601", "name": "Cima di Vil", "natural": "peak" }, "geometry": { "type": "Point", "coordinates": [ 10.7802659, 45.8448164 ] } },
{ "type": "Feature", "id": "node\/3873798602", "properties": { "@id": "node\/3873798602", "ele": "1027", "name": "Col Plagna", "natural": "peak" }, "geometry": { "type": "Point", "coordinates": [ 10.6953012, 45.8971328 ] } },
{ "type": "Feature", "id": "node\/3873798609", "properties": { "@id": "node\/3873798609", "ele": "1358", "name": "Monte delle Fogge", "natural": "peak" }, "geometry": { "type": "Point", "coordinates": [ 10.7142597, 45.85994 ] } },
{ "type": "Feature", "id": "node\/3976771349", "properties": { "@id": "node\/3976771349", "ele": "2023", "name": "Nozzolo Grande", "natural": "peak" }, "geometry": { "type": "Point", "coordinates": [ 10.687949, 45.926834 ] } },
{ "type": "Feature", "id": "node\/4011650355", "properties": { "@id": "node\/4011650355", "ele": "1589", "name": "La Brada", "natural": "peak" }, "geometry": { "type": "Point", "coordinates": [ 11.2721507, 46.1075433 ] } },
{ "type": "Feature", "id": "node\/4021617512", "properties": { "@id": "node\/4021617512", "ele": "2085", "name": "Col del Latte", "natural": "peak" }, "geometry": { "type": "Point", "coordinates": [ 11.5656921, 46.2039052 ] } },
{ "type": "Feature", "id": "node\/4060163581", "properties": { "@id": "node\/4060163581", "ele": "2413", "name": "Tombola Nera", "natural": "peak" }, "geometry": { "type": "Point", "coordinates": [ 11.5704541, 46.1452626 ] } },
{ "type": "Feature", "id": "node\/4097856091", "properties": { "@id": "node\/4097856091", "ele": "1913", "name": "Palon de Tovre", "natural": "peak" }, "geometry": { "type": "Point", "coordinates": [ 10.9528253, 46.1655181 ] } },
{ "type": "Feature", "id": "node\/4108004458", "properties": { "@id": "node\/4108004458", "ele": "1151", "name": "Dos dela Cita", "natural": "peak" }, "geometry": { "type": "Point", "coordinates": [ 10.6356025, 45.8443875 ] } },
{ "type": "Feature", "id": "node\/4139986050", "properties": { "@id": "node\/4139986050", "ele": "2550", "name": "Col Margherita", "natural": "peak" }, "geometry": { "type": "Point", "coordinates": [ 11.7915459, 46.3673587 ] } },
{ "type": "Feature", "id": "node\/4150529635", "properties": { "@id": "node\/4150529635", "ele": "1094", "name": "Punta Piagu", "natural": "peak" }, "geometry": { "type": "Point", "coordinates": [ 10.9344645, 45.7480711 ] } },
{ "type": "Feature", "id": "node\/4188030009", "properties": { "@id": "node\/4188030009", "ele": "2100", "name": "Doss Capello", "natural": "peak", "wikidata": "Q3714442", "wikipedia": "it:Doss Capello" }, "geometry": { "type": "Point", "coordinates": [ 11.5596571, 46.3378465 ] } },
{ "type": "Feature", "id": "node\/4200600460", "properties": { "@id": "node\/4200600460", "ele": "647", "name": "Sasso Corvo", "natural": "peak" }, "geometry": { "type": "Point", "coordinates": [ 11.5554752, 46.0293927 ] } },
{ "type": "Feature", "id": "node\/4228569807", "properties": { "@id": "node\/4228569807", "ele": "2374", "name": "Le Pezze", "natural": "peak" }, "geometry": { "type": "Point", "coordinates": [ 11.67488, 46.3333086 ] } },
{ "type": "Feature", "id": "node\/4231453013", "properties": { "@id": "node\/4231453013", "ele": "2479", "name": "Cima di Valmaggiore", "natural": "peak" }, "geometry": { "type": "Point", "coordinates": [ 11.6579627, 46.2565859 ] } },
{ "type": "Feature", "id": "node\/4248881393", "properties": { "@id": "node\/4248881393", "ele": "1226", "name": "Dos Pelà", "natural": "peak" }, "geometry": { "type": "Point", "coordinates": [ 11.0992764, 45.8993323 ] } },
{ "type": "Feature", "id": "node\/4252211550", "properties": { "@id": "node\/4252211550", "ele": "2558", "name": "Cimon della Roa", "natural": "peak" }, "geometry": { "type": "Point", "coordinates": [ 11.5134748, 46.2112622 ] } },
{ "type": "Feature", "id": "node\/4319657783", "properties": { "@id": "node\/4319657783", "ele": "2557", "name": "Sass Ciapel", "natural": "peak" }, "geometry": { "type": "Point", "coordinates": [ 11.8403205, 46.4768091 ] } },
{ "type": "Feature", "id": "node\/4324867389", "properties": { "@id": "node\/4324867389", "ele": "1669", "name": "Il Colazzo", "natural": "peak", "loc_name": "Colazo", "short_name": "Colazzo" }, "geometry": { "type": "Point", "coordinates": [ 11.5145064, 46.0216795 ] } },
{ "type": "Feature", "id": "node\/4346446447", "properties": { "@id": "node\/4346446447", "ele": "2014", "name": "Col di Boi", "natural": "peak" }, "geometry": { "type": "Point", "coordinates": [ 11.4130723, 46.1458143 ] } },
{ "type": "Feature", "id": "node\/4354071948", "properties": { "@id": "node\/4354071948", "ele": "1865", "name": "Monte Sòus", "natural": "peak" }, "geometry": { "type": "Point", "coordinates": [ 11.0523998, 46.5047874 ] } },
{ "type": "Feature", "id": "node\/4362054326", "properties": { "@id": "node\/4362054326", "ele": "1734", "name": "Monte Largaden", "natural": "peak" }, "geometry": { "type": "Point", "coordinates": [ 11.21703, 46.4431038 ] } },
{ "type": "Feature", "id": "node\/4376951089", "properties": { "@id": "node\/4376951089", "ele": "2287", "name": "Cima Valsorda", "natural": "peak", "wikidata": "Q9192681" }, "geometry": { "type": "Point", "coordinates": [ 11.7361929, 46.1997107 ] } },
{ "type": "Feature", "id": "node\/4391419355", "properties": { "@id": "node\/4391419355", "ele": "2436", "name": "Col Bel", "natural": "peak" }, "geometry": { "type": "Point", "coordinates": [ 11.7359342, 46.4479308 ] } },
{ "type": "Feature", "id": "node\/4411383229", "properties": { "@id": "node\/4411383229", "ele": "1656", "name": "Monte Silana", "natural": "peak" }, "geometry": { "type": "Point", "coordinates": [ 11.6032375, 46.0812809 ] } },
{ "type": "Feature", "id": "node\/4413738972", "properties": { "@id": "node\/4413738972", "ele": "1835", "name": "M. Ranzo", "natural": "peak" }, "geometry": { "type": "Point", "coordinates": [ 10.977665, 46.1006047 ] } },
{ "type": "Feature", "id": "node\/4413753188", "properties": { "@id": "node\/4413753188", "ele": "1509", "name": "Monte Fausior", "natural": "peak" }, "geometry": { "type": "Point", "coordinates": [ 11.0670971, 46.1949624 ] } },
{ "type": "Feature", "id": "node\/4460634993", "properties": { "@id": "node\/4460634993", "ele": "2242", "name": "Do Ciuril", "natural": "peak" }, "geometry": { "type": "Point", "coordinates": [ 11.6913522, 46.4699071 ] } },
{ "type": "Feature", "id": "node\/4464458192", "properties": { "@id": "node\/4464458192", "ele": "2343", "name": "Monte Tolvà", "natural": "peak" }, "geometry": { "type": "Point", "coordinates": [ 11.6447594, 46.1435926 ] } },
{ "type": "Feature", "id": "node\/4464462153", "properties": { "@id": "node\/4464462153", "ele": "1871", "name": "M. Timoncello", "natural": "peak" }, "geometry": { "type": "Point", "coordinates": [ 11.6447917, 46.1244612 ] } },
{ "type": "Feature", "id": "node\/4464900169", "properties": { "@id": "node\/4464900169", "ele": "1750", "name": "Col della Remitta", "natural": "peak" }, "geometry": { "type": "Point", "coordinates": [ 11.712476, 46.1186488 ] } },
{ "type": "Feature", "id": "node\/4465217303", "properties": { "@id": "node\/4465217303", "ele": "2235", "name": "Aia Tonda", "natural": "peak" }, "geometry": { "type": "Point", "coordinates": [ 11.6613752, 46.1702025 ] } },
{ "type": "Feature", "id": "node\/4465255320", "properties": { "@id": "node\/4465255320", "ele": "2085", "name": "Coston", "natural": "peak" }, "geometry": { "type": "Point", "coordinates": [ 11.7562594, 46.1841 ] } },
{ "type": "Feature", "id": "node\/4478658372", "properties": { "@id": "node\/4478658372", "ele": "2835", "name": "Monte Palù", "natural": "peak" }, "geometry": { "type": "Point", "coordinates": [ 10.6352933, 46.3179469 ] } },
{ "type": "Feature", "id": "node\/4498638308", "properties": { "@id": "node\/4498638308", "ele": "522", "name": "Col dei Trenti", "natural": "peak" }, "geometry": { "type": "Point", "coordinates": [ 11.5265244, 46.0669388 ] } },
{ "type": "Feature", "id": "node\/4598010730", "properties": { "@id": "node\/4598010730", "ele": "2286.3", "name": "Col Pelous", "natural": "peak" }, "geometry": { "type": "Point", "coordinates": [ 11.753201, 46.466016 ] } },
{ "type": "Feature", "id": "node\/4608213506", "properties": { "@id": "node\/4608213506", "ele": "1082", "name": "Dos Alt", "natural": "peak" }, "geometry": { "type": "Point", "coordinates": [ 11.2476136, 46.1003371 ] } },
{ "type": "Feature", "id": "node\/4627994678", "properties": { "@id": "node\/4627994678", "ele": "2938", "name": "Cima Verdignana", "natural": "peak" }, "geometry": { "type": "Point", "coordinates": [ 10.7262741, 46.3992998 ] } },
{ "type": "Feature", "id": "node\/4628003581", "properties": { "@id": "node\/4628003581", "ele": "2901", "name": "Cima Grande", "natural": "peak" }, "geometry": { "type": "Point", "coordinates": [ 10.7360233, 46.372576 ] } },
{ "type": "Feature", "id": "node\/4628721700", "properties": { "@id": "node\/4628721700", "ele": "2527", "name": "Sass dell'Anel", "natural": "peak" }, "geometry": { "type": "Point", "coordinates": [ 10.8312119, 46.3502735 ] } },
{ "type": "Feature", "id": "node\/4629885368", "properties": { "@id": "node\/4629885368", "ele": "2604", "name": "Monte Polinar", "natural": "peak" }, "geometry": { "type": "Point", "coordinates": [ 10.8129626, 46.3851188 ] } },
{ "type": "Feature", "id": "node\/4634320532", "properties": { "@id": "node\/4634320532", "ele": "2502", "name": "Coni", "natural": "peak" }, "geometry": { "type": "Point", "coordinates": [ 10.6400734, 46.3346395 ] } },
{ "type": "Feature", "id": "node\/4635960469", "properties": { "@id": "node\/4635960469", "ele": "2056", "name": "Croz Rossa", "natural": "peak" }, "geometry": { "type": "Point", "coordinates": [ 10.8357958, 46.084335 ] } },
{ "type": "Feature", "id": "node\/4636945843", "properties": { "@id": "node\/4636945843", "ele": "2228", "name": "Monte Lavanech", "natural": "peak" }, "geometry": { "type": "Point", "coordinates": [ 10.542811, 45.952471 ] } },
{ "type": "Feature", "id": "node\/4644238365", "properties": { "@id": "node\/4644238365", "ele": "2253", "name": "Cima Costa Brunella", "natural": "peak" }, "geometry": { "type": "Point", "coordinates": [ 11.5836664, 46.1275072 ] } },
{ "type": "Feature", "id": "node\/4644252511", "properties": { "@id": "node\/4644252511", "ele": "2032", "name": "M. Spiado", "natural": "peak" }, "geometry": { "type": "Point", "coordinates": [ 11.5890255, 46.1040219 ] } },
{ "type": "Feature", "id": "node\/4677839483", "properties": { "@id": "node\/4677839483", "ele": "1775", "name": "Dos da le Laste", "natural": "peak" }, "geometry": { "type": "Point", "coordinates": [ 11.3846309, 46.2279026 ] } },
{ "type": "Feature", "id": "node\/4678931321", "properties": { "@id": "node\/4678931321", "ele": "2679", "name": "Cima di Tuena", "natural": "peak" }, "geometry": { "type": "Point", "coordinates": [ 10.9060762, 46.2646538 ] } },
{ "type": "Feature", "id": "node\/4678955211", "properties": { "@id": "node\/4678955211", "ele": "2508", "name": "Marugini", "natural": "peak" }, "geometry": { "type": "Point", "coordinates": [ 10.8597268, 46.1106428 ] } },
{ "type": "Feature", "id": "node\/4678972831", "properties": { "@id": "node\/4678972831", "ele": "2664", "name": "Monte Fibion", "natural": "peak" }, "geometry": { "type": "Point", "coordinates": [ 10.9540342, 46.2018416 ] } },
{ "type": "Feature", "id": "node\/4679048289", "properties": { "@id": "node\/4679048289", "ele": "2189", "name": "Daniola", "natural": "peak" }, "geometry": { "type": "Point", "coordinates": [ 10.969511, 46.1805506 ] } },
{ "type": "Feature", "id": "node\/4679134672", "properties": { "@id": "node\/4679134672", "ele": "1450", "name": "Costa Lugiangia", "natural": "peak" }, "geometry": { "type": "Point", "coordinates": [ 10.9278071, 46.2492961 ] } },
{ "type": "Feature", "id": "node\/4681319575", "properties": { "@id": "node\/4681319575", "ele": "2609", "name": "Castel Pagano", "natural": "peak" }, "geometry": { "type": "Point", "coordinates": [ 10.8594331, 46.4233355 ] } },
{ "type": "Feature", "id": "node\/4681319578", "properties": { "@id": "node\/4681319578", "ele": "2341", "name": "Rochet", "natural": "peak" }, "geometry": { "type": "Point", "coordinates": [ 10.8890514, 46.3969634 ] } },
{ "type": "Feature", "id": "node\/4682072236", "properties": { "@id": "node\/4682072236", "ele": "2243", "name": "Sera Spinal", "natural": "peak" }, "geometry": { "type": "Point", "coordinates": [ 10.8993483, 46.4129265 ] } },
{ "type": "Feature", "id": "node\/4719047005", "properties": { "@id": "node\/4719047005", "ele": "1657", "name": "Cima la Presa", "natural": "peak" }, "geometry": { "type": "Point", "coordinates": [ 11.5845202, 46.0543212 ] } },
{ "type": "Feature", "id": "node\/4726377778", "properties": { "@id": "node\/4726377778", "ele": "923", "name": "Dos Castel", "natural": "peak" }, "geometry": { "type": "Point", "coordinates": [ 11.0840992, 46.1810741 ] } },
{ "type": "Feature", "id": "node\/4741810936", "properties": { "@id": "node\/4741810936", "ele": "1500", "name": "Busa Grande", "natural": "peak" }, "geometry": { "type": "Point", "coordinates": [ 11.2983125, 46.0356251 ] } },
{ "type": "Feature", "id": "node\/4759481894", "properties": { "@id": "node\/4759481894", "ele": "902", "name": "Colle San Marco", "natural": "peak" }, "geometry": { "type": "Point", "coordinates": [ 11.4410763, 46.0735785 ] } },
{ "type": "Feature", "id": "node\/4763705131", "properties": { "@id": "node\/4763705131", "ele": "2022", "name": "El Col", "natural": "peak" }, "geometry": { "type": "Point", "coordinates": [ 11.6086071, 46.3715683 ] } },
{ "type": "Feature", "id": "node\/4773444038", "properties": { "@id": "node\/4773444038", "ele": "2507", "name": "Pala di Crapela", "natural": "peak" }, "geometry": { "type": "Point", "coordinates": [ 11.7509159, 46.4003964 ] } },
{ "type": "Feature", "id": "node\/4789492487", "properties": { "@id": "node\/4789492487", "ele": "2752", "name": "Cima di Valsorda", "natural": "peak" }, "geometry": { "type": "Point", "coordinates": [ 11.5590416, 46.3643854 ] } },
{ "type": "Feature", "id": "node\/4789534260", "properties": { "@id": "node\/4789534260", "ele": "2215", "name": "Censi", "natural": "peak" }, "geometry": { "type": "Point", "coordinates": [ 11.5372761, 46.3261258 ] } },
{ "type": "Feature", "id": "node\/4789534263", "properties": { "@id": "node\/4789534263", "ele": "2162", "name": "Pizzancae", "natural": "peak" }, "geometry": { "type": "Point", "coordinates": [ 11.5580205, 46.3086253 ] } },
{ "type": "Feature", "id": "node\/4798203022", "properties": { "@id": "node\/4798203022", "ele": "2195", "name": "Grontonel", "natural": "peak" }, "geometry": { "type": "Point", "coordinates": [ 11.7272709, 46.3607219 ] } },
{ "type": "Feature", "id": "node\/4803591955", "properties": { "@id": "node\/4803591955", "ele": "807", "name": "M. Soprasasso", "natural": "peak" }, "geometry": { "type": "Point", "coordinates": [ 11.0850568, 46.0954868 ] } },
{ "type": "Feature", "id": "node\/4804259471", "properties": { "@id": "node\/4804259471", "ele": "1545", "name": "Monte Brento", "natural": "peak", "wikidata": "Q49967511" }, "geometry": { "type": "Point", "coordinates": [ 10.8980698, 45.9874343 ] } },
{ "type": "Feature", "id": "node\/4839553472", "properties": { "@id": "node\/4839553472", "ele": "1730", "name": "Monte Spilech", "natural": "peak", "summit:cross": "yes", "source": "GPS, survey", "wikimedia_commons": "File:Spilech.jpg" }, "geometry": { "type": "Point", "coordinates": [ 11.2034064, 45.9592651 ] } },
{ "type": "Feature", "id": "node\/4841671405", "properties": { "@id": "node\/4841671405", "ele": "1249", "name": "Rucadin", "natural": "peak" }, "geometry": { "type": "Point", "coordinates": [ 11.4106744, 46.2565504 ] } },
{ "type": "Feature", "id": "node\/4868504397", "properties": { "@id": "node\/4868504397", "ele": "1860", "name": "Jocole", "natural": "peak" }, "geometry": { "type": "Point", "coordinates": [ 11.0990762, 45.7567951 ] } },
{ "type": "Feature", "id": "node\/4880123651", "properties": { "@id": "node\/4880123651", "ele": "946", "name": "Póstel", "natural": "peak" }, "geometry": { "type": "Point", "coordinates": [ 11.2243643, 46.1091857 ] } },
{ "type": "Feature", "id": "node\/4937395675", "properties": { "@id": "node\/4937395675", "ele": "2180", "name": "Mandriccione", "natural": "peak" }, "geometry": { "type": "Point", "coordinates": [ 11.5884607, 46.251208 ] } },
{ "type": "Feature", "id": "node\/4945767199", "properties": { "@id": "node\/4945767199", "ele": "2328", "name": "C. Stradòn", "natural": "peak" }, "geometry": { "type": "Point", "coordinates": [ 11.7486142, 46.2833522 ] } },
{ "type": "Feature", "id": "node\/4945779228", "properties": { "@id": "node\/4945779228", "ele": "2164", "name": "Castel", "natural": "peak" }, "geometry": { "type": "Point", "coordinates": [ 11.686541, 46.2793926 ] } },
{ "type": "Feature", "id": "node\/4969260870", "properties": { "@id": "node\/4969260870", "ele": "1515", "name": "Ceramónt", "natural": "peak" }, "geometry": { "type": "Point", "coordinates": [ 11.2710605, 46.1623813 ] } },
{ "type": "Feature", "id": "node\/4969942865", "properties": { "@id": "node\/4969942865", "ele": "2116", "name": "I Becari", "natural": "peak" }, "geometry": { "type": "Point", "coordinates": [ 11.617978, 46.2688686 ] } },
{ "type": "Feature", "id": "node\/4973470190", "properties": { "@id": "node\/4973470190", "ele": "1501", "name": "Dos de la Cièura", "natural": "peak" }, "geometry": { "type": "Point", "coordinates": [ 11.1044204, 46.4895955 ] } },
{ "type": "Feature", "id": "node\/4973512870", "properties": { "@id": "node\/4973512870", "ele": "1589", "name": "Monte Dian", "natural": "peak" }, "geometry": { "type": "Point", "coordinates": [ 11.0873079, 46.4655614 ] } },
{ "type": "Feature", "id": "node\/4980436417", "properties": { "@id": "node\/4980436417", "ele": "1782", "name": "Guglia Gei", "natural": "peak" }, "geometry": { "type": "Point", "coordinates": [ 11.1536835, 45.7207392 ] } },
{ "type": "Feature", "id": "node\/5002462509", "properties": { "@id": "node\/5002462509", "ele": "1877", "name": "La Corda", "natural": "peak" }, "geometry": { "type": "Point", "coordinates": [ 11.3556538, 46.1747094 ] } },
{ "type": "Feature", "id": "node\/5041641576", "properties": { "@id": "node\/5041641576", "ele": "2733", "name": "Sass da Camp", "natural": "peak" }, "geometry": { "type": "Point", "coordinates": [ 11.9243635, 46.2435761 ] } },
{ "type": "Feature", "id": "node\/5182236970", "properties": { "@id": "node\/5182236970", "ele": "2291", "name": "Lom", "natural": "peak" }, "geometry": { "type": "Point", "coordinates": [ 11.7167976, 46.3769866 ] } },
{ "type": "Feature", "id": "node\/5290559684", "properties": { "@id": "node\/5290559684", "ele": "1240", "name": "Monte Mosna", "natural": "peak" }, "geometry": { "type": "Point", "coordinates": [ 11.1368502, 45.9407694 ] } },
{ "type": "Feature", "id": "node\/5405123258", "properties": { "@id": "node\/5405123258", "ele": "914", "name": "M. Barco", "natural": "peak" }, "geometry": { "type": "Point", "coordinates": [ 11.1739222, 46.1377975 ] } },
{ "type": "Feature", "id": "node\/5419711990", "properties": { "@id": "node\/5419711990", "ele": "1252", "name": "M. Zuclo", "natural": "peak" }, "geometry": { "type": "Point", "coordinates": [ 10.7577822, 46.0204357 ] } },
{ "type": "Feature", "id": "node\/5488822704", "properties": { "@id": "node\/5488822704", "ele": "945", "name": "Dos del Cuz", "natural": "peak" }, "geometry": { "type": "Point", "coordinates": [ 11.1888732, 46.1100612 ] } },
{ "type": "Feature", "id": "node\/5629443591", "properties": { "@id": "node\/5629443591", "ele": "1535", "name": "Piz Comboni", "natural": "peak" }, "geometry": { "type": "Point", "coordinates": [ 11.3084422, 46.1879155 ] } },
{ "type": "Feature", "id": "node\/5762269510", "properties": { "@id": "node\/5762269510", "ele": "343", "name": "Dosso Saiano", "natural": "peak" }, "geometry": { "type": "Point", "coordinates": [ 10.9137266, 45.9099197 ] } },
{ "type": "Feature", "id": "node\/5787155651", "properties": { "@id": "node\/5787155651", "ele": "1180", "name": "Monte Brugnolo", "natural": "peak" }, "geometry": { "type": "Point", "coordinates": [ 10.9177291, 45.8900091 ] } },
{ "type": "Feature", "id": "node\/5787655094", "properties": { "@id": "node\/5787655094", "ele": "1743", "name": "I Tre Apostoli II", "natural": "peak" }, "geometry": { "type": "Point", "coordinates": [ 11.1772585, 45.7402142 ] } },
{ "type": "Feature", "id": "node\/5787655096", "properties": { "@id": "node\/5787655096", "name": "Torre dell'Osservatorio", "natural": "peak" }, "geometry": { "type": "Point", "coordinates": [ 11.1725593, 45.7348302 ] } },
{ "type": "Feature", "id": "node\/5812318799", "properties": { "@id": "node\/5812318799", "ele": "3068", "name": "Punta di Ercavallo q 3068", "natural": "peak" }, "geometry": { "type": "Point", "coordinates": [ 10.5660903, 46.3263647 ] } },
{ "type": "Feature", "id": "node\/5838901963", "properties": { "@id": "node\/5838901963", "ele": "1872", "name": "Monte Cogorna", "natural": "peak" }, "geometry": { "type": "Point", "coordinates": [ 10.7950671, 45.9769004 ] } },
{ "type": "Feature", "id": "node\/5838962989", "properties": { "@id": "node\/5838962989", "ele": "1992", "name": "Il Frate", "natural": "peak" }, "geometry": { "type": "Point", "coordinates": [ 10.7525876, 45.9930087 ] } },
{ "type": "Feature", "id": "node\/5894788570", "properties": { "@id": "node\/5894788570", "ele": "2155", "name": "Jechl", "natural": "peak" }, "geometry": { "type": "Point", "coordinates": [ 11.3435799, 46.0772584 ] } },
{ "type": "Feature", "id": "node\/5894807834", "properties": { "@id": "node\/5894807834", "ele": "2027", "name": "Prennputz", "natural": "peak", "name:mhn": "Prennputz", "note": "Questa cima è conosciuta solo con il nome mocheno, per cui ho messo lo stesso nome in entrambi i campi." }, "geometry": { "type": "Point", "coordinates": [ 11.3424051, 46.062512 ] } },
{ "type": "Feature", "id": "node\/5960741907", "properties": { "@id": "node\/5960741907", "ele": "2885", "name": "CIma Cadine 2885", "natural": "peak" }, "geometry": { "type": "Point", "coordinates": [ 11.8171836, 46.4108745 ] } },
{ "type": "Feature", "id": "node\/6055809372", "properties": { "@id": "node\/6055809372", "ele": "1528", "name": "Monte Costesin", "natural": "peak" }, "geometry": { "type": "Point", "coordinates": [ 11.3596051, 45.944951 ] } },
{ "type": "Feature", "id": "node\/6237179257", "properties": { "@id": "node\/6237179257", "ele": "434", "name": "Monte Colt", "natural": "peak" }, "geometry": { "type": "Point", "coordinates": [ 10.894205, 45.9431899 ] } },
{ "type": "Feature", "id": "node\/6243899654", "properties": { "@id": "node\/6243899654", "ele": "2034", "name": "Bena", "natural": "peak" }, "geometry": { "type": "Point", "coordinates": [ 10.7879625, 46.1122146 ] } },
{ "type": "Feature", "id": "node\/6244275973", "properties": { "@id": "node\/6244275973", "ele": "2082", "name": "Monte Brut", "natural": "peak" }, "geometry": { "type": "Point", "coordinates": [ 10.8325316, 46.1275785 ] } },
{ "type": "Feature", "id": "node\/6432930995", "properties": { "@id": "node\/6432930995", "ele": "666", "name": "Castelét", "natural": "peak" }, "geometry": { "type": "Point", "coordinates": [ 11.3037624, 46.220415 ] } },
{ "type": "Feature", "id": "node\/6499735202", "properties": { "@id": "node\/6499735202", "ele": "1686", "name": "Semper Spitz", "natural": "peak" }, "geometry": { "type": "Point", "coordinates": [ 11.2941352, 46.0512949 ] } },
{ "type": "Feature", "id": "node\/6515090402", "properties": { "@id": "node\/6515090402", "ele": "1989", "name": "monte Rocca", "natural": "peak" }, "geometry": { "type": "Point", "coordinates": [ 10.6802434, 46.1544109 ] } },
{ "type": "Feature", "id": "node\/6550869394", "properties": { "@id": "node\/6550869394", "ele": "554", "name": "Doss della Barchessa", "natural": "peak" }, "geometry": { "type": "Point", "coordinates": [ 10.9125608, 45.8619168 ] } },
{ "type": "Feature", "id": "node\/6550923719", "properties": { "@id": "node\/6550923719", "ele": "706", "name": "Monte Ben", "natural": "peak" }, "geometry": { "type": "Point", "coordinates": [ 10.925796, 45.9419937 ] } },
{ "type": "Feature", "id": "node\/6551186562", "properties": { "@id": "node\/6551186562", "ele": "1067", "name": "Monte San Pietro", "natural": "peak" }, "geometry": { "type": "Point", "coordinates": [ 10.8432924, 45.9379723 ] } },
{ "type": "Feature", "id": "node\/6591059303", "properties": { "@id": "node\/6591059303", "ele": "326", "name": "Monte Gaggio", "natural": "peak" }, "geometry": { "type": "Point", "coordinates": [ 10.9362156, 45.9936341 ] } },
{ "type": "Feature", "id": "node\/6708516300", "properties": { "@id": "node\/6708516300", "ele": "1477", "name": "Pazul", "natural": "peak" }, "geometry": { "type": "Point", "coordinates": [ 11.1104264, 45.8531378 ] } },
{ "type": "Feature", "id": "node\/6853108602", "properties": { "@id": "node\/6853108602", "ele": "2727", "name": "Roda del Diavolo", "natural": "peak", "alt_name": "Teufel Wand" }, "geometry": { "type": "Point", "coordinates": [ 11.6206582, 46.421973 ] } },
{ "type": "Feature", "id": "node\/6880689668", "properties": { "@id": "node\/6880689668", "ele": "2366", "name": "Cisa", "natural": "peak" }, "geometry": { "type": "Point", "coordinates": [ 10.6764906, 46.4036702 ] } },
{ "type": "Feature", "id": "node\/7014245239", "properties": { "@id": "node\/7014245239", "ele": "2350", "name": "Corna Rossa", "natural": "peak" }, "geometry": { "type": "Point", "coordinates": [ 10.8877879, 46.2121162 ] } }
]
}
