,identiy,Date,Aspect,Elevation,SlopeAngle_x,long_x,lat_x,Name,location,long_y,lat_y,SlopeAngle_y,DP4 info,Spalte1,Spalte2
0,12702,2020-10-18T10:10:00+02:00,NW,2645,31,11.1158,46.99857,Ruetz,Daunjochlift Talstation,11.1158,46.99857,31,warmaftercold,5,1.0
1,12704,2020-10-19T09:25:00+02:00,SW,3630,35,12.3465,47.10864,"Fuetsch, Nairz",Großvenediger,12.3465,47.10864,35,warmaftercold,1,1.0
2,12705,2020-10-19T10:10:00+02:00,S,3660,50,12.3455,47.10917,"Fuetsch, Nairz",Großvenediger,12.3455,47.10917,50,warmaftercold,1,1.0
3,12707,2020-10-19T11:35:00+02:00,SW,3620,10,12.3464,47.10828,"Fuetsch, Nairz",Großvenediger,12.3464,47.10828,10,warmaftercold,1,1.0
4,12710,2020-10-20T13:30:00+02:00,NW,2975,38,11.0848,46.88181,"Ruetz, Strasser",Wurmkogel,11.0848,46.88181,38,warmaftercold,6,
5,12713,2020-10-22T12:20:00+02:00,N,2980,42,10.7006,46.86165,"Nairz, Mayer",Karles Nord,10.7006,46.86165,42,warmaftercold,6,
6,12725,2020-11-06T12:10:00+01:00,NW,3020,37,11.0850,46.89325,Viktor Stemmer,Hochgurgl,11.0850,46.89325,37,coldafterwarm,6,
7,12726,2020-11-08T13:30:00+01:00,N,3200,37,10.9113,46.92234,Marvin Kärle,Linker Fernerkogel,10.9113,46.92234,37,warmaftercold,6,
8,12731,2020-11-15T13:20:00+01:00,N,3065,40,11.0480,47.16325,Ruetz,Zwieselbacher Rosskogel,11.0480,47.16325,40,warmaftercold,6,
9,12734,2020-11-18T13:10:00+01:00,NE,2800,32,10.9993,47.23361,Ruetz,Pirchkogel,10.9993,47.23361,32,warmaftercold,6,
10,12735,2020-11-18T13:45:00+01:00,N,2790,39,10.9995,47.23285,Ruetz,Pirchkogel,10.9995,47.23285,39,warmaftercold,6,
11,12736,2020-11-18T14:40:00+01:00,N,2530,35,11.0073,47.23012,Ruetz,Hinterer Grieskogel,11.0073,47.23012,35,warmaftercold,6,
12,12738,2020-11-18T12:45:00+01:00,NW,2900,33,11.6488,47.05568,"Nairz, Lanzanasto",Olperer,11.6488,47.05568,33,warmaftercold,6,
13,12754,2020-11-24T14:10:00+01:00,NE,3160,40,10.9222,46.91889,LK-Koordination,Tiefenbachferner,10.9222,46.91889,40,warmaftercold,6,
14,12755,2020-11-24T14:45:00+01:00,SE,3085,33,10.9294,46.92028,LK-Koordination,Tiefenbachferner,10.9294,46.92028,33,warmaftercold,6,
15,12758,2020-11-24T12:40:00+01:00,NE,3200,25,10.7791, 46.7925,Graf - Gheser,Hintereis,10.7791, 46.7925,25,warmaftercold,6,
16,12761,2020-11-24T13:00:00+01:00,S,3270,30,10.92 4,46.92195,LK-Koordination (Mitterer),Tiefenbachferner,10.92 4,46.92195,30,warmaftercold,6,
17,12762,2020-11-24T14:36:00+01:00,N,2960,32,10.9363,46.92028,LK-Koordination,Tiefenbachferner Schlepplift,10.9363,46.92028,32,warmaftercold,6,
18,12772,2020-11-27T10:50:00+01:00,,2920,0,11.0800,46.88243,"Nairz, Ruetz",Wurmkogel,11.0800,46.88243,0,warmaftercold,6,
19,12776,2020-12-02T11:20:00+01:00,N,2380,28,11.0401,47.20211,"Ruetz,                                Strasser",Pockkogel,11.0401,47.20211,28,warmaftercold,6,
20,12777,2020-12-02T12:00:00+01:00,NW,2760,37,10.7113, 46.8618,LKK Kaunertal Gr3,Wiesenjaggl Hang unten,10.7113, 46.8618,37,warmaftercold,6,
21,12778,2020-12-02T12:13:00+01:00,N,2780,34,10.7122,46.86214,LKK Kaunertal 3,Wiesejagglpiste,10.7122,46.86214,34,warmaftercold,6,
22,12799,2020-12-04T10:06:00+01:00,NE,2887,35,10.7072, 46.8604,Simon Heidrich,Kaunertaler Gletscher,10.7072, 46.8604,35,warmaftercold,6,
23,12799,2020-12-04T10:06:00+01:00,NE,2887,35,10.7072, 46.8604,Andreas Felder,Kaunertaler Gletscher,10.7030,46.85817,35,warmaftercold,6,
24,12800,2020-12-04T10:06:00+01:00,NE,2887,35,10.7030,46.85817,Simon Heidrich,Kaunertaler Gletscher,10.7072, 46.8604,35,warmaftercold,6,
25,12800,2020-12-04T10:06:00+01:00,NE,2887,35,10.7030,46.85817,Andreas Felder,Kaunertaler Gletscher,10.7030,46.85817,35,warmaftercold,6,
26,12910,2020-12-11T10:40:00+01:00,W,2760,30,12.5204,47.14755,"Nairz, Lanzanasto, Trost, Köll",Hochgasser,12.5204,47.14755,30,warmaftercold,6,
27,12965,2020-12-17T12:45:00+01:00,NE,2720,28,11.003 ,47.23014,"Nairz, Plankensteiner",Hinterer Grieskogel,11.003 ,47.23014,28,warmaftercold,6,
28,13004,2020-12-18T12:40:00+01:00,NW,2477,37,10.3236,47.11786,"Brunnhofer, Stemmer",Gamskarspitze Scharte,10.3236,47.11786,37,coldafterwarm,6,
29,13028,2020-12-20T10:00:00+01:00,S,1697,2,10.3658,47.27355,"Adolf Kerber , Walter Haider",Jöchelspitze,10.3658,47.27355,2,warmaftercold,6,
30,13040,2020-12-21T11:30:00+01:00,NE,2620,25,11.5293,47.20864,Alex Radlherr,Glungezer,11.5293,47.20864,25,warmaftercold,6,
31,13049,2020-12-22T13:50:00+01:00,E,2460,32,10.2304,47.15141,"Ladner, Guem",Hintere Schoaß,10.2304,47.15141,32,warmaftercold,6,
32,13078,2020-12-25T14:00:00+01:00,S,2200,30,12.2970,46.92387,Daniel Kleinlercher,Oberseite - Blitz Schupfe,12.2970,46.92387,30,coldafterwarm,2,3.0
33,13083,2020-12-26T11:00:00+01:00,N,2300,33,10.3255,47.22095,Marvin K. ; Martin K.,Rotschrofenkopf,10.3255,47.22095,33,coldafterwarm,4,3.0
34,13092,2020-12-27T12:00:00+01:00,SE,2250,27,11.1535,47.01804,Markus Schöpf Kindl Andreas,oberhalb Schafscheide,11.1535,47.01804,27,warmaftercold,4,3.0
35,13100,2020-12-27T11:40:00+01:00,E,2227,42,11.0311,46.91222,Rene u. Reini Scheiber,Brunnach,11.0311,46.91222,42,coldafterwarm,4,3.0
36,13106,2020-12-26T14:05:00+01:00,NE,2560,30,11.0619,47.14972,Nairz,Samerschlag,11.0619,47.14972,30,coldafterwarm,2,3.0
37,13107,2020-12-27T11:55:00+01:00,W,1910,28,11.1718,47.24051,Nairz,Rangger Köpfl,11.1718,47.24051,28,coldafterwarm,2,3.0
38,13129,2020-12-29T13:45:00+01:00,NE,1965,40,12.4103,46.72003,Bernhard G.,Leckfeldalm,12.4103,46.72003,40,coldafterwarm,6,
39,13132,2020-12-28T12:30:00+01:00,SE,2350,20,11.1824, 47.1817,"Radlherr, Marlin",Fotscher Windegg,11.1824, 47.1817,20,coldafterwarm,2,3.0
40,13133,2020-12-29T11:45:00+01:00,N,2200,36,11.8227,47.26109,Wierer Stefan,Ge. Ried i. Z. / Wimbachkopf,11.8227,47.26109,36,warmaftercold,1,2.0
41,13139,2020-12-29T12:45:00+01:00,E,2120,23,10.4484,47.15416,Gaßner Udo,Obere Grube - Flirsch,10.4484,47.15416,23,warmaftercold,2,3.0
42,13142,2020-12-29T13:20:00+01:00,NE,2086,26,10.2084,47.23672,,Steeg,10.2084,47.23672,26,coldafterwarm,4,3.0
43,13159,2020-12-30T11:00:00+01:00,SW,2440,32,12.4189,47.03774,Mariacher Lois,Große Nilalpe,12.4189,47.03774,32,warmaftercold,2,3.0
44,13206,2020-12-31T10:30:00+01:00,NW,2429,20,11.2473,47.10563,"r.larcher, m.larcher, w.stern",Seblasspitze-Hoasenbachl,11.2473,47.10563,20,warmaftercold,2,3.0
45,13208,2020-12-31T13:20:00+01:00,NW,2510,28,12.5597,46.88028,"Fuetsch,Riepler Toni,Christian",Östliche Deferegger Alpen,12.5597,46.88028,28,coldafterwarm,4,3.0
46,13217,2021-01-02T12:15:00+01:00,SW,2236,5,10.3541,47.29123,Elli und Stefan Zangerl,Rothorn,10.3541,47.29123,5,coldafterwarm,6,
47,13255,2021-01-04T11:30:00+01:00,NW,2340,35,12.6092,47.02023,"Fuetsch,Riepler Toni,Christian",Blauspitz,12.6092,47.02023,35,coldafterwarm,-,
48,13256,2021-01-04T12:00:00+01:00,NE,2200,33,10.3611,47.29126,Marvin Kärle,Gumpenkar,10.3611,47.29126,33,warmaftercold,5,3.0
49,13263,2021-01-05T12:15:00+01:00,S,2300,37,11.9582,47.17795,"Nairz, Wierer, Wierer, Wechselberger, Stock, Lanzanasto",Torhelm,11.9582,47.17795,37,warmaftercold,5,3.0
50,13270,2021-01-05T12:15:00+01:00,NE,2200,32,12.4810,47.10843,Walcher,Löbbensee,12.4810,47.10843,32,coldafterwarm,6,
51,13304,2021-01-07T12:15:00+01:00,S,2515,27,12.5858,46.81606,Hausberger; Lanzanasto,Tullkogel,12.5858,46.81606,27,warmaftercold,6,
52,13326,2021-01-07T14:20:00+01:00,E,2440,40,12.2897,46.80531,"Nairz, Mariacher",Pürglers Kunke ,12.2897,46.80531,40,coldafterwarm,6,
53,13355,2021-01-08T14:20:00+01:00,S,2470,32,12.4106,46.94145,Klaus Niederwanger,St. Veit in Defereggen,12.4106,46.94145,32,warmaftercold,6,
54,13395,2021-01-08T10:45:00+01:00,SW,2200,30,12.5232,47.11051,"Nairz, Fuetsch, Walcher",Haupmeralm,12.5232,47.11051,30,warmaftercold,6,
55,13435,2021-01-12T07:00:00+01:00,NE,1730,32,10.7347, 46.9597,"Plankensteiner, Ragg",Staudamm Kaunertal,10.7347, 46.9597,32,coldafterwarm,6,4.0
56,13440,2021-01-13T15:18:00+01:00,W,1929,30,11.4400,47.00948,Bergführerausbildung,Niederberg,11.4400,47.00948,30,warmaftercold,6,
57,13442,2021-01-13T13:13:00+01:00,NE,1852,28,10.5784,47.27383,,Boden,10.5784,47.27383,28,warmaftercold,6,
58,13476,2021-01-15T10:50:00+01:00,N,1607,25,10.1905, 46.9653,Strolz,Galtür / Böscha,10.1905, 46.9653,25,coldafterwarm,6,
59,13479,2021-01-15T11:00:00+01:00,NE,1560,33,10.6866,47.25486,Stephan Mitter,Hoch Imst,10.6866,47.25486,33,warmaftercold,6,
60,13489,2021-01-15T11:00:00+01:00,SE,1980,30,12.4315,47.47502,Jellinger Bernhard,Kitzbühel,12.4315,47.47502,30,warmaftercold,6,
61,13525,2021-01-16T10:40:00+01:00,SW,2150,24,10.3566,47.16437,"Nairz, Lorenz, Ripl",Aperies,10.3566,47.16437,24,warmaftercold,4,3.0
62,13527,2021-01-16T11:15:00+01:00,N,2072,14,10.3870,47.28908,,Mutte,10.3870,47.28908,14,warmaftercold,6,
63,13545,2021-01-17T14:30:00+01:00,,1530,0,11.0994,47.20205,Ruetz,St. Sigmund,11.0994,47.20205,0,warmaftercold,2,3.0
64,13587,2021-01-16T13:15:00+01:00,NW,1450,36,10.7456,47.40251,Markus WOLF,Berwang Hönig,10.7456,47.40251,36,warmaftercold,6,
65,13604,2021-01-19T11:50:00+01:00,E,2175,40,11.1728,47.22373,"Nairz, Ruetz, Lanzanasto",Kögele,11.1728,47.22373,40,warmaftercold,6,
66,13608,2021-01-19T14:13:00+01:00,S,2080,33,12.4000,46.77141,Christoph Schneider,Gadein/ Sammelplatz,12.4000,46.77141,33,coldafterwarm,6,
67,13623,2021-01-19T14:00:00+01:00,N,1900,35,11.2955,47.18321,Alpinkurs TSLV,Axamer Lizum,11.2955,47.18321,35,coldafterwarm,6,
68,13625,2021-01-19T11:50:00+01:00,NE,2033,24,11.6551,47.24915,N. Metz / T. Stolk,Kolsassberg,11.6551,47.24915,24,coldafterwarm,6,
69,13627,2021-01-19T13:30:00+01:00,N,1950,20,10.6830,47.39592,Elli und Stefan Zangerl,Galtjoch,10.6830,47.39592,20,warmaftercold,6,
70,13629,2021-01-19T16:00:00+01:00,NW,2160,32,10.9726,46.96073,Alpinpolizei Sölden,Sölden,10.9726,46.96073,32,coldafterwarm,6,
71,13641,2021-01-20T11:00:00+01:00,W,2251,28,10.7087,47.03911,LK Fendels,Bergstation Planggerlift,10.7087,47.03911,28,coldafterwarm,6,
72,13654,2021-01-19T14:10:00+01:00,N,1918,35,11.2761,47.20295,Walser Benedikt,Axamer Kögele,11.2761,47.20295,35,coldafterwarm,6,
73,13677,2021-01-20T12:00:00+01:00,E,1868,32,12.0565,47.18844,BR Gerlos,Stakerlalm Schönachtal,12.0565,47.18844,32,warmaftercold,6,
74,13748,2021-01-22T12:30:00+01:00,NE,2220,33,11.8281,47.26121,Wierer Stefan,Gem. Aschau / Mizuner See,11.8281,47.26121,33,warmaftercold,1,4.0
75,13794,2021-01-24T12:00:00+01:00,NE,2120,25,11.1194,47.15266,"Ruetz, Spiegl",Koglalm,11.1194,47.15266,25,warmaftercold,2,3.0
76,13797,2021-01-24T12:50:00+01:00,N,1890,10,11.1269,47.15485,"Ruetz, Spiegl",Praxmar,11.1269,47.15485,10,warmaftercold,2,3.0
77,13798,2021-01-24T09:30:00+01:00,NW,2050,35,11.3182,47.09336,r.larcher m.larcher,Elfer Bergstation Schlepplift,11.3182,47.09336,35,warmaftercold,6,
78,13841,2021-01-26T11:20:00+01:00,NE,1820,27,10.4465,47.04942,"Nairz, Jungmann, Verstraeten",Vorderes Kreuzjoch,10.4465,47.04942,27,warmaftercold,6,
79,13864,2021-01-27T11:45:00+01:00,SW,1540,35,10.7449,47.07078,LKK Kaunertal 1,Kaunerberg Wiese,10.7449,47.07078,35,coldafterwarm,6,
80,13869,2021-01-27T13:15:00+01:00,S,2260,36,11.7900,47.19115,"Florian Wechselberger, Bergführer",Horbergkar,11.7900,47.19115,36,coldafterwarm,6,
81,13874,2021-01-27T12:45:00+01:00,E,1990,32,11.5434,47.22829,Paul Dobesberger,Stalsins,11.5431,47.22811,31,warmaftercold,6,
82,13876,2021-01-27T12:45:00+01:00,E,1990,31,11.5431,47.22811,Paul Dobesberger,Stalsins,11.5431,47.22811,31,warmaftercold,6,
83,13882,2021-01-27T12:30:00+01:00,NW,2250,35,11.3831,47.31242,"Nairz, Mitterer",Hafelekar,11.3831,47.31242,35,coldafterwarm,6,
84,13896,2021-01-27T13:20:00+01:00,W,1850,35,11.5028, 47.0439,"Verstraeten, Magis",Padauner Kogel,11.5028, 47.0439,35,warmaftercold,6,
85,13964,2021-01-29T10:30:00+01:00,W,1800,33,11.4196,47.11836,"Jenewein, Ortner, Knoflach",Weißes Wandl,11.4196,47.11836,33,coldafterwarm,6,
86,13965,2021-01-29T13:30:00+01:00,NW,2130,22,11.7569,47.24833,LK Kurs Hochfügen,Teich Pumpstation,11.7569,47.24833,22,coldafterwarm,6,
87,14002,2021-01-30T15:10:00+01:00,N,2172,39,11.0232, 47.2019,Ruetz,Neunerkogel,11.0232, 47.2019,39,coldafterwarm,4,3.0
88,14004,2021-01-30T15:45:00+01:00,N,2170,35,11.0225,47.20213,Ruetz,Neunerkogel,11.0225,47.20213,35,warmaftercold,4,3.0
89,14016,2021-01-30T12:45:00+01:00,S,2565,30,12.3681,46.93418,Andreas Baldinger,Vorgipfel Gasser Hörndle,12.3681,46.93418,30,coldafterwarm,6,
90,14035,2021-01-31T13:30:00+01:00,NW,2228,32,12.2424,46.90428,"LK St. Jakob, Team K",Oberer Erlassboden ,12.2424,46.90428,32,coldafterwarm,6,
91,14042,2021-02-01T11:52:00+01:00,NE,2143,30,10.8362,47.05249,"Marco Beisteiner,Alexander Kunert",Rofelepleis,10.8362,47.05249,30,warmaftercold,6,
92,14080,2021-02-02T12:00:00+01:00,N,2040,38,11.7522,47.32108,"Nairz, Wechselberger",Arbeserkogel,11.7522,47.32108,38,warmaftercold,6,
93,14098,2021-02-01T09:30:00+01:00,W,2100,20,11.1622,47.16192,"Nairz, Ruetz, Lanzanasto",Juifenalm,11.1622,47.16192,20,warmaftercold,,
94,14109,2021-02-03T14:10:00+01:00,S,2470,33,11.1021,47.20357,Ruetz,Sellraintal,11.1021,47.20357,33,coldafterwarm,4,
95,14138,2021-02-04T12:00:00+01:00,NE,2100,31,11.8212,47.22209,"Florian Wechselberger, Bergführer",Arbiskopf-Rauchen,11.8212,47.22209,31,coldafterwarm,6,
96,14157,2021-02-04T12:40:00+01:00,SW,2166,10,10.3153,47.22821,"Stefan und Elli Zangler, Kathi Zimmermann",Hahnleskopf,10.3153,47.22821,10,warmaftercold,6,
97,14189,2021-02-05T12:00:00+01:00,E,1570,34,11.4002,46.99996,Jef Verstraeten,Obernberger Tribulaun Ostseite/ Scheibe,11.4002,46.99996,34,warmaftercold,6,
98,14241,2021-02-06T12:00:00+01:00,N,1900,25,11.5197,47.22485,,Kalte Kuchl,11.5197,47.22485,25,warmaftercold,6,
99,14289,2021-02-08T14:00:00+01:00,NE,1600,39,11.1359,47.15947,"Santer, Veternik, Veternik",Kniepis,11.1359,47.15947,39,coldafterwarm,6,
100,14349,2021-02-11T10:30:00+01:00,N,2000,33,11.8040, 47.1716,Wierer Stefan u. Andreas,Gem. Finkenberg / Knorren,11.8040, 47.1716,33,coldafterwarm,6,
101,14354,2021-02-11T13:30:00+01:00,N,2272,35,11.2918,47.13791,LK Schlick 2000 Jenewein,Bugl - Sennjoch,11.2918,47.13791,35,warmaftercold,2,
102,14396,2021-02-12T13:20:00+01:00,E,2060,25,11.1465,47.24925,"Ruetz, Strasser",Inzinger Hochleger,11.1465,47.24925,25,warmaftercold,1,7.0
103,14479,2021-02-16T14:10:00+01:00,NW,1990,32,11.4525,47.20798,Nairz,Patscherkofel,11.4525,47.20798,32,warmaftercold,2,7.0
104,14543,2021-02-18T13:00:00+01:00,S,2444,20,10.8053,46.82125,"R. Prinz, B. Goger","Hintereis, P 2444",10.8053,46.82125,20,warmaftercold,4,7.0
105,14547,2021-02-18T10:30:00+01:00,E,1550,31,11.0987,47.20184,"Ruetz, Engl, ...",St. Sigmund,11.0987,47.20184,31,warmaftercold,6,
106,14550,2021-02-14T09:55:00+01:00,E,2006,42,11.3825,47.09568,Sillaber Stephan,Kesselspitze,11.3825,47.09568,42,warmaftercold,6,
107,14553,2021-02-15T15:20:00+01:00,SE,2406,30,12.6046,47.03156,Andreas Baldinger,Wetterkreuz unterhalb der Ganimitz,12.6046,47.03156,30,coldafterwarm,6,
108,14564,2021-02-18T10:30:00+01:00,W,2000,32,11.3989,47.32412,"Mitterer, Nairz",Grubach,11.3989,47.32412,32,warmaftercold,6,
109,14565,2021-02-18T12:05:00+01:00,NW,2275,36,11.4092,47.32281,"Nairz, Mitterer",Mandlscharte,11.4092,47.32281,36,warmaftercold,6,
110,14567,2021-02-18T20:00:00+01:00,N,1970,17,11.6369,47.17706,"Nairz, Spannring",Wattener Lizum,11.6369,47.17706,17,warmaftercold,5,
111,14665,2021-02-23T14:10:00+01:00,N,1900,32,10.4622, 47.1502,"Nairz, Mitterer, Mair",Dawinalpe,10.4622, 47.1502,32,warmaftercold,6,
112,14667,2021-02-23T12:50:00+01:00,,2530,0,11.0119,46.87624,"Nairz, Mitterer, Mair",Sonnbergalm oberhalb der Moräne,11.0119,46.87624,0,coldafterwarm,6,
113,14669,2021-02-23T15:05:00+01:00,S,2200,20,10.4252, 46.9862,"Nairz, Mitterer, Mair",Fließer Berg,10.4252, 46.9862,20,warmaftercold,6,
114,14672,2021-02-23T16:30:00+01:00,N,2280,18,10.178 ,46.88374,"Ruetz, BR Kurs",Jamtalhütte,10.178 ,46.88374,18,coldafterwarm,2,3.7
115,14833,2021-03-04T13:10:00+01:00,NW,3270,32,10.9543,46.83011,Dominik Pittl,Hinterer Spiegelkogel,10.9543,46.83011,32,warmaftercold,6,
116,14882,2021-03-09T11:30:00+01:00,NW,1945,33,10.1065,46.91761,Bergführer Ausbildung,Bielerhöhe,10.1065,46.91761,33,coldafterwarm,6,
117,14883,2021-03-09T11:45:00+01:00,E,1928,35,10.1064,46.91765,Bergführerausbildung: Gruppe Stefan,Bielerhöhe,10.1064,46.91765,35,warmaftercold,4,7.0
118,14918,2021-03-11T11:30:00+01:00,NE,2005,35,10.9989,47.19964,Lkk Tiwag,Längental,10.9989,47.19964,35,coldafterwarm,6,
119,14925,2021-03-11T12:10:00+01:00,NE,2240,30,11.7617, 47.2205,"LK Verbund, Stock",Bereich Rosskopf,11.7617, 47.2205,30,warmaftercold,6,
120,14934,2021-03-12T14:45:00+01:00,SE,2440,23,10.9814,46.95252,"Tobias H., Peter R.",Hundskopf,10.9814,46.95252,23,coldafterwarm,6,
121,14944,2021-03-13T10:30:00+01:00,NE,2770,41,11.0135,47.04214,"Hausberger, Pilloni, Lanzanasto",Lochkogel,11.0135,47.04214,41,coldafterwarm,6,
122,15013,2021-03-18T11:00:00+01:00,E,2080,35,11.5379, 47.2265,"Lanzanasto, Waldner, Bonapace",Schartenkogel,11.5379, 47.2265,35,warmaftercold,3,
123,15014,2021-03-18T10:00:00+01:00,E,2140,40,11.5371,47.22536,"Lanzanasto, Waldner, Bonapace",Schartenkogel,11.5371,47.22536,40,warmaftercold,1,
124,15037,2021-03-19T11:20:00+01:00,S,2540,30,12.2001,46.90216,Leitner,Staller Sattel,12.2001,46.90216,30,warmaftercold,6,
125,15041,2021-03-20T11:20:00+01:00,SE,1630,33,11.4692,47.32912,Rainer Prinz,Wasserberg,11.4692,47.32912,33,warmaftercold,6,
126,15073,2021-03-19T15:10:00+01:00,SW,2540,26,11.0694,47.08565,Thomas Schwab,Hoher Seeblaskogl,11.0694,47.08565,26,warmaftercold,6,
127,15085,2021-03-23T10:40:00+01:00,SE,2210,38,11.3898,47.31178,"Mitterer, Larcher",Hafelekarspitze Osthang – Seegrube,11.3898,47.31178,38,warmaftercold,6,
128,15141,2021-03-25T11:10:00+01:00,NW,2000,30,10.5166,47.10296,"Nairz, Falkeis",Giggler Spitze,10.5166,47.10296,30,coldafterwarm,6,
129,15144,2021-03-25T10:15:00+01:00,W,2260,37,10.9929,47.18411,"Neurauter, Scherl",Längental,10.9929,47.18411,37,warmaftercold,6,
130,15241,2021-04-01T10:45:00+02:00,N,2150,36,10.9683,46.95861,"Nairz, Raich, Waldner, Kehl",Rettenbachtal,10.9683,46.95861,36,coldafterwarm,6,
131,15258,2021-04-02T11:00:00+02:00,N,2072,25,10.6789,47.39522,Elli Zangerl,Galtjoch,10.6789,47.39522,25,coldafterwarm,6,
132,15278,2021-04-03T15:40:00+02:00,NW,2415,30,10.3294,47.08722,"Mayer, Kehl",Latte,10.3294,47.08722,30,coldafterwarm,6,
