Stations_name,altitude,LWDNummer,latitude,longitude,ID
Kleiner Beil,1880,AKLE2,47.351489,12.01605,773944
Axams Hoadl,2340,AXLIZ2,47.178394,11.282068,1739797
Fiss Schneestation,2097,FISS2,47.06539444,10.58464724,1259318
Schlicker Alm,1645,FSEE2,47.154432,11.303207,775055
Gallreideschrofen,2180,GGAL2,47.052267,11.335489,774970
Seegrube,1921,ISEE2,47.30638199,11.3779335,775069
Falkaunsalpe,2038,KAUN2,47.071488,10.76282,775243
Kühtai Längental,1917,KUET2,47.2071487,11.00589506,774644
Breiter Grieskogel Schneestation,2385,LBRE2,47.08395278,11.02738333,1305986
Elferspitze Schneestation,2142,NELF2,47.07325001,11.29090555,1312409
Sonnbergalm,2529,SSON2,46.87435,11.01037778,1316440
Burgbach Mauchele,2097,SLBU2,47.10000003,10.79500001,1266549
Rifflsee Talstation Grubenkopf,2227,SLRI2,46.96259,10.852025,775172
Serfaus Masner,2491,SMAS2,47.02011115,10.48847774,1220347
Medrig-Zeinis,1985,SMED2,47.0725,10.4828,774969
Plojen,2065,SPLO2,47.041396,10.558773,775121
Lampsenspitze Schneestation,2111,SSLA2,47.153491,11.120722,774859
Tuxerjoch Schneestation,2380,TTUX2,47.093149,11.648053,775112
Magdeburger Hütte,1646,ZIRL2,47.288393,11.295764,1220416
Silberspitze Schneemessung,2145,ZSIL2,47.18467499,10.5662528,1305965
