The tests in this directory were imported from the W3C repository.
Do NOT modify these tests directly in WebKit.
Instead, create a pull request on the WPT github:
	https://github.com/w3c/web-platform-tests

Then run the Tools/Scripts/import-w3c-tests in WebKit to reimport

Do NOT modify or remove this file.

------------------------------------------------------------------------
Properties requiring vendor prefixes:
None
Property values requiring vendor prefixes:
None
------------------------------------------------------------------------
List of files:
/LayoutTests/imported/w3c/web-platform-tests/html/semantics/links/linktypes/alternate-css-expected.html
/LayoutTests/imported/w3c/web-platform-tests/html/semantics/links/linktypes/alternate-css.html
/LayoutTests/imported/w3c/web-platform-tests/html/semantics/links/linktypes/alternate-import.css
/LayoutTests/imported/w3c/web-platform-tests/html/semantics/links/linktypes/alternate.css
/LayoutTests/imported/w3c/web-platform-tests/html/semantics/links/linktypes/contains.json
/LayoutTests/imported/w3c/web-platform-tests/html/semantics/links/linktypes/original-id.json
/LayoutTests/imported/w3c/web-platform-tests/html/semantics/links/linktypes/preferred.css
