The tests in this directory were imported from the W3C repository.
Do NOT modify these tests directly in WebKit.
Instead, create a pull request on the WPT github:
	https://github.com/w3c/web-platform-tests

Then run the Tools/Scripts/import-w3c-tests in WebKit to reimport

Do NOT modify or remove this file.

------------------------------------------------------------------------
Properties requiring vendor prefixes:
None
Property values requiring vendor prefixes:
None
------------------------------------------------------------------------
List of files:
/LayoutTests/imported/w3c/web-platform-tests/css/css-shapes/shape-outside/supported-shapes/inset/shape-outside-inset-010-expected.html
/LayoutTests/imported/w3c/web-platform-tests/css/css-shapes/shape-outside/supported-shapes/inset/shape-outside-inset-010.html
/LayoutTests/imported/w3c/web-platform-tests/css/css-shapes/shape-outside/supported-shapes/inset/shape-outside-inset-011-expected.html
/LayoutTests/imported/w3c/web-platform-tests/css/css-shapes/shape-outside/supported-shapes/inset/shape-outside-inset-011.html
/LayoutTests/imported/w3c/web-platform-tests/css/css-shapes/shape-outside/supported-shapes/inset/shape-outside-inset-012-expected.html
/LayoutTests/imported/w3c/web-platform-tests/css/css-shapes/shape-outside/supported-shapes/inset/shape-outside-inset-012.html
/LayoutTests/imported/w3c/web-platform-tests/css/css-shapes/shape-outside/supported-shapes/inset/shape-outside-inset-013-expected.html
/LayoutTests/imported/w3c/web-platform-tests/css/css-shapes/shape-outside/supported-shapes/inset/shape-outside-inset-013.html
/LayoutTests/imported/w3c/web-platform-tests/css/css-shapes/shape-outside/supported-shapes/inset/shape-outside-inset-014-expected.html
/LayoutTests/imported/w3c/web-platform-tests/css/css-shapes/shape-outside/supported-shapes/inset/shape-outside-inset-014.html
/LayoutTests/imported/w3c/web-platform-tests/css/css-shapes/shape-outside/supported-shapes/inset/shape-outside-inset-015-expected.html
/LayoutTests/imported/w3c/web-platform-tests/css/css-shapes/shape-outside/supported-shapes/inset/shape-outside-inset-015.html
/LayoutTests/imported/w3c/web-platform-tests/css/css-shapes/shape-outside/supported-shapes/inset/shape-outside-inset-028-expected.html
/LayoutTests/imported/w3c/web-platform-tests/css/css-shapes/shape-outside/supported-shapes/inset/shape-outside-inset-028.html
/LayoutTests/imported/w3c/web-platform-tests/css/css-shapes/shape-outside/supported-shapes/inset/shape-outside-inset-029-expected.html
/LayoutTests/imported/w3c/web-platform-tests/css/css-shapes/shape-outside/supported-shapes/inset/shape-outside-inset-029.html
/LayoutTests/imported/w3c/web-platform-tests/css/css-shapes/shape-outside/supported-shapes/inset/shape-outside-inset-030-expected.html
/LayoutTests/imported/w3c/web-platform-tests/css/css-shapes/shape-outside/supported-shapes/inset/shape-outside-inset-030.html
