(GraphicsLayer
  (anchor 0.00 0.00)
  (bounds 800.00 600.00)
  (children 1
    (GraphicsLayer
      (bounds 800.00 600.00)
      (contentsOpaque 1)
      (children 3
        (GraphicsLayer
          (position 28.00 20.00)
          (bounds 324.00 324.00)
          (children 1
            (GraphicsLayer
              (offsetFromRenderer width=2 height=2)
              (position 2.00 2.00)
              (bounds 320.00 320.00)
              (children 1
                (GraphicsLayer
                  (position 10.00 10.00)
                  (bounds 300.00 300.00)
                  (drawsContent 1)
                  (children 1
                    (GraphicsLayer
                      (offsetFromRenderer width=2 height=2)
                      (position 2.00 2.00)
                      (bounds 281.00 296.00)
                      (children 1
                        (GraphicsLayer
                          (offsetFromRenderer width=2 height=2)
                          (anchor 0.00 0.00)
                          (bounds 281.00 364.00)
                        )
                      )
                    )
                  )
                )
              )
            )
          )
        )
        (GraphicsLayer
          (position 110.00 110.00)
          (bounds 100.00 100.00)
          (contentsOpaque 1)
        )
        (GraphicsLayer
          (offsetFromRenderer width=-20 height=-20)
          (position 42.00 34.00)
          (bounds 281.00 296.00)
          (children 1
            (GraphicsLayer
              (position 20.00 20.00)
              (bounds 241.00 24.00)
              (drawsContent 1)
            )
          )
        )
      )
    )
  )
)

