(['D:\\LectureCutter\\widget.py'],
 ['D:\\LectureCutter'],
 ['codecs'],
 ['d:\\lecturecutter\\venv\\lib\\site-packages\\_pyinstaller_hooks_contrib\\hooks\\stdhooks',
  'd:\\lecturecutter\\venv\\lib\\site-packages\\_pyinstaller_hooks_contrib\\hooks\\stdhooks\\__pycache__',
  'd:\\lecturecutter\\venv\\lib\\site-packages\\_pyinstaller_hooks_contrib\\hooks\\rthooks',
  'd:\\lecturecutter\\venv\\lib\\site-packages\\_pyinstaller_hooks_contrib\\hooks\\rthooks\\__pycache__',
  'd:\\lecturecutter\\venv\\lib\\site-packages\\_pyinstaller_hooks_contrib\\hooks'],
 {},
 [],
 [],
 False,
 False,
 False,
 '3.10.0 (tags/v3.10.0:b494f59, Oct  4 2021, 19:00:18) [MSC v.1929 64 bit '
 '(AMD64)]',
 [('pyi_rth_inspect',
   'D:\\LectureCutter\\venv\\Lib\\site-packages\\PyInstaller\\hooks\\rthooks\\pyi_rth_inspect.py',
   'PYSOURCE'),
  ('pyi_rth_pkgutil',
   'D:\\LectureCutter\\venv\\Lib\\site-packages\\PyInstaller\\hooks\\rthooks\\pyi_rth_pkgutil.py',
   'PYSOURCE'),
  ('pyi_rth_multiprocessing',
   'D:\\LectureCutter\\venv\\Lib\\site-packages\\PyInstaller\\hooks\\rthooks\\pyi_rth_multiprocessing.py',
   'PYSOURCE'),
  ('pyi_rth_pyside6',
   'D:\\LectureCutter\\venv\\Lib\\site-packages\\PyInstaller\\hooks\\rthooks\\pyi_rth_pyside6.py',
   'PYSOURCE'),
  ('widget', 'D:\\LectureCutter\\widget.py', 'PYSOURCE')],
 [('multiprocessing.popen_spawn_posix',
   'C:\\Python310\\lib\\multiprocessing\\popen_spawn_posix.py',
   'PYMODULE'),
  ('multiprocessing.resource_tracker',
   'C:\\Python310\\lib\\multiprocessing\\resource_tracker.py',
   'PYMODULE'),
  ('threading', 'C:\\Python310\\lib\\threading.py', 'PYMODULE'),
  ('_threading_local', 'C:\\Python310\\lib\\_threading_local.py', 'PYMODULE'),
  ('contextlib', 'C:\\Python310\\lib\\contextlib.py', 'PYMODULE'),
  ('_strptime', 'C:\\Python310\\lib\\_strptime.py', 'PYMODULE'),
  ('datetime', 'C:\\Python310\\lib\\datetime.py', 'PYMODULE'),
  ('calendar', 'C:\\Python310\\lib\\calendar.py', 'PYMODULE'),
  ('argparse', 'C:\\Python310\\lib\\argparse.py', 'PYMODULE'),
  ('textwrap', 'C:\\Python310\\lib\\textwrap.py', 'PYMODULE'),
  ('shutil', 'C:\\Python310\\lib\\shutil.py', 'PYMODULE'),
  ('zipfile', 'C:\\Python310\\lib\\zipfile.py', 'PYMODULE'),
  ('py_compile', 'C:\\Python310\\lib\\py_compile.py', 'PYMODULE'),
  ('ntpath', 'C:\\Python310\\lib\\ntpath.py', 'PYMODULE'),
  ('string', 'C:\\Python310\\lib\\string.py', 'PYMODULE'),
  ('genericpath', 'C:\\Python310\\lib\\genericpath.py', 'PYMODULE'),
  ('importlib.machinery',
   'C:\\Python310\\lib\\importlib\\machinery.py',
   'PYMODULE'),
  ('importlib', 'C:\\Python310\\lib\\importlib\\__init__.py', 'PYMODULE'),
  ('importlib.abc', 'C:\\Python310\\lib\\importlib\\abc.py', 'PYMODULE'),
  ('typing', 'C:\\Python310\\lib\\typing.py', 'PYMODULE'),
  ('importlib._abc', 'C:\\Python310\\lib\\importlib\\_abc.py', 'PYMODULE'),
  ('importlib._bootstrap',
   'C:\\Python310\\lib\\importlib\\_bootstrap.py',
   'PYMODULE'),
  ('importlib._bootstrap_external',
   'C:\\Python310\\lib\\importlib\\_bootstrap_external.py',
   'PYMODULE'),
  ('importlib.metadata',
   'C:\\Python310\\lib\\importlib\\metadata\\__init__.py',
   'PYMODULE'),
  ('importlib.metadata._itertools',
   'C:\\Python310\\lib\\importlib\\metadata\\_itertools.py',
   'PYMODULE'),
  ('importlib.metadata._functools',
   'C:\\Python310\\lib\\importlib\\metadata\\_functools.py',
   'PYMODULE'),
  ('importlib.metadata._collections',
   'C:\\Python310\\lib\\importlib\\metadata\\_collections.py',
   'PYMODULE'),
  ('importlib.metadata._meta',
   'C:\\Python310\\lib\\importlib\\metadata\\_meta.py',
   'PYMODULE'),
  ('importlib.metadata._adapters',
   'C:\\Python310\\lib\\importlib\\metadata\\_adapters.py',
   'PYMODULE'),
  ('importlib.metadata._text',
   'C:\\Python310\\lib\\importlib\\metadata\\_text.py',
   'PYMODULE'),
  ('email.message', 'C:\\Python310\\lib\\email\\message.py', 'PYMODULE'),
  ('email.policy', 'C:\\Python310\\lib\\email\\policy.py', 'PYMODULE'),
  ('email.contentmanager',
   'C:\\Python310\\lib\\email\\contentmanager.py',
   'PYMODULE'),
  ('email.quoprimime', 'C:\\Python310\\lib\\email\\quoprimime.py', 'PYMODULE'),
  ('email.headerregistry',
   'C:\\Python310\\lib\\email\\headerregistry.py',
   'PYMODULE'),
  ('email._header_value_parser',
   'C:\\Python310\\lib\\email\\_header_value_parser.py',
   'PYMODULE'),
  ('urllib', 'C:\\Python310\\lib\\urllib\\__init__.py', 'PYMODULE'),
  ('email.iterators', 'C:\\Python310\\lib\\email\\iterators.py', 'PYMODULE'),
  ('email.generator', 'C:\\Python310\\lib\\email\\generator.py', 'PYMODULE'),
  ('random', 'C:\\Python310\\lib\\random.py', 'PYMODULE'),
  ('statistics', 'C:\\Python310\\lib\\statistics.py', 'PYMODULE'),
  ('decimal', 'C:\\Python310\\lib\\decimal.py', 'PYMODULE'),
  ('_pydecimal', 'C:\\Python310\\lib\\_pydecimal.py', 'PYMODULE'),
  ('contextvars', 'C:\\Python310\\lib\\contextvars.py', 'PYMODULE'),
  ('fractions', 'C:\\Python310\\lib\\fractions.py', 'PYMODULE'),
  ('numbers', 'C:\\Python310\\lib\\numbers.py', 'PYMODULE'),
  ('hashlib', 'C:\\Python310\\lib\\hashlib.py', 'PYMODULE'),
  ('logging', 'C:\\Python310\\lib\\logging\\__init__.py', 'PYMODULE'),
  ('pickle', 'C:\\Python310\\lib\\pickle.py', 'PYMODULE'),
  ('pprint', 'C:\\Python310\\lib\\pprint.py', 'PYMODULE'),
  ('dataclasses', 'C:\\Python310\\lib\\dataclasses.py', 'PYMODULE'),
  ('inspect', 'C:\\Python310\\lib\\inspect.py', 'PYMODULE'),
  ('token', 'C:\\Python310\\lib\\token.py', 'PYMODULE'),
  ('dis', 'C:\\Python310\\lib\\dis.py', 'PYMODULE'),
  ('opcode', 'C:\\Python310\\lib\\opcode.py', 'PYMODULE'),
  ('ast', 'C:\\Python310\\lib\\ast.py', 'PYMODULE'),
  ('doctest', 'C:\\Python310\\lib\\doctest.py', 'PYMODULE'),
  ('unittest', 'C:\\Python310\\lib\\unittest\\__init__.py', 'PYMODULE'),
  ('unittest.async_case',
   'C:\\Python310\\lib\\unittest\\async_case.py',
   'PYMODULE'),
  ('asyncio', 'C:\\Python310\\lib\\asyncio\\__init__.py', 'PYMODULE'),
  ('asyncio.unix_events',
   'C:\\Python310\\lib\\asyncio\\unix_events.py',
   'PYMODULE'),
  ('asyncio.log', 'C:\\Python310\\lib\\asyncio\\log.py', 'PYMODULE'),
  ('socket', 'C:\\Python310\\lib\\socket.py', 'PYMODULE'),
  ('selectors', 'C:\\Python310\\lib\\selectors.py', 'PYMODULE'),
  ('asyncio.windows_events',
   'C:\\Python310\\lib\\asyncio\\windows_events.py',
   'PYMODULE'),
  ('asyncio.windows_utils',
   'C:\\Python310\\lib\\asyncio\\windows_utils.py',
   'PYMODULE'),
  ('tempfile', 'C:\\Python310\\lib\\tempfile.py', 'PYMODULE'),
  ('asyncio.selector_events',
   'C:\\Python310\\lib\\asyncio\\selector_events.py',
   'PYMODULE'),
  ('ssl', 'C:\\Python310\\lib\\ssl.py', 'PYMODULE'),
  ('base64', 'C:\\Python310\\lib\\base64.py', 'PYMODULE'),
  ('getopt', 'C:\\Python310\\lib\\getopt.py', 'PYMODULE'),
  ('asyncio.proactor_events',
   'C:\\Python310\\lib\\asyncio\\proactor_events.py',
   'PYMODULE'),
  ('asyncio.base_subprocess',
   'C:\\Python310\\lib\\asyncio\\base_subprocess.py',
   'PYMODULE'),
  ('asyncio.threads', 'C:\\Python310\\lib\\asyncio\\threads.py', 'PYMODULE'),
  ('asyncio.subprocess',
   'C:\\Python310\\lib\\asyncio\\subprocess.py',
   'PYMODULE'),
  ('asyncio.streams', 'C:\\Python310\\lib\\asyncio\\streams.py', 'PYMODULE'),
  ('asyncio.queues', 'C:\\Python310\\lib\\asyncio\\queues.py', 'PYMODULE'),
  ('asyncio.runners', 'C:\\Python310\\lib\\asyncio\\runners.py', 'PYMODULE'),
  ('asyncio.events', 'C:\\Python310\\lib\\asyncio\\events.py', 'PYMODULE'),
  ('asyncio.base_events',
   'C:\\Python310\\lib\\asyncio\\base_events.py',
   'PYMODULE'),
  ('concurrent.futures',
   'C:\\Python310\\lib\\concurrent\\futures\\__init__.py',
   'PYMODULE'),
  ('concurrent.futures.thread',
   'C:\\Python310\\lib\\concurrent\\futures\\thread.py',
   'PYMODULE'),
  ('queue', 'C:\\Python310\\lib\\queue.py', 'PYMODULE'),
  ('concurrent.futures.process',
   'C:\\Python310\\lib\\concurrent\\futures\\process.py',
   'PYMODULE'),
  ('multiprocessing.synchronize',
   'C:\\Python310\\lib\\multiprocessing\\synchronize.py',
   'PYMODULE'),
  ('multiprocessing.heap',
   'C:\\Python310\\lib\\multiprocessing\\heap.py',
   'PYMODULE'),
  ('multiprocessing.process',
   'C:\\Python310\\lib\\multiprocessing\\process.py',
   'PYMODULE'),
  ('multiprocessing.queues',
   'C:\\Python310\\lib\\multiprocessing\\queues.py',
   'PYMODULE'),
  ('multiprocessing.connection',
   'C:\\Python310\\lib\\multiprocessing\\connection.py',
   'PYMODULE'),
  ('multiprocessing.resource_sharer',
   'C:\\Python310\\lib\\multiprocessing\\resource_sharer.py',
   'PYMODULE'),
  ('xmlrpc.client', 'C:\\Python310\\lib\\xmlrpc\\client.py', 'PYMODULE'),
  ('xmlrpc', 'C:\\Python310\\lib\\xmlrpc\\__init__.py', 'PYMODULE'),
  ('gzip', 'C:\\Python310\\lib\\gzip.py', 'PYMODULE'),
  ('_compression', 'C:\\Python310\\lib\\_compression.py', 'PYMODULE'),
  ('xml.parsers.expat',
   'C:\\Python310\\lib\\xml\\parsers\\expat.py',
   'PYMODULE'),
  ('xml.parsers', 'C:\\Python310\\lib\\xml\\parsers\\__init__.py', 'PYMODULE'),
  ('xml', 'C:\\Python310\\lib\\xml\\__init__.py', 'PYMODULE'),
  ('xml.sax.expatreader',
   'C:\\Python310\\lib\\xml\\sax\\expatreader.py',
   'PYMODULE'),
  ('xml.sax.saxutils', 'C:\\Python310\\lib\\xml\\sax\\saxutils.py', 'PYMODULE'),
  ('urllib.request', 'C:\\Python310\\lib\\urllib\\request.py', 'PYMODULE'),
  ('getpass', 'C:\\Python310\\lib\\getpass.py', 'PYMODULE'),
  ('nturl2path', 'C:\\Python310\\lib\\nturl2path.py', 'PYMODULE'),
  ('ftplib', 'C:\\Python310\\lib\\ftplib.py', 'PYMODULE'),
  ('netrc', 'C:\\Python310\\lib\\netrc.py', 'PYMODULE'),
  ('shlex', 'C:\\Python310\\lib\\shlex.py', 'PYMODULE'),
  ('mimetypes', 'C:\\Python310\\lib\\mimetypes.py', 'PYMODULE'),
  ('http.cookiejar', 'C:\\Python310\\lib\\http\\cookiejar.py', 'PYMODULE'),
  ('http', 'C:\\Python310\\lib\\http\\__init__.py', 'PYMODULE'),
  ('urllib.response', 'C:\\Python310\\lib\\urllib\\response.py', 'PYMODULE'),
  ('urllib.error', 'C:\\Python310\\lib\\urllib\\error.py', 'PYMODULE'),
  ('xml.sax', 'C:\\Python310\\lib\\xml\\sax\\__init__.py', 'PYMODULE'),
  ('xml.sax.handler', 'C:\\Python310\\lib\\xml\\sax\\handler.py', 'PYMODULE'),
  ('xml.sax._exceptions',
   'C:\\Python310\\lib\\xml\\sax\\_exceptions.py',
   'PYMODULE'),
  ('xml.sax.xmlreader',
   'C:\\Python310\\lib\\xml\\sax\\xmlreader.py',
   'PYMODULE'),
  ('urllib.parse', 'C:\\Python310\\lib\\urllib\\parse.py', 'PYMODULE'),
  ('http.client', 'C:\\Python310\\lib\\http\\client.py', 'PYMODULE'),
  ('email.parser', 'C:\\Python310\\lib\\email\\parser.py', 'PYMODULE'),
  ('email.feedparser', 'C:\\Python310\\lib\\email\\feedparser.py', 'PYMODULE'),
  ('hmac', 'C:\\Python310\\lib\\hmac.py', 'PYMODULE'),
  ('concurrent.futures._base',
   'C:\\Python310\\lib\\concurrent\\futures\\_base.py',
   'PYMODULE'),
  ('concurrent', 'C:\\Python310\\lib\\concurrent\\__init__.py', 'PYMODULE'),
  ('asyncio.trsock', 'C:\\Python310\\lib\\asyncio\\trsock.py', 'PYMODULE'),
  ('asyncio.staggered',
   'C:\\Python310\\lib\\asyncio\\staggered.py',
   'PYMODULE'),
  ('asyncio.tasks', 'C:\\Python310\\lib\\asyncio\\tasks.py', 'PYMODULE'),
  ('asyncio.base_tasks',
   'C:\\Python310\\lib\\asyncio\\base_tasks.py',
   'PYMODULE'),
  ('asyncio.locks', 'C:\\Python310\\lib\\asyncio\\locks.py', 'PYMODULE'),
  ('asyncio.mixins', 'C:\\Python310\\lib\\asyncio\\mixins.py', 'PYMODULE'),
  ('asyncio.sslproto', 'C:\\Python310\\lib\\asyncio\\sslproto.py', 'PYMODULE'),
  ('asyncio.transports',
   'C:\\Python310\\lib\\asyncio\\transports.py',
   'PYMODULE'),
  ('asyncio.protocols',
   'C:\\Python310\\lib\\asyncio\\protocols.py',
   'PYMODULE'),
  ('asyncio.futures', 'C:\\Python310\\lib\\asyncio\\futures.py', 'PYMODULE'),
  ('asyncio.exceptions',
   'C:\\Python310\\lib\\asyncio\\exceptions.py',
   'PYMODULE'),
  ('asyncio.coroutines',
   'C:\\Python310\\lib\\asyncio\\coroutines.py',
   'PYMODULE'),
  ('asyncio.base_futures',
   'C:\\Python310\\lib\\asyncio\\base_futures.py',
   'PYMODULE'),
  ('asyncio.format_helpers',
   'C:\\Python310\\lib\\asyncio\\format_helpers.py',
   'PYMODULE'),
  ('asyncio.constants',
   'C:\\Python310\\lib\\asyncio\\constants.py',
   'PYMODULE'),
  ('unittest.signals', 'C:\\Python310\\lib\\unittest\\signals.py', 'PYMODULE'),
  ('unittest.main', 'C:\\Python310\\lib\\unittest\\main.py', 'PYMODULE'),
  ('unittest.runner', 'C:\\Python310\\lib\\unittest\\runner.py', 'PYMODULE'),
  ('unittest.loader', 'C:\\Python310\\lib\\unittest\\loader.py', 'PYMODULE'),
  ('unittest.suite', 'C:\\Python310\\lib\\unittest\\suite.py', 'PYMODULE'),
  ('unittest.case', 'C:\\Python310\\lib\\unittest\\case.py', 'PYMODULE'),
  ('unittest._log', 'C:\\Python310\\lib\\unittest\\_log.py', 'PYMODULE'),
  ('unittest.result', 'C:\\Python310\\lib\\unittest\\result.py', 'PYMODULE'),
  ('unittest.util', 'C:\\Python310\\lib\\unittest\\util.py', 'PYMODULE'),
  ('pdb', 'C:\\Python310\\lib\\pdb.py', 'PYMODULE'),
  ('pydoc', 'C:\\Python310\\lib\\pydoc.py', 'PYMODULE'),
  ('webbrowser', 'C:\\Python310\\lib\\webbrowser.py', 'PYMODULE'),
  ('http.server', 'C:\\Python310\\lib\\http\\server.py', 'PYMODULE'),
  ('socketserver', 'C:\\Python310\\lib\\socketserver.py', 'PYMODULE'),
  ('html', 'C:\\Python310\\lib\\html\\__init__.py', 'PYMODULE'),
  ('html.entities', 'C:\\Python310\\lib\\html\\entities.py', 'PYMODULE'),
  ('pydoc_data.topics',
   'C:\\Python310\\lib\\pydoc_data\\topics.py',
   'PYMODULE'),
  ('pydoc_data', 'C:\\Python310\\lib\\pydoc_data\\__init__.py', 'PYMODULE'),
  ('tty', 'C:\\Python310\\lib\\tty.py', 'PYMODULE'),
  ('sysconfig', 'C:\\Python310\\lib\\sysconfig.py', 'PYMODULE'),
  ('_aix_support', 'C:\\Python310\\lib\\_aix_support.py', 'PYMODULE'),
  ('_bootsubprocess', 'C:\\Python310\\lib\\_bootsubprocess.py', 'PYMODULE'),
  ('_osx_support', 'C:\\Python310\\lib\\_osx_support.py', 'PYMODULE'),
  ('platform', 'C:\\Python310\\lib\\platform.py', 'PYMODULE'),
  ('plistlib', 'C:\\Python310\\lib\\plistlib.py', 'PYMODULE'),
  ('pkgutil', 'C:\\Python310\\lib\\pkgutil.py', 'PYMODULE'),
  ('zipimport', 'C:\\Python310\\lib\\zipimport.py', 'PYMODULE'),
  ('runpy', 'C:\\Python310\\lib\\runpy.py', 'PYMODULE'),
  ('glob', 'C:\\Python310\\lib\\glob.py', 'PYMODULE'),
  ('code', 'C:\\Python310\\lib\\code.py', 'PYMODULE'),
  ('codeop', 'C:\\Python310\\lib\\codeop.py', 'PYMODULE'),
  ('bdb', 'C:\\Python310\\lib\\bdb.py', 'PYMODULE'),
  ('cmd', 'C:\\Python310\\lib\\cmd.py', 'PYMODULE'),
  ('difflib', 'C:\\Python310\\lib\\difflib.py', 'PYMODULE'),
  ('__future__', 'C:\\Python310\\lib\\__future__.py', 'PYMODULE'),
  ('_compat_pickle', 'C:\\Python310\\lib\\_compat_pickle.py', 'PYMODULE'),
  ('bisect', 'C:\\Python310\\lib\\bisect.py', 'PYMODULE'),
  ('email._encoded_words',
   'C:\\Python310\\lib\\email\\_encoded_words.py',
   'PYMODULE'),
  ('email.charset', 'C:\\Python310\\lib\\email\\charset.py', 'PYMODULE'),
  ('email.encoders', 'C:\\Python310\\lib\\email\\encoders.py', 'PYMODULE'),
  ('email.base64mime', 'C:\\Python310\\lib\\email\\base64mime.py', 'PYMODULE'),
  ('email._policybase',
   'C:\\Python310\\lib\\email\\_policybase.py',
   'PYMODULE'),
  ('email.header', 'C:\\Python310\\lib\\email\\header.py', 'PYMODULE'),
  ('email.errors', 'C:\\Python310\\lib\\email\\errors.py', 'PYMODULE'),
  ('email.utils', 'C:\\Python310\\lib\\email\\utils.py', 'PYMODULE'),
  ('email._parseaddr', 'C:\\Python310\\lib\\email\\_parseaddr.py', 'PYMODULE'),
  ('quopri', 'C:\\Python310\\lib\\quopri.py', 'PYMODULE'),
  ('uu', 'C:\\Python310\\lib\\uu.py', 'PYMODULE'),
  ('optparse', 'C:\\Python310\\lib\\optparse.py', 'PYMODULE'),
  ('email', 'C:\\Python310\\lib\\email\\__init__.py', 'PYMODULE'),
  ('csv', 'C:\\Python310\\lib\\csv.py', 'PYMODULE'),
  ('importlib.readers',
   'C:\\Python310\\lib\\importlib\\readers.py',
   'PYMODULE'),
  ('tokenize', 'C:\\Python310\\lib\\tokenize.py', 'PYMODULE'),
  ('struct', 'C:\\Python310\\lib\\struct.py', 'PYMODULE'),
  ('posixpath', 'C:\\Python310\\lib\\posixpath.py', 'PYMODULE'),
  ('importlib.util', 'C:\\Python310\\lib\\importlib\\util.py', 'PYMODULE'),
  ('tarfile', 'C:\\Python310\\lib\\tarfile.py', 'PYMODULE'),
  ('lzma', 'C:\\Python310\\lib\\lzma.py', 'PYMODULE'),
  ('bz2', 'C:\\Python310\\lib\\bz2.py', 'PYMODULE'),
  ('fnmatch', 'C:\\Python310\\lib\\fnmatch.py', 'PYMODULE'),
  ('stat', 'C:\\Python310\\lib\\stat.py', 'PYMODULE'),
  ('copy', 'C:\\Python310\\lib\\copy.py', 'PYMODULE'),
  ('gettext', 'C:\\Python310\\lib\\gettext.py', 'PYMODULE'),
  ('signal', 'C:\\Python310\\lib\\signal.py', 'PYMODULE'),
  ('multiprocessing.util',
   'C:\\Python310\\lib\\multiprocessing\\util.py',
   'PYMODULE'),
  ('multiprocessing.forkserver',
   'C:\\Python310\\lib\\multiprocessing\\forkserver.py',
   'PYMODULE'),
  ('multiprocessing.context',
   'C:\\Python310\\lib\\multiprocessing\\context.py',
   'PYMODULE'),
  ('multiprocessing.popen_forkserver',
   'C:\\Python310\\lib\\multiprocessing\\popen_forkserver.py',
   'PYMODULE'),
  ('multiprocessing.sharedctypes',
   'C:\\Python310\\lib\\multiprocessing\\sharedctypes.py',
   'PYMODULE'),
  ('ctypes', 'C:\\Python310\\lib\\ctypes\\__init__.py', 'PYMODULE'),
  ('ctypes._endian', 'C:\\Python310\\lib\\ctypes\\_endian.py', 'PYMODULE'),
  ('multiprocessing.pool',
   'C:\\Python310\\lib\\multiprocessing\\pool.py',
   'PYMODULE'),
  ('multiprocessing.dummy',
   'C:\\Python310\\lib\\multiprocessing\\dummy\\__init__.py',
   'PYMODULE'),
  ('multiprocessing.dummy.connection',
   'C:\\Python310\\lib\\multiprocessing\\dummy\\connection.py',
   'PYMODULE'),
  ('multiprocessing.managers',
   'C:\\Python310\\lib\\multiprocessing\\managers.py',
   'PYMODULE'),
  ('multiprocessing.shared_memory',
   'C:\\Python310\\lib\\multiprocessing\\shared_memory.py',
   'PYMODULE'),
  ('secrets', 'C:\\Python310\\lib\\secrets.py', 'PYMODULE'),
  ('multiprocessing.reduction',
   'C:\\Python310\\lib\\multiprocessing\\reduction.py',
   'PYMODULE'),
  ('multiprocessing.popen_fork',
   'C:\\Python310\\lib\\multiprocessing\\popen_fork.py',
   'PYMODULE'),
  ('multiprocessing.popen_spawn_win32',
   'C:\\Python310\\lib\\multiprocessing\\popen_spawn_win32.py',
   'PYMODULE'),
  ('subprocess', 'C:\\Python310\\lib\\subprocess.py', 'PYMODULE'),
  ('multiprocessing.spawn',
   'C:\\Python310\\lib\\multiprocessing\\spawn.py',
   'PYMODULE'),
  ('multiprocessing',
   'C:\\Python310\\lib\\multiprocessing\\__init__.py',
   'PYMODULE'),
  ('tracemalloc', 'C:\\Python310\\lib\\tracemalloc.py', 'PYMODULE'),
  ('_py_abc', 'C:\\Python310\\lib\\_py_abc.py', 'PYMODULE'),
  ('stringprep', 'C:\\Python310\\lib\\stringprep.py', 'PYMODULE'),
  ('numpy',
   'd:\\lecturecutter\\venv\\lib\\site-packages\\numpy\\__init__.py',
   'PYMODULE'),
  ('numpy.core._dtype_ctypes',
   'd:\\lecturecutter\\venv\\lib\\site-packages\\numpy\\core\\_dtype_ctypes.py',
   'PYMODULE'),
  ('numpy.version',
   'd:\\lecturecutter\\venv\\lib\\site-packages\\numpy\\version.py',
   'PYMODULE'),
  ('numpy._version',
   'd:\\lecturecutter\\venv\\lib\\site-packages\\numpy\\_version.py',
   'PYMODULE'),
  ('json', 'C:\\Python310\\lib\\json\\__init__.py', 'PYMODULE'),
  ('json.encoder', 'C:\\Python310\\lib\\json\\encoder.py', 'PYMODULE'),
  ('json.decoder', 'C:\\Python310\\lib\\json\\decoder.py', 'PYMODULE'),
  ('json.scanner', 'C:\\Python310\\lib\\json\\scanner.py', 'PYMODULE'),
  ('numpy._pytesttester',
   'd:\\lecturecutter\\venv\\lib\\site-packages\\numpy\\_pytesttester.py',
   'PYMODULE'),
  ('numpy.testing',
   'd:\\lecturecutter\\venv\\lib\\site-packages\\numpy\\testing\\__init__.py',
   'PYMODULE'),
  ('numpy.testing._private.nosetester',
   'd:\\lecturecutter\\venv\\lib\\site-packages\\numpy\\testing\\_private\\nosetester.py',
   'PYMODULE'),
  ('numpy.testing._private.noseclasses',
   'd:\\lecturecutter\\venv\\lib\\site-packages\\numpy\\testing\\_private\\noseclasses.py',
   'PYMODULE'),
  ('numpy.testing._private.decorators',
   'd:\\lecturecutter\\venv\\lib\\site-packages\\numpy\\testing\\_private\\decorators.py',
   'PYMODULE'),
  ('numpy.testing._private.parameterized',
   'd:\\lecturecutter\\venv\\lib\\site-packages\\numpy\\testing\\_private\\parameterized.py',
   'PYMODULE'),
  ('numpy.testing._private.extbuild',
   'd:\\lecturecutter\\venv\\lib\\site-packages\\numpy\\testing\\_private\\extbuild.py',
   'PYMODULE'),
  ('numpy.testing._private',
   'd:\\lecturecutter\\venv\\lib\\site-packages\\numpy\\testing\\_private\\__init__.py',
   'PYMODULE'),
  ('numpy.testing._private.utils',
   'd:\\lecturecutter\\venv\\lib\\site-packages\\numpy\\testing\\_private\\utils.py',
   'PYMODULE'),
  ('numpy.core.fromnumeric',
   'd:\\lecturecutter\\venv\\lib\\site-packages\\numpy\\core\\fromnumeric.py',
   'PYMODULE'),
  ('numpy.core._methods',
   'd:\\lecturecutter\\venv\\lib\\site-packages\\numpy\\core\\_methods.py',
   'PYMODULE'),
  ('numpy.lib.stride_tricks',
   'd:\\lecturecutter\\venv\\lib\\site-packages\\numpy\\lib\\stride_tricks.py',
   'PYMODULE'),
  ('numpy.core.numeric',
   'd:\\lecturecutter\\venv\\lib\\site-packages\\numpy\\core\\numeric.py',
   'PYMODULE'),
  ('numpy.core._asarray',
   'd:\\lecturecutter\\venv\\lib\\site-packages\\numpy\\core\\_asarray.py',
   'PYMODULE'),
  ('numpy.core.arrayprint',
   'd:\\lecturecutter\\venv\\lib\\site-packages\\numpy\\core\\arrayprint.py',
   'PYMODULE'),
  ('numpy.core._ufunc_config',
   'd:\\lecturecutter\\venv\\lib\\site-packages\\numpy\\core\\_ufunc_config.py',
   'PYMODULE'),
  ('numpy.core.shape_base',
   'd:\\lecturecutter\\venv\\lib\\site-packages\\numpy\\core\\shape_base.py',
   'PYMODULE'),
  ('numpy.core._exceptions',
   'd:\\lecturecutter\\venv\\lib\\site-packages\\numpy\\core\\_exceptions.py',
   'PYMODULE'),
  ('numpy.core.umath',
   'd:\\lecturecutter\\venv\\lib\\site-packages\\numpy\\core\\umath.py',
   'PYMODULE'),
  ('numpy.core.overrides',
   'd:\\lecturecutter\\venv\\lib\\site-packages\\numpy\\core\\overrides.py',
   'PYMODULE'),
  ('numpy.compat._inspect',
   'd:\\lecturecutter\\venv\\lib\\site-packages\\numpy\\compat\\_inspect.py',
   'PYMODULE'),
  ('numpy.core.multiarray',
   'd:\\lecturecutter\\venv\\lib\\site-packages\\numpy\\core\\multiarray.py',
   'PYMODULE'),
  ('numpy.core.numerictypes',
   'd:\\lecturecutter\\venv\\lib\\site-packages\\numpy\\core\\numerictypes.py',
   'PYMODULE'),
  ('numpy.core._dtype',
   'd:\\lecturecutter\\venv\\lib\\site-packages\\numpy\\core\\_dtype.py',
   'PYMODULE'),
  ('numpy.core._type_aliases',
   'd:\\lecturecutter\\venv\\lib\\site-packages\\numpy\\core\\_type_aliases.py',
   'PYMODULE'),
  ('numpy.core._string_helpers',
   'd:\\lecturecutter\\venv\\lib\\site-packages\\numpy\\core\\_string_helpers.py',
   'PYMODULE'),
  ('numpy.matrixlib',
   'd:\\lecturecutter\\venv\\lib\\site-packages\\numpy\\matrixlib\\__init__.py',
   'PYMODULE'),
  ('numpy.matrixlib.defmatrix',
   'd:\\lecturecutter\\venv\\lib\\site-packages\\numpy\\matrixlib\\defmatrix.py',
   'PYMODULE'),
  ('numpy.ma',
   'd:\\lecturecutter\\venv\\lib\\site-packages\\numpy\\ma\\__init__.py',
   'PYMODULE'),
  ('numpy.ma.extras',
   'd:\\lecturecutter\\venv\\lib\\site-packages\\numpy\\ma\\extras.py',
   'PYMODULE'),
  ('numpy.lib.index_tricks',
   'd:\\lecturecutter\\venv\\lib\\site-packages\\numpy\\lib\\index_tricks.py',
   'PYMODULE'),
  ('numpy.lib.function_base',
   'd:\\lecturecutter\\venv\\lib\\site-packages\\numpy\\lib\\function_base.py',
   'PYMODULE'),
  ('numpy.lib.histograms',
   'd:\\lecturecutter\\venv\\lib\\site-packages\\numpy\\lib\\histograms.py',
   'PYMODULE'),
  ('numpy.lib.twodim_base',
   'd:\\lecturecutter\\venv\\lib\\site-packages\\numpy\\lib\\twodim_base.py',
   'PYMODULE'),
  ('numpy.core.function_base',
   'd:\\lecturecutter\\venv\\lib\\site-packages\\numpy\\core\\function_base.py',
   'PYMODULE'),
  ('numpy.ma.core',
   'd:\\lecturecutter\\venv\\lib\\site-packages\\numpy\\ma\\core.py',
   'PYMODULE'),
  ('numpy.ctypeslib',
   'd:\\lecturecutter\\venv\\lib\\site-packages\\numpy\\ctypeslib.py',
   'PYMODULE'),
  ('numpy.core._internal',
   'd:\\lecturecutter\\venv\\lib\\site-packages\\numpy\\core\\_internal.py',
   'PYMODULE'),
  ('numpy.random',
   'd:\\lecturecutter\\venv\\lib\\site-packages\\numpy\\random\\__init__.py',
   'PYMODULE'),
  ('numpy.random._pickle',
   'd:\\lecturecutter\\venv\\lib\\site-packages\\numpy\\random\\_pickle.py',
   'PYMODULE'),
  ('numpy.polynomial',
   'd:\\lecturecutter\\venv\\lib\\site-packages\\numpy\\polynomial\\__init__.py',
   'PYMODULE'),
  ('numpy.polynomial._polybase',
   'd:\\lecturecutter\\venv\\lib\\site-packages\\numpy\\polynomial\\_polybase.py',
   'PYMODULE'),
  ('numpy.polynomial.laguerre',
   'd:\\lecturecutter\\venv\\lib\\site-packages\\numpy\\polynomial\\laguerre.py',
   'PYMODULE'),
  ('numpy.polynomial.hermite_e',
   'd:\\lecturecutter\\venv\\lib\\site-packages\\numpy\\polynomial\\hermite_e.py',
   'PYMODULE'),
  ('numpy.polynomial.hermite',
   'd:\\lecturecutter\\venv\\lib\\site-packages\\numpy\\polynomial\\hermite.py',
   'PYMODULE'),
  ('numpy.polynomial.legendre',
   'd:\\lecturecutter\\venv\\lib\\site-packages\\numpy\\polynomial\\legendre.py',
   'PYMODULE'),
  ('numpy.polynomial.chebyshev',
   'd:\\lecturecutter\\venv\\lib\\site-packages\\numpy\\polynomial\\chebyshev.py',
   'PYMODULE'),
  ('numpy.polynomial.polynomial',
   'd:\\lecturecutter\\venv\\lib\\site-packages\\numpy\\polynomial\\polynomial.py',
   'PYMODULE'),
  ('numpy.polynomial.polyutils',
   'd:\\lecturecutter\\venv\\lib\\site-packages\\numpy\\polynomial\\polyutils.py',
   'PYMODULE'),
  ('numpy.fft',
   'd:\\lecturecutter\\venv\\lib\\site-packages\\numpy\\fft\\__init__.py',
   'PYMODULE'),
  ('numpy.fft.helper',
   'd:\\lecturecutter\\venv\\lib\\site-packages\\numpy\\fft\\helper.py',
   'PYMODULE'),
  ('numpy.fft._pocketfft',
   'd:\\lecturecutter\\venv\\lib\\site-packages\\numpy\\fft\\_pocketfft.py',
   'PYMODULE'),
  ('numpy.linalg',
   'd:\\lecturecutter\\venv\\lib\\site-packages\\numpy\\linalg\\__init__.py',
   'PYMODULE'),
  ('numpy.linalg.linalg',
   'd:\\lecturecutter\\venv\\lib\\site-packages\\numpy\\linalg\\linalg.py',
   'PYMODULE'),
  ('numpy.lib',
   'd:\\lecturecutter\\venv\\lib\\site-packages\\numpy\\lib\\__init__.py',
   'PYMODULE'),
  ('numpy.lib._version',
   'd:\\lecturecutter\\venv\\lib\\site-packages\\numpy\\lib\\_version.py',
   'PYMODULE'),
  ('numpy.lib.arraypad',
   'd:\\lecturecutter\\venv\\lib\\site-packages\\numpy\\lib\\arraypad.py',
   'PYMODULE'),
  ('numpy.lib.arrayterator',
   'd:\\lecturecutter\\venv\\lib\\site-packages\\numpy\\lib\\arrayterator.py',
   'PYMODULE'),
  ('numpy.lib.npyio',
   'd:\\lecturecutter\\venv\\lib\\site-packages\\numpy\\lib\\npyio.py',
   'PYMODULE'),
  ('numpy.ma.mrecords',
   'd:\\lecturecutter\\venv\\lib\\site-packages\\numpy\\ma\\mrecords.py',
   'PYMODULE'),
  ('numpy.core.records',
   'd:\\lecturecutter\\venv\\lib\\site-packages\\numpy\\core\\records.py',
   'PYMODULE'),
  ('numpy.lib._iotools',
   'd:\\lecturecutter\\venv\\lib\\site-packages\\numpy\\lib\\_iotools.py',
   'PYMODULE'),
  ('numpy.lib._datasource',
   'd:\\lecturecutter\\venv\\lib\\site-packages\\numpy\\lib\\_datasource.py',
   'PYMODULE'),
  ('numpy.lib.format',
   'd:\\lecturecutter\\venv\\lib\\site-packages\\numpy\\lib\\format.py',
   'PYMODULE'),
  ('numpy.lib.arraysetops',
   'd:\\lecturecutter\\venv\\lib\\site-packages\\numpy\\lib\\arraysetops.py',
   'PYMODULE'),
  ('numpy.lib.utils',
   'd:\\lecturecutter\\venv\\lib\\site-packages\\numpy\\lib\\utils.py',
   'PYMODULE'),
  ('numpy.lib.polynomial',
   'd:\\lecturecutter\\venv\\lib\\site-packages\\numpy\\lib\\polynomial.py',
   'PYMODULE'),
  ('numpy.lib.ufunclike',
   'd:\\lecturecutter\\venv\\lib\\site-packages\\numpy\\lib\\ufunclike.py',
   'PYMODULE'),
  ('numpy.lib.shape_base',
   'd:\\lecturecutter\\venv\\lib\\site-packages\\numpy\\lib\\shape_base.py',
   'PYMODULE'),
  ('numpy.lib.nanfunctions',
   'd:\\lecturecutter\\venv\\lib\\site-packages\\numpy\\lib\\nanfunctions.py',
   'PYMODULE'),
  ('numpy.lib.type_check',
   'd:\\lecturecutter\\venv\\lib\\site-packages\\numpy\\lib\\type_check.py',
   'PYMODULE'),
  ('numpy.core.getlimits',
   'd:\\lecturecutter\\venv\\lib\\site-packages\\numpy\\core\\getlimits.py',
   'PYMODULE'),
  ('numpy.core._machar',
   'd:\\lecturecutter\\venv\\lib\\site-packages\\numpy\\core\\_machar.py',
   'PYMODULE'),
  ('numpy.lib.scimath',
   'd:\\lecturecutter\\venv\\lib\\site-packages\\numpy\\lib\\scimath.py',
   'PYMODULE'),
  ('numpy.lib.mixins',
   'd:\\lecturecutter\\venv\\lib\\site-packages\\numpy\\lib\\mixins.py',
   'PYMODULE'),
  ('numpy.compat',
   'd:\\lecturecutter\\venv\\lib\\site-packages\\numpy\\compat\\__init__.py',
   'PYMODULE'),
  ('numpy.compat.py3k',
   'd:\\lecturecutter\\venv\\lib\\site-packages\\numpy\\compat\\py3k.py',
   'PYMODULE'),
  ('numpy.core',
   'd:\\lecturecutter\\venv\\lib\\site-packages\\numpy\\core\\__init__.py',
   'PYMODULE'),
  ('numpy.core._add_newdocs_scalars',
   'd:\\lecturecutter\\venv\\lib\\site-packages\\numpy\\core\\_add_newdocs_scalars.py',
   'PYMODULE'),
  ('numpy.core._add_newdocs',
   'd:\\lecturecutter\\venv\\lib\\site-packages\\numpy\\core\\_add_newdocs.py',
   'PYMODULE'),
  ('numpy.core.einsumfunc',
   'd:\\lecturecutter\\venv\\lib\\site-packages\\numpy\\core\\einsumfunc.py',
   'PYMODULE'),
  ('numpy.core.memmap',
   'd:\\lecturecutter\\venv\\lib\\site-packages\\numpy\\core\\memmap.py',
   'PYMODULE'),
  ('numpy.core.defchararray',
   'd:\\lecturecutter\\venv\\lib\\site-packages\\numpy\\core\\defchararray.py',
   'PYMODULE'),
  ('numpy._distributor_init',
   'd:\\lecturecutter\\venv\\lib\\site-packages\\numpy\\_distributor_init.py',
   'PYMODULE'),
  ('numpy.__config__',
   'd:\\lecturecutter\\venv\\lib\\site-packages\\numpy\\__config__.py',
   'PYMODULE'),
  ('numpy.array_api',
   'd:\\lecturecutter\\venv\\lib\\site-packages\\numpy\\array_api\\__init__.py',
   'PYMODULE'),
  ('numpy.array_api._utility_functions',
   'd:\\lecturecutter\\venv\\lib\\site-packages\\numpy\\array_api\\_utility_functions.py',
   'PYMODULE'),
  ('numpy.array_api._array_object',
   'd:\\lecturecutter\\venv\\lib\\site-packages\\numpy\\array_api\\_array_object.py',
   'PYMODULE'),
  ('numpy.typing',
   'd:\\lecturecutter\\venv\\lib\\site-packages\\numpy\\typing\\__init__.py',
   'PYMODULE'),
  ('numpy.typing._add_docstring',
   'd:\\lecturecutter\\venv\\lib\\site-packages\\numpy\\typing\\_add_docstring.py',
   'PYMODULE'),
  ('numpy.typing._generic_alias',
   'd:\\lecturecutter\\venv\\lib\\site-packages\\numpy\\typing\\_generic_alias.py',
   'PYMODULE'),
  ('numpy.typing._array_like',
   'd:\\lecturecutter\\venv\\lib\\site-packages\\numpy\\typing\\_array_like.py',
   'PYMODULE'),
  ('numpy.typing._dtype_like',
   'd:\\lecturecutter\\venv\\lib\\site-packages\\numpy\\typing\\_dtype_like.py',
   'PYMODULE'),
  ('numpy.typing._shape',
   'd:\\lecturecutter\\venv\\lib\\site-packages\\numpy\\typing\\_shape.py',
   'PYMODULE'),
  ('numpy.typing._scalars',
   'd:\\lecturecutter\\venv\\lib\\site-packages\\numpy\\typing\\_scalars.py',
   'PYMODULE'),
  ('numpy.typing._char_codes',
   'd:\\lecturecutter\\venv\\lib\\site-packages\\numpy\\typing\\_char_codes.py',
   'PYMODULE'),
  ('numpy.typing._nbit',
   'd:\\lecturecutter\\venv\\lib\\site-packages\\numpy\\typing\\_nbit.py',
   'PYMODULE'),
  ('numpy.typing._nested_sequence',
   'd:\\lecturecutter\\venv\\lib\\site-packages\\numpy\\typing\\_nested_sequence.py',
   'PYMODULE'),
  ('numpy.array_api._typing',
   'd:\\lecturecutter\\venv\\lib\\site-packages\\numpy\\array_api\\_typing.py',
   'PYMODULE'),
  ('numpy.array_api._statistical_functions',
   'd:\\lecturecutter\\venv\\lib\\site-packages\\numpy\\array_api\\_statistical_functions.py',
   'PYMODULE'),
  ('numpy.array_api._sorting_functions',
   'd:\\lecturecutter\\venv\\lib\\site-packages\\numpy\\array_api\\_sorting_functions.py',
   'PYMODULE'),
  ('numpy.array_api._set_functions',
   'd:\\lecturecutter\\venv\\lib\\site-packages\\numpy\\array_api\\_set_functions.py',
   'PYMODULE'),
  ('numpy.array_api._searching_functions',
   'd:\\lecturecutter\\venv\\lib\\site-packages\\numpy\\array_api\\_searching_functions.py',
   'PYMODULE'),
  ('numpy.array_api._manipulation_functions',
   'd:\\lecturecutter\\venv\\lib\\site-packages\\numpy\\array_api\\_manipulation_functions.py',
   'PYMODULE'),
  ('numpy.array_api.linalg',
   'd:\\lecturecutter\\venv\\lib\\site-packages\\numpy\\array_api\\linalg.py',
   'PYMODULE'),
  ('numpy.array_api._elementwise_functions',
   'd:\\lecturecutter\\venv\\lib\\site-packages\\numpy\\array_api\\_elementwise_functions.py',
   'PYMODULE'),
  ('numpy.array_api._dtypes',
   'd:\\lecturecutter\\venv\\lib\\site-packages\\numpy\\array_api\\_dtypes.py',
   'PYMODULE'),
  ('numpy.array_api._data_type_functions',
   'd:\\lecturecutter\\venv\\lib\\site-packages\\numpy\\array_api\\_data_type_functions.py',
   'PYMODULE'),
  ('numpy.array_api._creation_functions',
   'd:\\lecturecutter\\venv\\lib\\site-packages\\numpy\\array_api\\_creation_functions.py',
   'PYMODULE'),
  ('numpy.array_api._constants',
   'd:\\lecturecutter\\venv\\lib\\site-packages\\numpy\\array_api\\_constants.py',
   'PYMODULE'),
  ('numpy._globals',
   'd:\\lecturecutter\\venv\\lib\\site-packages\\numpy\\_globals.py',
   'PYMODULE'),
  ('cv2',
   'd:\\lecturecutter\\venv\\lib\\site-packages\\cv2\\__init__.py',
   'PYMODULE'),
  ('cv2.load_config_py3',
   'd:\\lecturecutter\\venv\\lib\\site-packages\\cv2\\load_config_py3.py',
   'PYMODULE'),
  ('cv2.load_config_py2',
   'd:\\lecturecutter\\venv\\lib\\site-packages\\cv2\\load_config_py2.py',
   'PYMODULE'),
  ('cv2.version',
   'd:\\lecturecutter\\venv\\lib\\site-packages\\cv2\\version.py',
   'PYMODULE'),
  ('cv2.data',
   'd:\\lecturecutter\\venv\\lib\\site-packages\\cv2\\data\\__init__.py',
   'PYMODULE'),
  ('cv2.utils',
   'd:\\lecturecutter\\venv\\lib\\site-packages\\cv2\\utils\\__init__.py',
   'PYMODULE'),
  ('cv2.misc',
   'd:\\lecturecutter\\venv\\lib\\site-packages\\cv2\\misc\\__init__.py',
   'PYMODULE'),
  ('cv2.misc.version',
   'd:\\lecturecutter\\venv\\lib\\site-packages\\cv2\\misc\\version.py',
   'PYMODULE'),
  ('cv2.gapi',
   'd:\\lecturecutter\\venv\\lib\\site-packages\\cv2\\gapi\\__init__.py',
   'PYMODULE'),
  ('cv2.mat_wrapper',
   'd:\\lecturecutter\\venv\\lib\\site-packages\\cv2\\mat_wrapper\\__init__.py',
   'PYMODULE'),
  ('PySide6',
   'd:\\lecturecutter\\venv\\lib\\site-packages\\PySide6\\__init__.py',
   'PYMODULE'),
  ('shiboken6',
   'd:\\lecturecutter\\venv\\lib\\site-packages\\shiboken6\\__init__.py',
   'PYMODULE'),
  ('pathlib', 'C:\\Python310\\lib\\pathlib.py', 'PYMODULE'),
  ('os', 'C:\\Python310\\lib\\os.py', 'PYMODULE')],
 [('python310.dll', 'C:\\Python310\\python310.dll', 'BINARY'),
  ('VCRUNTIME140.dll', 'C:\\Python310\\VCRUNTIME140.dll', 'BINARY'),
  ('PySide6\\plugins\\iconengines\\qsvgicon.dll',
   'D:\\lecturecutter\\venv\\lib\\site-packages\\PySide6\\plugins\\iconengines\\qsvgicon.dll',
   'BINARY'),
  ('PySide6\\plugins\\styles\\qwindowsvistastyle.dll',
   'D:\\lecturecutter\\venv\\lib\\site-packages\\PySide6\\plugins\\styles\\qwindowsvistastyle.dll',
   'BINARY'),
  ('PySide6\\plugins\\imageformats\\qtga.dll',
   'D:\\lecturecutter\\venv\\lib\\site-packages\\PySide6\\plugins\\imageformats\\qtga.dll',
   'BINARY'),
  ('opengl32sw.dll',
   'D:\\lecturecutter\\venv\\lib\\site-packages\\PySide6\\opengl32sw.dll',
   'BINARY'),
  ('libopenblas.EL2C6PLE4ZYW3ECEVIV3OXXGRN2NRFM2.gfortran-win_amd64.dll',
   'd:\\lecturecutter\\venv\\lib\\site-packages\\numpy\\.libs\\libopenblas.EL2C6PLE4ZYW3ECEVIV3OXXGRN2NRFM2.gfortran-win_amd64.dll',
   'BINARY'),
  ('PySide6\\plugins\\imageformats\\qwebp.dll',
   'D:\\lecturecutter\\venv\\lib\\site-packages\\PySide6\\plugins\\imageformats\\qwebp.dll',
   'BINARY'),
  ('PySide6\\plugins\\tls\\qcertonlybackend.dll',
   'D:\\lecturecutter\\venv\\lib\\site-packages\\PySide6\\plugins\\tls\\qcertonlybackend.dll',
   'BINARY'),
  ('PySide6\\plugins\\imageformats\\qgif.dll',
   'D:\\lecturecutter\\venv\\lib\\site-packages\\PySide6\\plugins\\imageformats\\qgif.dll',
   'BINARY'),
  ('PySide6\\plugins\\imageformats\\qjpeg.dll',
   'D:\\lecturecutter\\venv\\lib\\site-packages\\PySide6\\plugins\\imageformats\\qjpeg.dll',
   'BINARY'),
  ('PySide6\\plugins\\tls\\qschannelbackend.dll',
   'D:\\lecturecutter\\venv\\lib\\site-packages\\PySide6\\plugins\\tls\\qschannelbackend.dll',
   'BINARY'),
  ('PySide6\\plugins\\imageformats\\qwbmp.dll',
   'D:\\lecturecutter\\venv\\lib\\site-packages\\PySide6\\plugins\\imageformats\\qwbmp.dll',
   'BINARY'),
  ('PySide6\\plugins\\tls\\qopensslbackend.dll',
   'D:\\lecturecutter\\venv\\lib\\site-packages\\PySide6\\plugins\\tls\\qopensslbackend.dll',
   'BINARY'),
  ('PySide6\\plugins\\networkinformation\\qnetworklistmanager.dll',
   'D:\\lecturecutter\\venv\\lib\\site-packages\\PySide6\\plugins\\networkinformation\\qnetworklistmanager.dll',
   'BINARY'),
  ('PySide6\\plugins\\imageformats\\qico.dll',
   'D:\\lecturecutter\\venv\\lib\\site-packages\\PySide6\\plugins\\imageformats\\qico.dll',
   'BINARY'),
  ('cv2\\opencv_videoio_ffmpeg455_64.dll',
   'd:\\lecturecutter\\venv\\lib\\site-packages\\cv2\\opencv_videoio_ffmpeg455_64.dll',
   'BINARY'),
  ('PySide6\\plugins\\platforms\\qdirect2d.dll',
   'D:\\lecturecutter\\venv\\lib\\site-packages\\PySide6\\plugins\\platforms\\qdirect2d.dll',
   'BINARY'),
  ('PySide6\\plugins\\platforms\\qoffscreen.dll',
   'D:\\lecturecutter\\venv\\lib\\site-packages\\PySide6\\plugins\\platforms\\qoffscreen.dll',
   'BINARY'),
  ('PySide6\\plugins\\platforminputcontexts\\qtvirtualkeyboardplugin.dll',
   'D:\\lecturecutter\\venv\\lib\\site-packages\\PySide6\\plugins\\platforminputcontexts\\qtvirtualkeyboardplugin.dll',
   'BINARY'),
  ('PySide6\\plugins\\imageformats\\qtiff.dll',
   'D:\\lecturecutter\\venv\\lib\\site-packages\\PySide6\\plugins\\imageformats\\qtiff.dll',
   'BINARY'),
  ('PySide6\\plugins\\imageformats\\qsvg.dll',
   'D:\\lecturecutter\\venv\\lib\\site-packages\\PySide6\\plugins\\imageformats\\qsvg.dll',
   'BINARY'),
  ('PySide6\\plugins\\imageformats\\qicns.dll',
   'D:\\lecturecutter\\venv\\lib\\site-packages\\PySide6\\plugins\\imageformats\\qicns.dll',
   'BINARY'),
  ('PySide6\\plugins\\platforms\\qwindows.dll',
   'D:\\lecturecutter\\venv\\lib\\site-packages\\PySide6\\plugins\\platforms\\qwindows.dll',
   'BINARY'),
  ('PySide6\\plugins\\platforms\\qminimal.dll',
   'D:\\lecturecutter\\venv\\lib\\site-packages\\PySide6\\plugins\\platforms\\qminimal.dll',
   'BINARY'),
  ('_multiprocessing',
   'C:\\Python310\\DLLs\\_multiprocessing.pyd',
   'EXTENSION'),
  ('_decimal', 'C:\\Python310\\DLLs\\_decimal.pyd', 'EXTENSION'),
  ('_socket', 'C:\\Python310\\DLLs\\_socket.pyd', 'EXTENSION'),
  ('select', 'C:\\Python310\\DLLs\\select.pyd', 'EXTENSION'),
  ('_overlapped', 'C:\\Python310\\DLLs\\_overlapped.pyd', 'EXTENSION'),
  ('_ssl', 'C:\\Python310\\DLLs\\_ssl.pyd', 'EXTENSION'),
  ('_asyncio', 'C:\\Python310\\DLLs\\_asyncio.pyd', 'EXTENSION'),
  ('_queue', 'C:\\Python310\\DLLs\\_queue.pyd', 'EXTENSION'),
  ('pyexpat', 'C:\\Python310\\DLLs\\pyexpat.pyd', 'EXTENSION'),
  ('unicodedata', 'C:\\Python310\\DLLs\\unicodedata.pyd', 'EXTENSION'),
  ('_hashlib', 'C:\\Python310\\DLLs\\_hashlib.pyd', 'EXTENSION'),
  ('_lzma', 'C:\\Python310\\DLLs\\_lzma.pyd', 'EXTENSION'),
  ('_bz2', 'C:\\Python310\\DLLs\\_bz2.pyd', 'EXTENSION'),
  ('_ctypes', 'C:\\Python310\\DLLs\\_ctypes.pyd', 'EXTENSION'),
  ('numpy.core._multiarray_tests',
   'd:\\lecturecutter\\venv\\lib\\site-packages\\numpy\\core\\_multiarray_tests.cp310-win_amd64.pyd',
   'EXTENSION'),
  ('numpy.core._multiarray_umath',
   'd:\\lecturecutter\\venv\\lib\\site-packages\\numpy\\core\\_multiarray_umath.cp310-win_amd64.pyd',
   'EXTENSION'),
  ('numpy.linalg.lapack_lite',
   'd:\\lecturecutter\\venv\\lib\\site-packages\\numpy\\linalg\\lapack_lite.cp310-win_amd64.pyd',
   'EXTENSION'),
  ('numpy.random.mtrand',
   'd:\\lecturecutter\\venv\\lib\\site-packages\\numpy\\random\\mtrand.cp310-win_amd64.pyd',
   'EXTENSION'),
  ('numpy.random._sfc64',
   'd:\\lecturecutter\\venv\\lib\\site-packages\\numpy\\random\\_sfc64.cp310-win_amd64.pyd',
   'EXTENSION'),
  ('numpy.random._philox',
   'd:\\lecturecutter\\venv\\lib\\site-packages\\numpy\\random\\_philox.cp310-win_amd64.pyd',
   'EXTENSION'),
  ('numpy.random._pcg64',
   'd:\\lecturecutter\\venv\\lib\\site-packages\\numpy\\random\\_pcg64.cp310-win_amd64.pyd',
   'EXTENSION'),
  ('numpy.random._mt19937',
   'd:\\lecturecutter\\venv\\lib\\site-packages\\numpy\\random\\_mt19937.cp310-win_amd64.pyd',
   'EXTENSION'),
  ('numpy.random.bit_generator',
   'd:\\lecturecutter\\venv\\lib\\site-packages\\numpy\\random\\bit_generator.cp310-win_amd64.pyd',
   'EXTENSION'),
  ('numpy.random._generator',
   'd:\\lecturecutter\\venv\\lib\\site-packages\\numpy\\random\\_generator.cp310-win_amd64.pyd',
   'EXTENSION'),
  ('numpy.random._bounded_integers',
   'd:\\lecturecutter\\venv\\lib\\site-packages\\numpy\\random\\_bounded_integers.cp310-win_amd64.pyd',
   'EXTENSION'),
  ('numpy.random._common',
   'd:\\lecturecutter\\venv\\lib\\site-packages\\numpy\\random\\_common.cp310-win_amd64.pyd',
   'EXTENSION'),
  ('numpy.fft._pocketfft_internal',
   'd:\\lecturecutter\\venv\\lib\\site-packages\\numpy\\fft\\_pocketfft_internal.cp310-win_amd64.pyd',
   'EXTENSION'),
  ('numpy.linalg._umath_linalg',
   'd:\\lecturecutter\\venv\\lib\\site-packages\\numpy\\linalg\\_umath_linalg.cp310-win_amd64.pyd',
   'EXTENSION'),
  ('cv2.cv2',
   'd:\\lecturecutter\\venv\\lib\\site-packages\\cv2\\cv2.pyd',
   'EXTENSION'),
  ('PySide6.QtUiTools',
   'd:\\lecturecutter\\venv\\lib\\site-packages\\PySide6\\QtUiTools.pyd',
   'EXTENSION'),
  ('PySide6.QtNetwork',
   'd:\\lecturecutter\\venv\\lib\\site-packages\\PySide6\\QtNetwork.pyd',
   'EXTENSION'),
  ('shiboken6.Shiboken',
   'd:\\lecturecutter\\venv\\lib\\site-packages\\shiboken6\\Shiboken.pyd',
   'EXTENSION'),
  ('PySide6.QtCore',
   'd:\\lecturecutter\\venv\\lib\\site-packages\\PySide6\\QtCore.pyd',
   'EXTENSION'),
  ('PySide6.QtWidgets',
   'd:\\lecturecutter\\venv\\lib\\site-packages\\PySide6\\QtWidgets.pyd',
   'EXTENSION'),
  ('PySide6.QtGui',
   'd:\\lecturecutter\\venv\\lib\\site-packages\\PySide6\\QtGui.pyd',
   'EXTENSION'),
  ('Qt6Svg.dll',
   'D:\\LectureCutter\\venv\\Lib\\site-packages\\PySide6\\Qt6Svg.dll',
   'BINARY'),
  ('Qt6Core.dll',
   'D:\\LectureCutter\\venv\\Lib\\site-packages\\PySide6\\Qt6Core.dll',
   'BINARY'),
  ('Qt6Gui.dll',
   'D:\\LectureCutter\\venv\\Lib\\site-packages\\PySide6\\Qt6Gui.dll',
   'BINARY'),
  ('Qt6Widgets.dll',
   'D:\\LectureCutter\\venv\\Lib\\site-packages\\PySide6\\Qt6Widgets.dll',
   'BINARY'),
  ('VCRUNTIME140_1.dll', 'C:\\Python310\\VCRUNTIME140_1.dll', 'BINARY'),
  ('Qt6Network.dll',
   'D:\\LectureCutter\\venv\\Lib\\site-packages\\PySide6\\Qt6Network.dll',
   'BINARY'),
  ('MSVCP140.dll', 'C:\\Windows\\system32\\MSVCP140.dll', 'BINARY'),
  ('Qt6VirtualKeyboard.dll',
   'D:\\LectureCutter\\venv\\Lib\\site-packages\\PySide6\\Qt6VirtualKeyboard.dll',
   'BINARY'),
  ('Qt6Qml.dll',
   'D:\\LectureCutter\\venv\\Lib\\site-packages\\PySide6\\Qt6Qml.dll',
   'BINARY'),
  ('libcrypto-1_1.dll', 'C:\\Python310\\DLLs\\libcrypto-1_1.dll', 'BINARY'),
  ('libssl-1_1.dll', 'C:\\Python310\\DLLs\\libssl-1_1.dll', 'BINARY'),
  ('libffi-7.dll', 'C:\\Python310\\DLLs\\libffi-7.dll', 'BINARY'),
  ('python3.dll', 'C:\\Python310\\python3.dll', 'BINARY'),
  ('Qt6UiTools.dll',
   'd:\\lecturecutter\\venv\\lib\\site-packages\\PySide6\\Qt6UiTools.dll',
   'BINARY'),
  ('pyside6.abi3.dll',
   'd:\\lecturecutter\\venv\\lib\\site-packages\\PySide6\\pyside6.abi3.dll',
   'BINARY'),
  ('shiboken6.abi3.dll',
   'd:\\lecturecutter\\venv\\lib\\site-packages\\shiboken6\\shiboken6.abi3.dll',
   'BINARY'),
  ('MSVCP140_2.dll',
   'd:\\lecturecutter\\venv\\lib\\site-packages\\PySide6\\MSVCP140_2.dll',
   'BINARY'),
  ('MSVCP140_1.dll',
   'D:\\LectureCutter\\venv\\Lib\\site-packages\\PySide6\\MSVCP140_1.dll',
   'BINARY'),
  ('Qt6Quick.dll',
   'D:\\LectureCutter\\venv\\Lib\\site-packages\\PySide6\\Qt6Quick.dll',
   'BINARY'),
  ('Qt6OpenGLWidgets.dll',
   'd:\\lecturecutter\\venv\\lib\\site-packages\\PySide6\\Qt6OpenGLWidgets.dll',
   'BINARY'),
  ('Qt6QmlModels.dll',
   'D:\\LectureCutter\\venv\\Lib\\site-packages\\PySide6\\Qt6QmlModels.dll',
   'BINARY'),
  ('Qt6OpenGL.dll',
   'D:\\LectureCutter\\venv\\Lib\\site-packages\\PySide6\\Qt6OpenGL.dll',
   'BINARY')],
 [],
 [],
 [('base_library.zip',
   'D:\\LectureCutter\\build\\MyApplication\\base_library.zip',
   'DATA'),
  ('PySide6\\translations\\qtbase_zh_TW.qm',
   'D:\\lecturecutter\\venv\\lib\\site-packages\\PySide6\\translations\\qtbase_zh_TW.qm',
   'DATA'),
  ('PySide6\\translations\\qtbase_cs.qm',
   'D:\\lecturecutter\\venv\\lib\\site-packages\\PySide6\\translations\\qtbase_cs.qm',
   'DATA'),
  ('PySide6\\translations\\qtbase_it.qm',
   'D:\\lecturecutter\\venv\\lib\\site-packages\\PySide6\\translations\\qtbase_it.qm',
   'DATA'),
  ('cv2\\gapi\\__init__.py',
   'd:\\lecturecutter\\venv\\lib\\site-packages\\cv2\\gapi\\__init__.py',
   'DATA'),
  ('PySide6\\translations\\qtbase_pt_BR.qm',
   'D:\\lecturecutter\\venv\\lib\\site-packages\\PySide6\\translations\\qtbase_pt_BR.qm',
   'DATA'),
  ('PySide6\\translations\\qtbase_es.qm',
   'D:\\lecturecutter\\venv\\lib\\site-packages\\PySide6\\translations\\qtbase_es.qm',
   'DATA'),
  ('PySide6\\translations\\qtbase_sk.qm',
   'D:\\lecturecutter\\venv\\lib\\site-packages\\PySide6\\translations\\qtbase_sk.qm',
   'DATA'),
  ('PySide6\\translations\\qtbase_ko.qm',
   'D:\\lecturecutter\\venv\\lib\\site-packages\\PySide6\\translations\\qtbase_ko.qm',
   'DATA'),
  ('cv2\\misc\\version.py',
   'd:\\lecturecutter\\venv\\lib\\site-packages\\cv2\\misc\\version.py',
   'DATA'),
  ('cv2\\mat_wrapper\\__init__.py',
   'd:\\lecturecutter\\venv\\lib\\site-packages\\cv2\\mat_wrapper\\__init__.py',
   'DATA'),
  ('cv2\\config-3.py',
   'd:\\lecturecutter\\venv\\lib\\site-packages\\cv2\\config-3.py',
   'DATA'),
  ('PySide6\\translations\\qtbase_fr.qm',
   'D:\\lecturecutter\\venv\\lib\\site-packages\\PySide6\\translations\\qtbase_fr.qm',
   'DATA'),
  ('PySide6\\translations\\qtbase_ca.qm',
   'D:\\lecturecutter\\venv\\lib\\site-packages\\PySide6\\translations\\qtbase_ca.qm',
   'DATA'),
  ('cv2\\load_config_py2.py',
   'd:\\lecturecutter\\venv\\lib\\site-packages\\cv2\\load_config_py2.py',
   'DATA'),
  ('PySide6\\translations\\qtbase_ja.qm',
   'D:\\lecturecutter\\venv\\lib\\site-packages\\PySide6\\translations\\qtbase_ja.qm',
   'DATA'),
  ('cv2\\data\\__init__.py',
   'd:\\lecturecutter\\venv\\lib\\site-packages\\cv2\\data\\__init__.py',
   'DATA'),
  ('PySide6\\translations\\qtbase_fa.qm',
   'D:\\lecturecutter\\venv\\lib\\site-packages\\PySide6\\translations\\qtbase_fa.qm',
   'DATA'),
  ('cv2\\__init__.py',
   'd:\\lecturecutter\\venv\\lib\\site-packages\\cv2\\__init__.py',
   'DATA'),
  ('PySide6\\translations\\qtbase_zh_CN.qm',
   'D:\\lecturecutter\\venv\\lib\\site-packages\\PySide6\\translations\\qtbase_zh_CN.qm',
   'DATA'),
  ('PySide6\\translations\\qtbase_bg.qm',
   'D:\\lecturecutter\\venv\\lib\\site-packages\\PySide6\\translations\\qtbase_bg.qm',
   'DATA'),
  ('PySide6\\translations\\qtbase_lv.qm',
   'D:\\lecturecutter\\venv\\lib\\site-packages\\PySide6\\translations\\qtbase_lv.qm',
   'DATA'),
  ('PySide6\\translations\\qtbase_gd.qm',
   'D:\\lecturecutter\\venv\\lib\\site-packages\\PySide6\\translations\\qtbase_gd.qm',
   'DATA'),
  ('cv2\\load_config_py3.py',
   'd:\\lecturecutter\\venv\\lib\\site-packages\\cv2\\load_config_py3.py',
   'DATA'),
  ('cv2\\config.py',
   'd:\\lecturecutter\\venv\\lib\\site-packages\\cv2\\config.py',
   'DATA'),
  ('PySide6\\translations\\qtbase_fi.qm',
   'D:\\lecturecutter\\venv\\lib\\site-packages\\PySide6\\translations\\qtbase_fi.qm',
   'DATA'),
  ('cv2\\utils\\__init__.py',
   'd:\\lecturecutter\\venv\\lib\\site-packages\\cv2\\utils\\__init__.py',
   'DATA'),
  ('PySide6\\translations\\qtbase_hu.qm',
   'D:\\lecturecutter\\venv\\lib\\site-packages\\PySide6\\translations\\qtbase_hu.qm',
   'DATA'),
  ('PySide6\\translations\\qtbase_nl.qm',
   'D:\\lecturecutter\\venv\\lib\\site-packages\\PySide6\\translations\\qtbase_nl.qm',
   'DATA'),
  ('PySide6\\translations\\qtbase_da.qm',
   'D:\\lecturecutter\\venv\\lib\\site-packages\\PySide6\\translations\\qtbase_da.qm',
   'DATA'),
  ('PySide6\\translations\\qtbase_nn.qm',
   'D:\\lecturecutter\\venv\\lib\\site-packages\\PySide6\\translations\\qtbase_nn.qm',
   'DATA'),
  ('PySide6\\qt.conf',
   'D:\\lecturecutter\\venv\\lib\\site-packages\\PySide6\\qt.conf',
   'DATA'),
  ('PySide6\\translations\\qtbase_tr.qm',
   'D:\\lecturecutter\\venv\\lib\\site-packages\\PySide6\\translations\\qtbase_tr.qm',
   'DATA'),
  ('cv2\\version.py',
   'd:\\lecturecutter\\venv\\lib\\site-packages\\cv2\\version.py',
   'DATA'),
  ('PySide6\\translations\\qtbase_hr.qm',
   'D:\\lecturecutter\\venv\\lib\\site-packages\\PySide6\\translations\\qtbase_hr.qm',
   'DATA'),
  ('PySide6\\translations\\qtbase_uk.qm',
   'D:\\lecturecutter\\venv\\lib\\site-packages\\PySide6\\translations\\qtbase_uk.qm',
   'DATA'),
  ('PySide6\\translations\\qtbase_de.qm',
   'D:\\lecturecutter\\venv\\lib\\site-packages\\PySide6\\translations\\qtbase_de.qm',
   'DATA'),
  ('cv2\\misc\\__init__.py',
   'd:\\lecturecutter\\venv\\lib\\site-packages\\cv2\\misc\\__init__.py',
   'DATA'),
  ('PySide6\\translations\\qtbase_pl.qm',
   'D:\\lecturecutter\\venv\\lib\\site-packages\\PySide6\\translations\\qtbase_pl.qm',
   'DATA'),
  ('PySide6\\translations\\qtbase_ar.qm',
   'D:\\lecturecutter\\venv\\lib\\site-packages\\PySide6\\translations\\qtbase_ar.qm',
   'DATA'),
  ('PySide6\\translations\\qtbase_he.qm',
   'D:\\lecturecutter\\venv\\lib\\site-packages\\PySide6\\translations\\qtbase_he.qm',
   'DATA'),
  ('PySide6\\translations\\qtbase_en.qm',
   'D:\\lecturecutter\\venv\\lib\\site-packages\\PySide6\\translations\\qtbase_en.qm',
   'DATA'),
  ('PySide6\\translations\\qtbase_ru.qm',
   'D:\\lecturecutter\\venv\\lib\\site-packages\\PySide6\\translations\\qtbase_ru.qm',
   'DATA'),
  ('pyinstaller-4.7.dist-info\\top_level.txt',
   'd:\\lecturecutter\\venv\\lib\\site-packages\\pyinstaller-4.7.dist-info\\top_level.txt',
   'DATA'),
  ('setuptools-57.0.0.dist-info\\top_level.txt',
   'd:\\lecturecutter\\venv\\lib\\site-packages\\setuptools-57.0.0.dist-info\\top_level.txt',
   'DATA'),
  ('altgraph-0.17.2.dist-info\\WHEEL',
   'd:\\lecturecutter\\venv\\lib\\site-packages\\altgraph-0.17.2.dist-info\\WHEEL',
   'DATA'),
  ('pyinstaller-4.7.dist-info\\REQUESTED',
   'd:\\lecturecutter\\venv\\lib\\site-packages\\pyinstaller-4.7.dist-info\\REQUESTED',
   'DATA'),
  ('altgraph-0.17.2.dist-info\\top_level.txt',
   'd:\\lecturecutter\\venv\\lib\\site-packages\\altgraph-0.17.2.dist-info\\top_level.txt',
   'DATA'),
  ('altgraph-0.17.2.dist-info\\METADATA',
   'd:\\lecturecutter\\venv\\lib\\site-packages\\altgraph-0.17.2.dist-info\\METADATA',
   'DATA'),
  ('altgraph-0.17.2.dist-info\\zip-safe',
   'd:\\lecturecutter\\venv\\lib\\site-packages\\altgraph-0.17.2.dist-info\\zip-safe',
   'DATA'),
  ('wheel-0.36.2.dist-info\\entry_points.txt',
   'd:\\lecturecutter\\venv\\lib\\site-packages\\wheel-0.36.2.dist-info\\entry_points.txt',
   'DATA'),
  ('altgraph-0.17.2.dist-info\\RECORD',
   'd:\\lecturecutter\\venv\\lib\\site-packages\\altgraph-0.17.2.dist-info\\RECORD',
   'DATA'),
  ('wheel-0.36.2.dist-info\\top_level.txt',
   'd:\\lecturecutter\\venv\\lib\\site-packages\\wheel-0.36.2.dist-info\\top_level.txt',
   'DATA'),
  ('altgraph-0.17.2.dist-info\\INSTALLER',
   'd:\\lecturecutter\\venv\\lib\\site-packages\\altgraph-0.17.2.dist-info\\INSTALLER',
   'DATA'),
  ('setuptools-57.0.0.dist-info\\LICENSE',
   'd:\\lecturecutter\\venv\\lib\\site-packages\\setuptools-57.0.0.dist-info\\LICENSE',
   'DATA'),
  ('setuptools-57.0.0.dist-info\\dependency_links.txt',
   'd:\\lecturecutter\\venv\\lib\\site-packages\\setuptools-57.0.0.dist-info\\dependency_links.txt',
   'DATA'),
  ('wheel-0.36.2.dist-info\\INSTALLER',
   'd:\\lecturecutter\\venv\\lib\\site-packages\\wheel-0.36.2.dist-info\\INSTALLER',
   'DATA'),
  ('setuptools-57.0.0.dist-info\\RECORD',
   'd:\\lecturecutter\\venv\\lib\\site-packages\\setuptools-57.0.0.dist-info\\RECORD',
   'DATA'),
  ('pyinstaller-4.7.dist-info\\METADATA',
   'd:\\lecturecutter\\venv\\lib\\site-packages\\pyinstaller-4.7.dist-info\\METADATA',
   'DATA'),
  ('wheel-0.36.2.dist-info\\LICENSE.txt',
   'd:\\lecturecutter\\venv\\lib\\site-packages\\wheel-0.36.2.dist-info\\LICENSE.txt',
   'DATA'),
  ('setuptools-57.0.0.dist-info\\WHEEL',
   'd:\\lecturecutter\\venv\\lib\\site-packages\\setuptools-57.0.0.dist-info\\WHEEL',
   'DATA'),
  ('setuptools-57.0.0.dist-info\\INSTALLER',
   'd:\\lecturecutter\\venv\\lib\\site-packages\\setuptools-57.0.0.dist-info\\INSTALLER',
   'DATA'),
  ('wheel-0.36.2.dist-info\\WHEEL',
   'd:\\lecturecutter\\venv\\lib\\site-packages\\wheel-0.36.2.dist-info\\WHEEL',
   'DATA'),
  ('pyinstaller-4.7.dist-info\\RECORD',
   'd:\\lecturecutter\\venv\\lib\\site-packages\\pyinstaller-4.7.dist-info\\RECORD',
   'DATA'),
  ('pyinstaller-4.7.dist-info\\COPYING.txt',
   'd:\\lecturecutter\\venv\\lib\\site-packages\\pyinstaller-4.7.dist-info\\COPYING.txt',
   'DATA'),
  ('pyinstaller-4.7.dist-info\\INSTALLER',
   'd:\\lecturecutter\\venv\\lib\\site-packages\\pyinstaller-4.7.dist-info\\INSTALLER',
   'DATA'),
  ('setuptools-57.0.0.dist-info\\METADATA',
   'd:\\lecturecutter\\venv\\lib\\site-packages\\setuptools-57.0.0.dist-info\\METADATA',
   'DATA'),
  ('altgraph-0.17.2.dist-info\\LICENSE',
   'd:\\lecturecutter\\venv\\lib\\site-packages\\altgraph-0.17.2.dist-info\\LICENSE',
   'DATA'),
  ('wheel-0.36.2.dist-info\\RECORD',
   'd:\\lecturecutter\\venv\\lib\\site-packages\\wheel-0.36.2.dist-info\\RECORD',
   'DATA'),
  ('setuptools-57.0.0.dist-info\\entry_points.txt',
   'd:\\lecturecutter\\venv\\lib\\site-packages\\setuptools-57.0.0.dist-info\\entry_points.txt',
   'DATA'),
  ('pyinstaller-4.7.dist-info\\entry_points.txt',
   'd:\\lecturecutter\\venv\\lib\\site-packages\\pyinstaller-4.7.dist-info\\entry_points.txt',
   'DATA'),
  ('wheel-0.36.2.dist-info\\METADATA',
   'd:\\lecturecutter\\venv\\lib\\site-packages\\wheel-0.36.2.dist-info\\METADATA',
   'DATA'),
  ('pyinstaller-4.7.dist-info\\WHEEL',
   'd:\\lecturecutter\\venv\\lib\\site-packages\\pyinstaller-4.7.dist-info\\WHEEL',
   'DATA')],
 [])
