([('MyApplication.exe',
   'D:\\LectureCutter\\build\\MyApplication\\MyApplication.exe',
   'EXECUTABLE'),
  ('python310.dll', 'C:\\Python310\\python310.dll', 'BINARY'),
  ('VCRUNTIME140.dll', 'C:\\Python310\\VCRUNTIME140.dll', 'BINARY'),
  ('PySide6\\plugins\\iconengines\\qsvgicon.dll',
   'D:\\lecturecutter\\venv\\lib\\site-packages\\PySide6\\plugins\\iconengines\\qsvgicon.dll',
   'BINARY'),
  ('PySide6\\plugins\\styles\\qwindowsvistastyle.dll',
   'D:\\lecturecutter\\venv\\lib\\site-packages\\PySide6\\plugins\\styles\\qwindowsvistastyle.dll',
   'BINARY'),
  ('PySide6\\plugins\\imageformats\\qtga.dll',
   'D:\\lecturecutter\\venv\\lib\\site-packages\\PySide6\\plugins\\imageformats\\qtga.dll',
   'BINARY'),
  ('opengl32sw.dll',
   'D:\\lecturecutter\\venv\\lib\\site-packages\\PySide6\\opengl32sw.dll',
   'BINARY'),
  ('libopenblas.EL2C6PLE4ZYW3ECEVIV3OXXGRN2NRFM2.gfortran-win_amd64.dll',
   'd:\\lecturecutter\\venv\\lib\\site-packages\\numpy\\.libs\\libopenblas.EL2C6PLE4ZYW3ECEVIV3OXXGRN2NRFM2.gfortran-win_amd64.dll',
   'BINARY'),
  ('PySide6\\plugins\\imageformats\\qwebp.dll',
   'D:\\lecturecutter\\venv\\lib\\site-packages\\PySide6\\plugins\\imageformats\\qwebp.dll',
   'BINARY'),
  ('PySide6\\plugins\\tls\\qcertonlybackend.dll',
   'D:\\lecturecutter\\venv\\lib\\site-packages\\PySide6\\plugins\\tls\\qcertonlybackend.dll',
   'BINARY'),
  ('PySide6\\plugins\\imageformats\\qgif.dll',
   'D:\\lecturecutter\\venv\\lib\\site-packages\\PySide6\\plugins\\imageformats\\qgif.dll',
   'BINARY'),
  ('PySide6\\plugins\\imageformats\\qjpeg.dll',
   'D:\\lecturecutter\\venv\\lib\\site-packages\\PySide6\\plugins\\imageformats\\qjpeg.dll',
   'BINARY'),
  ('PySide6\\plugins\\tls\\qschannelbackend.dll',
   'D:\\lecturecutter\\venv\\lib\\site-packages\\PySide6\\plugins\\tls\\qschannelbackend.dll',
   'BINARY'),
  ('PySide6\\plugins\\imageformats\\qwbmp.dll',
   'D:\\lecturecutter\\venv\\lib\\site-packages\\PySide6\\plugins\\imageformats\\qwbmp.dll',
   'BINARY'),
  ('PySide6\\plugins\\tls\\qopensslbackend.dll',
   'D:\\lecturecutter\\venv\\lib\\site-packages\\PySide6\\plugins\\tls\\qopensslbackend.dll',
   'BINARY'),
  ('PySide6\\plugins\\networkinformation\\qnetworklistmanager.dll',
   'D:\\lecturecutter\\venv\\lib\\site-packages\\PySide6\\plugins\\networkinformation\\qnetworklistmanager.dll',
   'BINARY'),
  ('PySide6\\plugins\\imageformats\\qico.dll',
   'D:\\lecturecutter\\venv\\lib\\site-packages\\PySide6\\plugins\\imageformats\\qico.dll',
   'BINARY'),
  ('cv2\\opencv_videoio_ffmpeg455_64.dll',
   'd:\\lecturecutter\\venv\\lib\\site-packages\\cv2\\opencv_videoio_ffmpeg455_64.dll',
   'BINARY'),
  ('PySide6\\plugins\\platforms\\qdirect2d.dll',
   'D:\\lecturecutter\\venv\\lib\\site-packages\\PySide6\\plugins\\platforms\\qdirect2d.dll',
   'BINARY'),
  ('PySide6\\plugins\\platforms\\qoffscreen.dll',
   'D:\\lecturecutter\\venv\\lib\\site-packages\\PySide6\\plugins\\platforms\\qoffscreen.dll',
   'BINARY'),
  ('PySide6\\plugins\\platforminputcontexts\\qtvirtualkeyboardplugin.dll',
   'D:\\lecturecutter\\venv\\lib\\site-packages\\PySide6\\plugins\\platforminputcontexts\\qtvirtualkeyboardplugin.dll',
   'BINARY'),
  ('PySide6\\plugins\\imageformats\\qtiff.dll',
   'D:\\lecturecutter\\venv\\lib\\site-packages\\PySide6\\plugins\\imageformats\\qtiff.dll',
   'BINARY'),
  ('PySide6\\plugins\\imageformats\\qsvg.dll',
   'D:\\lecturecutter\\venv\\lib\\site-packages\\PySide6\\plugins\\imageformats\\qsvg.dll',
   'BINARY'),
  ('PySide6\\plugins\\imageformats\\qicns.dll',
   'D:\\lecturecutter\\venv\\lib\\site-packages\\PySide6\\plugins\\imageformats\\qicns.dll',
   'BINARY'),
  ('PySide6\\plugins\\platforms\\qwindows.dll',
   'D:\\lecturecutter\\venv\\lib\\site-packages\\PySide6\\plugins\\platforms\\qwindows.dll',
   'BINARY'),
  ('PySide6\\plugins\\platforms\\qminimal.dll',
   'D:\\lecturecutter\\venv\\lib\\site-packages\\PySide6\\plugins\\platforms\\qminimal.dll',
   'BINARY'),
  ('_multiprocessing',
   'C:\\Python310\\DLLs\\_multiprocessing.pyd',
   'EXTENSION'),
  ('_decimal', 'C:\\Python310\\DLLs\\_decimal.pyd', 'EXTENSION'),
  ('_socket', 'C:\\Python310\\DLLs\\_socket.pyd', 'EXTENSION'),
  ('select', 'C:\\Python310\\DLLs\\select.pyd', 'EXTENSION'),
  ('_overlapped', 'C:\\Python310\\DLLs\\_overlapped.pyd', 'EXTENSION'),
  ('_ssl', 'C:\\Python310\\DLLs\\_ssl.pyd', 'EXTENSION'),
  ('_asyncio', 'C:\\Python310\\DLLs\\_asyncio.pyd', 'EXTENSION'),
  ('_queue', 'C:\\Python310\\DLLs\\_queue.pyd', 'EXTENSION'),
  ('pyexpat', 'C:\\Python310\\DLLs\\pyexpat.pyd', 'EXTENSION'),
  ('unicodedata', 'C:\\Python310\\DLLs\\unicodedata.pyd', 'EXTENSION'),
  ('_hashlib', 'C:\\Python310\\DLLs\\_hashlib.pyd', 'EXTENSION'),
  ('_lzma', 'C:\\Python310\\DLLs\\_lzma.pyd', 'EXTENSION'),
  ('_bz2', 'C:\\Python310\\DLLs\\_bz2.pyd', 'EXTENSION'),
  ('_ctypes', 'C:\\Python310\\DLLs\\_ctypes.pyd', 'EXTENSION'),
  ('numpy.core._multiarray_tests',
   'd:\\lecturecutter\\venv\\lib\\site-packages\\numpy\\core\\_multiarray_tests.cp310-win_amd64.pyd',
   'EXTENSION'),
  ('numpy.core._multiarray_umath',
   'd:\\lecturecutter\\venv\\lib\\site-packages\\numpy\\core\\_multiarray_umath.cp310-win_amd64.pyd',
   'EXTENSION'),
  ('numpy.linalg.lapack_lite',
   'd:\\lecturecutter\\venv\\lib\\site-packages\\numpy\\linalg\\lapack_lite.cp310-win_amd64.pyd',
   'EXTENSION'),
  ('numpy.random.mtrand',
   'd:\\lecturecutter\\venv\\lib\\site-packages\\numpy\\random\\mtrand.cp310-win_amd64.pyd',
   'EXTENSION'),
  ('numpy.random._sfc64',
   'd:\\lecturecutter\\venv\\lib\\site-packages\\numpy\\random\\_sfc64.cp310-win_amd64.pyd',
   'EXTENSION'),
  ('numpy.random._philox',
   'd:\\lecturecutter\\venv\\lib\\site-packages\\numpy\\random\\_philox.cp310-win_amd64.pyd',
   'EXTENSION'),
  ('numpy.random._pcg64',
   'd:\\lecturecutter\\venv\\lib\\site-packages\\numpy\\random\\_pcg64.cp310-win_amd64.pyd',
   'EXTENSION'),
  ('numpy.random._mt19937',
   'd:\\lecturecutter\\venv\\lib\\site-packages\\numpy\\random\\_mt19937.cp310-win_amd64.pyd',
   'EXTENSION'),
  ('numpy.random.bit_generator',
   'd:\\lecturecutter\\venv\\lib\\site-packages\\numpy\\random\\bit_generator.cp310-win_amd64.pyd',
   'EXTENSION'),
  ('numpy.random._generator',
   'd:\\lecturecutter\\venv\\lib\\site-packages\\numpy\\random\\_generator.cp310-win_amd64.pyd',
   'EXTENSION'),
  ('numpy.random._bounded_integers',
   'd:\\lecturecutter\\venv\\lib\\site-packages\\numpy\\random\\_bounded_integers.cp310-win_amd64.pyd',
   'EXTENSION'),
  ('numpy.random._common',
   'd:\\lecturecutter\\venv\\lib\\site-packages\\numpy\\random\\_common.cp310-win_amd64.pyd',
   'EXTENSION'),
  ('numpy.fft._pocketfft_internal',
   'd:\\lecturecutter\\venv\\lib\\site-packages\\numpy\\fft\\_pocketfft_internal.cp310-win_amd64.pyd',
   'EXTENSION'),
  ('numpy.linalg._umath_linalg',
   'd:\\lecturecutter\\venv\\lib\\site-packages\\numpy\\linalg\\_umath_linalg.cp310-win_amd64.pyd',
   'EXTENSION'),
  ('cv2.cv2',
   'd:\\lecturecutter\\venv\\lib\\site-packages\\cv2\\cv2.pyd',
   'EXTENSION'),
  ('PySide6.QtUiTools',
   'd:\\lecturecutter\\venv\\lib\\site-packages\\PySide6\\QtUiTools.pyd',
   'EXTENSION'),
  ('PySide6.QtNetwork',
   'd:\\lecturecutter\\venv\\lib\\site-packages\\PySide6\\QtNetwork.pyd',
   'EXTENSION'),
  ('shiboken6.Shiboken',
   'd:\\lecturecutter\\venv\\lib\\site-packages\\shiboken6\\Shiboken.pyd',
   'EXTENSION'),
  ('PySide6.QtCore',
   'd:\\lecturecutter\\venv\\lib\\site-packages\\PySide6\\QtCore.pyd',
   'EXTENSION'),
  ('PySide6.QtWidgets',
   'd:\\lecturecutter\\venv\\lib\\site-packages\\PySide6\\QtWidgets.pyd',
   'EXTENSION'),
  ('PySide6.QtGui',
   'd:\\lecturecutter\\venv\\lib\\site-packages\\PySide6\\QtGui.pyd',
   'EXTENSION'),
  ('Qt6Svg.dll',
   'D:\\LectureCutter\\venv\\Lib\\site-packages\\PySide6\\Qt6Svg.dll',
   'BINARY'),
  ('Qt6Core.dll',
   'D:\\LectureCutter\\venv\\Lib\\site-packages\\PySide6\\Qt6Core.dll',
   'BINARY'),
  ('Qt6Gui.dll',
   'D:\\LectureCutter\\venv\\Lib\\site-packages\\PySide6\\Qt6Gui.dll',
   'BINARY'),
  ('Qt6Widgets.dll',
   'D:\\LectureCutter\\venv\\Lib\\site-packages\\PySide6\\Qt6Widgets.dll',
   'BINARY'),
  ('VCRUNTIME140_1.dll', 'C:\\Python310\\VCRUNTIME140_1.dll', 'BINARY'),
  ('Qt6Network.dll',
   'D:\\LectureCutter\\venv\\Lib\\site-packages\\PySide6\\Qt6Network.dll',
   'BINARY'),
  ('MSVCP140.dll', 'C:\\Windows\\system32\\MSVCP140.dll', 'BINARY'),
  ('Qt6VirtualKeyboard.dll',
   'D:\\LectureCutter\\venv\\Lib\\site-packages\\PySide6\\Qt6VirtualKeyboard.dll',
   'BINARY'),
  ('Qt6Qml.dll',
   'D:\\LectureCutter\\venv\\Lib\\site-packages\\PySide6\\Qt6Qml.dll',
   'BINARY'),
  ('libcrypto-1_1.dll', 'C:\\Python310\\DLLs\\libcrypto-1_1.dll', 'BINARY'),
  ('libssl-1_1.dll', 'C:\\Python310\\DLLs\\libssl-1_1.dll', 'BINARY'),
  ('libffi-7.dll', 'C:\\Python310\\DLLs\\libffi-7.dll', 'BINARY'),
  ('python3.dll', 'C:\\Python310\\python3.dll', 'BINARY'),
  ('Qt6UiTools.dll',
   'd:\\lecturecutter\\venv\\lib\\site-packages\\PySide6\\Qt6UiTools.dll',
   'BINARY'),
  ('pyside6.abi3.dll',
   'd:\\lecturecutter\\venv\\lib\\site-packages\\PySide6\\pyside6.abi3.dll',
   'BINARY'),
  ('shiboken6.abi3.dll',
   'd:\\lecturecutter\\venv\\lib\\site-packages\\shiboken6\\shiboken6.abi3.dll',
   'BINARY'),
  ('MSVCP140_2.dll',
   'd:\\lecturecutter\\venv\\lib\\site-packages\\PySide6\\MSVCP140_2.dll',
   'BINARY'),
  ('MSVCP140_1.dll',
   'D:\\LectureCutter\\venv\\Lib\\site-packages\\PySide6\\MSVCP140_1.dll',
   'BINARY'),
  ('Qt6Quick.dll',
   'D:\\LectureCutter\\venv\\Lib\\site-packages\\PySide6\\Qt6Quick.dll',
   'BINARY'),
  ('Qt6OpenGLWidgets.dll',
   'd:\\lecturecutter\\venv\\lib\\site-packages\\PySide6\\Qt6OpenGLWidgets.dll',
   'BINARY'),
  ('Qt6QmlModels.dll',
   'D:\\LectureCutter\\venv\\Lib\\site-packages\\PySide6\\Qt6QmlModels.dll',
   'BINARY'),
  ('Qt6OpenGL.dll',
   'D:\\LectureCutter\\venv\\Lib\\site-packages\\PySide6\\Qt6OpenGL.dll',
   'BINARY'),
  ('base_library.zip',
   'D:\\LectureCutter\\build\\MyApplication\\base_library.zip',
   'DATA'),
  ('PySide6\\translations\\qtbase_zh_TW.qm',
   'D:\\lecturecutter\\venv\\lib\\site-packages\\PySide6\\translations\\qtbase_zh_TW.qm',
   'DATA'),
  ('PySide6\\translations\\qtbase_cs.qm',
   'D:\\lecturecutter\\venv\\lib\\site-packages\\PySide6\\translations\\qtbase_cs.qm',
   'DATA'),
  ('PySide6\\translations\\qtbase_it.qm',
   'D:\\lecturecutter\\venv\\lib\\site-packages\\PySide6\\translations\\qtbase_it.qm',
   'DATA'),
  ('cv2\\gapi\\__init__.py',
   'd:\\lecturecutter\\venv\\lib\\site-packages\\cv2\\gapi\\__init__.py',
   'DATA'),
  ('PySide6\\translations\\qtbase_pt_BR.qm',
   'D:\\lecturecutter\\venv\\lib\\site-packages\\PySide6\\translations\\qtbase_pt_BR.qm',
   'DATA'),
  ('PySide6\\translations\\qtbase_es.qm',
   'D:\\lecturecutter\\venv\\lib\\site-packages\\PySide6\\translations\\qtbase_es.qm',
   'DATA'),
  ('PySide6\\translations\\qtbase_sk.qm',
   'D:\\lecturecutter\\venv\\lib\\site-packages\\PySide6\\translations\\qtbase_sk.qm',
   'DATA'),
  ('PySide6\\translations\\qtbase_ko.qm',
   'D:\\lecturecutter\\venv\\lib\\site-packages\\PySide6\\translations\\qtbase_ko.qm',
   'DATA'),
  ('cv2\\misc\\version.py',
   'd:\\lecturecutter\\venv\\lib\\site-packages\\cv2\\misc\\version.py',
   'DATA'),
  ('cv2\\mat_wrapper\\__init__.py',
   'd:\\lecturecutter\\venv\\lib\\site-packages\\cv2\\mat_wrapper\\__init__.py',
   'DATA'),
  ('cv2\\config-3.py',
   'd:\\lecturecutter\\venv\\lib\\site-packages\\cv2\\config-3.py',
   'DATA'),
  ('PySide6\\translations\\qtbase_fr.qm',
   'D:\\lecturecutter\\venv\\lib\\site-packages\\PySide6\\translations\\qtbase_fr.qm',
   'DATA'),
  ('PySide6\\translations\\qtbase_ca.qm',
   'D:\\lecturecutter\\venv\\lib\\site-packages\\PySide6\\translations\\qtbase_ca.qm',
   'DATA'),
  ('cv2\\load_config_py2.py',
   'd:\\lecturecutter\\venv\\lib\\site-packages\\cv2\\load_config_py2.py',
   'DATA'),
  ('PySide6\\translations\\qtbase_ja.qm',
   'D:\\lecturecutter\\venv\\lib\\site-packages\\PySide6\\translations\\qtbase_ja.qm',
   'DATA'),
  ('cv2\\data\\__init__.py',
   'd:\\lecturecutter\\venv\\lib\\site-packages\\cv2\\data\\__init__.py',
   'DATA'),
  ('PySide6\\translations\\qtbase_fa.qm',
   'D:\\lecturecutter\\venv\\lib\\site-packages\\PySide6\\translations\\qtbase_fa.qm',
   'DATA'),
  ('cv2\\__init__.py',
   'd:\\lecturecutter\\venv\\lib\\site-packages\\cv2\\__init__.py',
   'DATA'),
  ('PySide6\\translations\\qtbase_zh_CN.qm',
   'D:\\lecturecutter\\venv\\lib\\site-packages\\PySide6\\translations\\qtbase_zh_CN.qm',
   'DATA'),
  ('PySide6\\translations\\qtbase_bg.qm',
   'D:\\lecturecutter\\venv\\lib\\site-packages\\PySide6\\translations\\qtbase_bg.qm',
   'DATA'),
  ('PySide6\\translations\\qtbase_lv.qm',
   'D:\\lecturecutter\\venv\\lib\\site-packages\\PySide6\\translations\\qtbase_lv.qm',
   'DATA'),
  ('PySide6\\translations\\qtbase_gd.qm',
   'D:\\lecturecutter\\venv\\lib\\site-packages\\PySide6\\translations\\qtbase_gd.qm',
   'DATA'),
  ('cv2\\load_config_py3.py',
   'd:\\lecturecutter\\venv\\lib\\site-packages\\cv2\\load_config_py3.py',
   'DATA'),
  ('cv2\\config.py',
   'd:\\lecturecutter\\venv\\lib\\site-packages\\cv2\\config.py',
   'DATA'),
  ('PySide6\\translations\\qtbase_fi.qm',
   'D:\\lecturecutter\\venv\\lib\\site-packages\\PySide6\\translations\\qtbase_fi.qm',
   'DATA'),
  ('cv2\\utils\\__init__.py',
   'd:\\lecturecutter\\venv\\lib\\site-packages\\cv2\\utils\\__init__.py',
   'DATA'),
  ('PySide6\\translations\\qtbase_hu.qm',
   'D:\\lecturecutter\\venv\\lib\\site-packages\\PySide6\\translations\\qtbase_hu.qm',
   'DATA'),
  ('PySide6\\translations\\qtbase_nl.qm',
   'D:\\lecturecutter\\venv\\lib\\site-packages\\PySide6\\translations\\qtbase_nl.qm',
   'DATA'),
  ('PySide6\\translations\\qtbase_da.qm',
   'D:\\lecturecutter\\venv\\lib\\site-packages\\PySide6\\translations\\qtbase_da.qm',
   'DATA'),
  ('PySide6\\translations\\qtbase_nn.qm',
   'D:\\lecturecutter\\venv\\lib\\site-packages\\PySide6\\translations\\qtbase_nn.qm',
   'DATA'),
  ('PySide6\\qt.conf',
   'D:\\lecturecutter\\venv\\lib\\site-packages\\PySide6\\qt.conf',
   'DATA'),
  ('PySide6\\translations\\qtbase_tr.qm',
   'D:\\lecturecutter\\venv\\lib\\site-packages\\PySide6\\translations\\qtbase_tr.qm',
   'DATA'),
  ('cv2\\version.py',
   'd:\\lecturecutter\\venv\\lib\\site-packages\\cv2\\version.py',
   'DATA'),
  ('PySide6\\translations\\qtbase_hr.qm',
   'D:\\lecturecutter\\venv\\lib\\site-packages\\PySide6\\translations\\qtbase_hr.qm',
   'DATA'),
  ('PySide6\\translations\\qtbase_uk.qm',
   'D:\\lecturecutter\\venv\\lib\\site-packages\\PySide6\\translations\\qtbase_uk.qm',
   'DATA'),
  ('PySide6\\translations\\qtbase_de.qm',
   'D:\\lecturecutter\\venv\\lib\\site-packages\\PySide6\\translations\\qtbase_de.qm',
   'DATA'),
  ('cv2\\misc\\__init__.py',
   'd:\\lecturecutter\\venv\\lib\\site-packages\\cv2\\misc\\__init__.py',
   'DATA'),
  ('PySide6\\translations\\qtbase_pl.qm',
   'D:\\lecturecutter\\venv\\lib\\site-packages\\PySide6\\translations\\qtbase_pl.qm',
   'DATA'),
  ('PySide6\\translations\\qtbase_ar.qm',
   'D:\\lecturecutter\\venv\\lib\\site-packages\\PySide6\\translations\\qtbase_ar.qm',
   'DATA'),
  ('PySide6\\translations\\qtbase_he.qm',
   'D:\\lecturecutter\\venv\\lib\\site-packages\\PySide6\\translations\\qtbase_he.qm',
   'DATA'),
  ('PySide6\\translations\\qtbase_en.qm',
   'D:\\lecturecutter\\venv\\lib\\site-packages\\PySide6\\translations\\qtbase_en.qm',
   'DATA'),
  ('PySide6\\translations\\qtbase_ru.qm',
   'D:\\lecturecutter\\venv\\lib\\site-packages\\PySide6\\translations\\qtbase_ru.qm',
   'DATA'),
  ('pyinstaller-4.7.dist-info\\top_level.txt',
   'd:\\lecturecutter\\venv\\lib\\site-packages\\pyinstaller-4.7.dist-info\\top_level.txt',
   'DATA'),
  ('setuptools-57.0.0.dist-info\\top_level.txt',
   'd:\\lecturecutter\\venv\\lib\\site-packages\\setuptools-57.0.0.dist-info\\top_level.txt',
   'DATA'),
  ('altgraph-0.17.2.dist-info\\WHEEL',
   'd:\\lecturecutter\\venv\\lib\\site-packages\\altgraph-0.17.2.dist-info\\WHEEL',
   'DATA'),
  ('pyinstaller-4.7.dist-info\\REQUESTED',
   'd:\\lecturecutter\\venv\\lib\\site-packages\\pyinstaller-4.7.dist-info\\REQUESTED',
   'DATA'),
  ('altgraph-0.17.2.dist-info\\top_level.txt',
   'd:\\lecturecutter\\venv\\lib\\site-packages\\altgraph-0.17.2.dist-info\\top_level.txt',
   'DATA'),
  ('altgraph-0.17.2.dist-info\\METADATA',
   'd:\\lecturecutter\\venv\\lib\\site-packages\\altgraph-0.17.2.dist-info\\METADATA',
   'DATA'),
  ('altgraph-0.17.2.dist-info\\zip-safe',
   'd:\\lecturecutter\\venv\\lib\\site-packages\\altgraph-0.17.2.dist-info\\zip-safe',
   'DATA'),
  ('wheel-0.36.2.dist-info\\entry_points.txt',
   'd:\\lecturecutter\\venv\\lib\\site-packages\\wheel-0.36.2.dist-info\\entry_points.txt',
   'DATA'),
  ('altgraph-0.17.2.dist-info\\RECORD',
   'd:\\lecturecutter\\venv\\lib\\site-packages\\altgraph-0.17.2.dist-info\\RECORD',
   'DATA'),
  ('wheel-0.36.2.dist-info\\top_level.txt',
   'd:\\lecturecutter\\venv\\lib\\site-packages\\wheel-0.36.2.dist-info\\top_level.txt',
   'DATA'),
  ('altgraph-0.17.2.dist-info\\INSTALLER',
   'd:\\lecturecutter\\venv\\lib\\site-packages\\altgraph-0.17.2.dist-info\\INSTALLER',
   'DATA'),
  ('setuptools-57.0.0.dist-info\\LICENSE',
   'd:\\lecturecutter\\venv\\lib\\site-packages\\setuptools-57.0.0.dist-info\\LICENSE',
   'DATA'),
  ('setuptools-57.0.0.dist-info\\dependency_links.txt',
   'd:\\lecturecutter\\venv\\lib\\site-packages\\setuptools-57.0.0.dist-info\\dependency_links.txt',
   'DATA'),
  ('wheel-0.36.2.dist-info\\INSTALLER',
   'd:\\lecturecutter\\venv\\lib\\site-packages\\wheel-0.36.2.dist-info\\INSTALLER',
   'DATA'),
  ('setuptools-57.0.0.dist-info\\RECORD',
   'd:\\lecturecutter\\venv\\lib\\site-packages\\setuptools-57.0.0.dist-info\\RECORD',
   'DATA'),
  ('pyinstaller-4.7.dist-info\\METADATA',
   'd:\\lecturecutter\\venv\\lib\\site-packages\\pyinstaller-4.7.dist-info\\METADATA',
   'DATA'),
  ('wheel-0.36.2.dist-info\\LICENSE.txt',
   'd:\\lecturecutter\\venv\\lib\\site-packages\\wheel-0.36.2.dist-info\\LICENSE.txt',
   'DATA'),
  ('setuptools-57.0.0.dist-info\\WHEEL',
   'd:\\lecturecutter\\venv\\lib\\site-packages\\setuptools-57.0.0.dist-info\\WHEEL',
   'DATA'),
  ('setuptools-57.0.0.dist-info\\INSTALLER',
   'd:\\lecturecutter\\venv\\lib\\site-packages\\setuptools-57.0.0.dist-info\\INSTALLER',
   'DATA'),
  ('wheel-0.36.2.dist-info\\WHEEL',
   'd:\\lecturecutter\\venv\\lib\\site-packages\\wheel-0.36.2.dist-info\\WHEEL',
   'DATA'),
  ('pyinstaller-4.7.dist-info\\RECORD',
   'd:\\lecturecutter\\venv\\lib\\site-packages\\pyinstaller-4.7.dist-info\\RECORD',
   'DATA'),
  ('pyinstaller-4.7.dist-info\\COPYING.txt',
   'd:\\lecturecutter\\venv\\lib\\site-packages\\pyinstaller-4.7.dist-info\\COPYING.txt',
   'DATA'),
  ('pyinstaller-4.7.dist-info\\INSTALLER',
   'd:\\lecturecutter\\venv\\lib\\site-packages\\pyinstaller-4.7.dist-info\\INSTALLER',
   'DATA'),
  ('setuptools-57.0.0.dist-info\\METADATA',
   'd:\\lecturecutter\\venv\\lib\\site-packages\\setuptools-57.0.0.dist-info\\METADATA',
   'DATA'),
  ('altgraph-0.17.2.dist-info\\LICENSE',
   'd:\\lecturecutter\\venv\\lib\\site-packages\\altgraph-0.17.2.dist-info\\LICENSE',
   'DATA'),
  ('wheel-0.36.2.dist-info\\RECORD',
   'd:\\lecturecutter\\venv\\lib\\site-packages\\wheel-0.36.2.dist-info\\RECORD',
   'DATA'),
  ('setuptools-57.0.0.dist-info\\entry_points.txt',
   'd:\\lecturecutter\\venv\\lib\\site-packages\\setuptools-57.0.0.dist-info\\entry_points.txt',
   'DATA'),
  ('pyinstaller-4.7.dist-info\\entry_points.txt',
   'd:\\lecturecutter\\venv\\lib\\site-packages\\pyinstaller-4.7.dist-info\\entry_points.txt',
   'DATA'),
  ('wheel-0.36.2.dist-info\\METADATA',
   'd:\\lecturecutter\\venv\\lib\\site-packages\\wheel-0.36.2.dist-info\\METADATA',
   'DATA'),
  ('pyinstaller-4.7.dist-info\\WHEEL',
   'd:\\lecturecutter\\venv\\lib\\site-packages\\pyinstaller-4.7.dist-info\\WHEEL',
   'DATA')],)
