<svg width="20" height="18" viewBox="0 0 20 18" fill="none" xmlns="http://www.w3.org/2000/svg">
<path d="M14.9017 15.0809C13.436 16.0105 11.7356 16.5028 9.99999 16.5001C5.50666 16.5001 1.76833 13.2667 0.984161 9.00006C1.34252 7.05899 2.31885 5.2858 3.76749 3.94506L1.15999 1.34006L2.33916 0.160889L18.8383 16.6609L17.6592 17.8392L14.9008 15.0809H14.9017ZM4.94583 5.12505C3.81333 6.15471 3.02443 7.50737 2.68583 9.00006C2.94607 10.1388 3.46855 11.201 4.21166 12.1022C4.95478 13.0034 5.89802 13.7187 6.96629 14.1911C8.03456 14.6636 9.19837 14.8801 10.3651 14.8235C11.5318 14.7669 12.6691 14.4387 13.6867 13.8651L11.9967 12.1751C11.2772 12.6282 10.4252 12.8235 9.58019 12.7288C8.73522 12.634 7.94753 12.255 7.3463 11.6537C6.74508 11.0525 6.36602 10.2648 6.2713 9.41986C6.17657 8.57489 6.37181 7.72281 6.82499 7.00339L4.94583 5.12505ZM10.7617 10.9401L8.05999 8.23839C7.91172 8.61584 7.87682 9.02835 7.95958 9.42534C8.04235 9.82233 8.23918 10.1865 8.52593 10.4733C8.81268 10.76 9.17688 10.9569 9.57387 11.0396C9.97087 11.1224 10.3834 11.0875 10.7608 10.9392L10.7617 10.9401ZM17.3392 12.8267L16.1467 11.6351C16.7037 10.8411 17.1003 9.94604 17.3142 9.00006C17.0877 8.00816 16.6619 7.07268 16.0626 6.25047C15.4634 5.42826 14.7032 4.73649 13.8282 4.21723C12.9533 3.69796 11.9819 3.36203 10.9731 3.22986C9.96431 3.09769 8.93917 3.17204 7.95999 3.44839L6.64499 2.13339C7.68416 1.72506 8.81666 1.50006 9.99999 1.50006C14.4933 1.50006 18.2317 4.73339 19.0158 9.00006C18.7605 10.3881 18.1865 11.698 17.3392 12.8267ZM9.76916 5.25672C10.2996 5.22394 10.8309 5.30428 11.3279 5.4924C11.825 5.68053 12.2763 5.97215 12.6521 6.34793C13.0279 6.72371 13.3195 7.17508 13.5076 7.6721C13.6958 8.16913 13.7761 8.70046 13.7433 9.23089L9.76833 5.25672H9.76916Z" fill="#B4BAC8"/>
</svg>
