<svg width="33" height="33" viewBox="0 0 33 33" fill="none" xmlns="http://www.w3.org/2000/svg">
<path d="M21.961 17.829L6.10534 17.829L6.10534 15.2237L21.961 15.2237L14.9737 8.23638L16.8156 6.39446L26.9474 16.5263L16.8156 26.6582L14.9737 24.8163L21.961 17.829Z" fill="white"/>
</svg>
