<svg width="20" height="20" viewBox="0 0 20 20" fill="none" xmlns="http://www.w3.org/2000/svg">
<path d="M4.785 8.75003H20V11.25H4.785L11.49 17.955L9.7225 19.7225L0 10L9.7225 0.277527L11.49 2.04503L4.785 8.75003Z" fill="#3A4865"/>
</svg>
