<svg width="18" height="18" viewBox="0 0 18 18" fill="none" xmlns="http://www.w3.org/2000/svg">
<path d="M9.9 3.85808L14.142 8.10108L4.242 18.0001H0V13.7571L9.9 3.85708V3.85808ZM11.314 2.44408L13.435 0.322083C13.6225 0.134612 13.8768 0.0292969 14.142 0.0292969C14.4072 0.0292969 14.6615 0.134612 14.849 0.322083L17.678 3.15108C17.8655 3.33861 17.9708 3.59292 17.9708 3.85808C17.9708 4.12325 17.8655 4.37756 17.678 4.56508L15.556 6.68608L11.314 2.44408Z" fill="#6c99f5"/>
</svg>
