{
	"package_url": "https://gitlab.com/luxtorpeda/packages/vkquake/",
	"package_commit": "%GIT_COMMIT%",
	"engine_version": "%GIT_SOURCE_DESCRIPTION%",
	"commands": [
		{
			"match_cmd": ".*",
			"cmd": "./vkquake.sh",
			"args": []
		}
	]
}
