{
	"package_url": "https://gitlab.com/luxtorpeda/packages/${PACKAGE_NAME}/",
	"package_commit": "%GIT_COMMIT%",
	"engine_version": "%GIT_SOURCE_DESCRIPTION%",
	"commands": [
		{
			"match_cmd": ".*",
			"cmd": "",
			"args": []
		}
	]
}
