{
	"info": {
		"_postman_id": "7ad94d1a-419a-4a46-a2ee-5ac04cebe208",
		"name": "session 33 - activity",
		"schema": "https://schema.getpostman.com/json/collection/v2.1.0/collection.json"
	},
	"item": [
		{
			"name": "Retrieve specific task",
			"request": {
				"method": "GET",
				"header": [],
				"url": {
					"raw": "localhost:4000/tasks/getTask/61f7e30821afef4462bc2594",
					"host": [
						"localhost"
					],
					"port": "4000",
					"path": [
						"tasks",
						"getTask",
						"61f7e30821afef4462bc2594"
					]
				}
			},
			"response": []
		},
		{
			"name": "Changing status of a task",
			"request": {
				"method": "PUT",
				"header": [],
				"body": {
					"mode": "raw",
					"raw": "{\n    \"status\": \"complete\"\n}",
					"options": {
						"raw": {
							"language": "json"
						}
					}
				},
				"url": {
					"raw": "localhost:4000/tasks/updateTaskStatus/61f7e30821afef4462bc2594/complete",
					"host": [
						"localhost"
					],
					"port": "4000",
					"path": [
						"tasks",
						"updateTaskStatus",
						"61f7e30821afef4462bc2594",
						"complete"
					]
				}
			},
			"response": []
		}
	]
}