{
	"info": {
		"_postman_id": "148e97c8-5c41-4d55-a468-00c8ae338e94",
		"name": "session 30 - activity",
		"schema": "https://schema.getpostman.com/json/collection/v2.1.0/collection.json"
	},
	"item": [
		{
			"name": "get all to do list items",
			"request": {
				"method": "GET",
				"header": []
			},
			"response": []
		},
		{
			"name": "get to do list item",
			"request": {
				"method": "GET",
				"header": []
			},
			"response": []
		},
		{
			"name": "create to do list item",
			"request": {
				"method": "GET",
				"header": []
			},
			"response": []
		},
		{
			"name": "update to do list item PUT",
			"request": {
				"method": "GET",
				"header": []
			},
			"response": []
		},
		{
			"name": "update to do list item PATCH",
			"request": {
				"method": "GET",
				"header": []
			},
			"response": []
		},
		{
			"name": "delete to do list item",
			"request": {
				"method": "GET",
				"header": []
			},
			"response": []
		}
	]
}