﻿Id,Field,Expected Result,Actual Result
24,IDE_Status,New-InitialDataEntry,
25,Account_Status_In_eMas,Saving Account Number is active,
26,CIF Number Status,CIF Number is found in EMAS,
27,Post_IDE_Stage,Pending-DocUpload,
