﻿Id,Field,Expected Result,Actual Result
10,eMas Info,Saving Account Number is active,Saving Account Number is active
11,Interest Category 1,Fix,Fix
12,Interest Category 2,Floating,Floating
13,Post_DDE_Stage,Pending-DoubleDataEntry,"  Pending-DoubleDataEntry  "
-1,KPR,KPR10012062,KPR10012062
