﻿Id,Field,Expected Result,Actual Result
,,,
-1,Applicant City of Birth,BOGOR,BOGOR
-1,Applicant Born Date,19910828,19910828
-1,Applicant Full Name,WILDAN FAKHRI,WILDAN FAKHRI
-1,Applicant ID Number,3198098988910078,3198098988910078
