Year,Total CO2 Emissions  (MtCO2)
1850,198
1851,198
1852,209
1853,216
1854,253
1855,260
1856,278
1857,282
1858,286
1859,304
1860,333
1861,348
1862,352
1863,377
1864,410
1865,436
1866,447
1867,476
1868,491
1869,520
1870,539
1871,575
1872,638
1873,674
1874,638
1875,689
1876,700
1877,711
1878,718
1879,769
1880,865
1881,890
1882,938
1883,997
1884,1008
1885,1019
1886,1033
1887,1081
1888,1198
1889,1198
1890,1304
1891,1359
1892,1370
1893,1356
1894,1403
1895,1488
1896,1535
1897,1612
1898,1700
1899,1861
1900,1957
1901,2026
1902,2074
1903,2261
1904,2286
1905,2433
1906,2594
1907,2869
1908,2744
1909,2876
1910,3001
1911,3059
1912,3221
1913,3459
1914,3114
1915,3070
1916,3298
1917,3503
1918,3430
1919,2953
1920,3415
1921,2942
1922,3096
1923,3554
1924,3525
1925,3572
1926,3605
1927,3891
1928,3906
1929,4195
1930,3855
1931,3440
1932,3103
1933,3276
1934,3565
1935,3759
1936,4140
1937,4430
1938,4188
1939,4364
1940,4760
1941,4884
1942,4913
1943,5097
1944,5067
1945,4254
1946,4536
1947,5104
1948,5382
1949,5199
1950,5892
1951,6386
1952,6482
1953,6643
1954,6734
1955,7376
1956,7859
1957,8189
1958,8409
1959,8856
1960,9266
1961,9299
1962,9684
1963,10204
1964,10790
1965,11267
1966,11827
1967,12194
1968,12798
1969,13557
1970,14531
1971,14393
1972,15105
1973,15981
1974,15965
1975,16037
1976,16907
1977,17521
1978,18108
1979,18670
1980,18742
1981,18457
1982,18248
1983,18413
1984,18988
1985,19282
1986,19670
1987,20340
1988,21088
1989,21511
1990,21713
1991,21952
1992,21878
1993,22008
1994,22175
1995,22780
1996,23381
1997,23621
1998,23722
1999,23887
2000,24758
2001,24999
2002,25439
2003,26612
2004,27879
2005,28893
2006,29849
2007,30913
2008,31146
2009,30718
2010,32340
2011,33371
2012,33843