0 198
1 1349
2 1455
3 1377
4 902
5 1976
6 1526
7 1304
8 1864
9 96
10 1245
11 372
12 1024
13 1515
14 906
15 1501
16 1058
17 994
18 1304
19 370
20 992
21 654
22 1902
23 567
24 51
25 1771
26 710
27 880
28 493
29 492
30 1978
31 1304
32 1626
33 869
34 125
35 1455
36 1427
37 679
38 1934
39 1512
40 690
41 1331
42 1901
43 980
44 1416
45 1895
46 422
47 1541
48 703
49 1537
50 907
51 1535
52 432
53 782
54 198
55 922
56 1374
57 1304
58 1524
59 159
60 620
61 1385
62 1544
63 1093
64 499
65 2011
66 52
67 895
68 464
69 1421
70 613
71 1054
72 2038
73 1509
74 683
75 115
76 1715
77 1162
78 1188
79 677
80 1374
81 1156
82 810
83 1205
84 760
85 567
86 1814
87 1698
88 773
89 635
90 1619
91 782
92 475
93 797
94 1975
95 1538
96 998
97 158
98 223
99 1686
100 908
101 969
102 1420
103 383
104 1031
105 941
106 233
107 1091
108 1626
109 66
110 1165
111 1255
112 785
113 1988
114 1091
115 284
116 1219
117 67
118 1441
119 693
120 2041
121 1446
122 1353
123 1575
124 1738
125 1097
126 51
127 1440
128 1148
129 1031
130 79
131 1333
132 1333
133 590
134 1983
135 680
136 1160
137 1120
138 1100
139 135
140 66
141 1536
142 1774
143 208
144 81
145 205
146 1587
147 1889
148 2004
149 1512
150 860
151 761
152 1416
153 1163
154 1097
155 1113
156 255
157 208
158 1669
159 242
160 1715
161 1163
162 1416
163 617
164 81
165 524
166 66
167 978
168 89
169 1054
170 421
171 900
172 691
173 900
174 1903
175 880
176 1870
177 1963
178 1634
179 1574
180 94
181 934
182 1998
183 164
184 1933
185 633
186 868
187 1392
188 583
189 1686
190 185
191 971
192 1286
193 1090
194 1902
195 416
196 868
197 494
198 1274
199 1530
200 492
201 80
202 81
203 498
204 253
205 1199
206 255
207 971
208 1268
209 909
210 1095
211 1625
212 1541
213 559
214 1333
215 1088
216 693
217 1054
218 798
219 1993
220 1991
221 1434
222 995
223 271
224 75
225 235
226 427
227 1166
228 86
229 1595
230 311
231 968
232 208
233 1381
234 533
235 195
236 1240
237 1364
238 1728
239 110
240 1420
241 430
242 1195
243 1455
244 1097
245 884
246 4
247 797
248 1234
249 1579
250 1441
251 394
252 1866
253 1674
254 79
255 1524
256 1471
257 1824
258 66
259 1843
260 731
261 1710
262 238
263 1440
264 430
265 631
266 1620
267 1983
268 1553
269 109
270 66
271 1630
272 1746
273 1353
274 1676
275 762
276 1097
277 1894
278 1205
279 906
280 919
281 208
282 902
283 158
284 932
285 1195
286 1737
287 533
288 139
289 1926
290 295
291 402
292 1163
293 968
294 255
295 1230
296 239
297 1416
298 693
299 91
300 1463
301 954
302 1288
303 1739
304 1353
305 79
306 416
307 1304
308 686
309 66
310 1524
311 1774
312 799
313 1524
314 370
315 1230
316 1091
317 1635
318 90
319 628
320 1024
321 1195
322 208
323 1188
324 753
325 228
326 815
327 686
328 206
329 861
330 81
331 1469
332 679
333 1313
334 1379
335 797
336 134
337 1749
338 295
339 225
340 1710
341 1710
342 1439
343 77
344 1455
345 687
346 47
347 1500
348 1488
349 760
350 1836
351 782
352 1031
353 66
354 122
355 1508
356 1934
357 670
358 659
359 560
360 1963
361 1757
362 582
363 109
364 1784
365 547
366 1843
367 438
368 1583
369 62
370 109
371 253
372 222
373 1536
374 1829
375 2016
376 312
377 1374
378 1501
379 1619
380 68
381 1757
382 1501
383 7
384 586
385 371
386 631
387 109
388 2013
389 88
390 1501
391 1801
392 1897
393 1493
394 1182
395 1501
396 1637
397 52
398 1205
399 370
400 1094
401 1139
402 51
403 1416
404 1381
405 1512
406 687
407 1643
408 670
409 1003
410 170
411 1349
412 1229
413 677
414 370
415 1232
416 995
417 113
418 1824
419 271
420 81
421 1227
422 322
423 850
424 178
425 1739
426 58
427 1120
428 1765
429 4
430 228
431 1870
432 126
433 909
434 687
435 461
436 641
437 1197
438 1385
439 370
440 1948
441 541
442 1944
443 1411
444 370
445 441
446 1501
447 222
448 1849
449 1460
450 860
451 987
452 1597
453 1008
454 1247
455 932
456 1036
457 104
458 42
459 731
460 1258
461 1062
462 1146
463 1322
464 1926
465 1054
466 1709
467 906
468 1108
469 754
470 415
471 1709
472 1771
473 1684
474 1991
475 320
476 1478
477 1488
478 450
479 1894
480 980
481 1814
482 284
483 320
484 1515
485 1501
486 1499
487 1205
488 677
489 171
490 125
491 1530
492 1091
493 1934
494 1614
495 1100
496 1541
497 2000
498 1650
499 383
500 1396
501 1949
502 1400
503 225
504 810
505 1155
506 1903
507 1626
508 2013
509 1205
510 320
511 1232
512 1831
513 1646
514 1450
515 253
516 1093
517 1567
518 1720
519 79
520 679
521 567
522 1895
523 372
524 762
525 893
526 1686
527 1718
528 1597
529 1058
530 66
531 258
532 613
533 414
534 66
535 1212
536 295
537 674
538 122
539 416
540 1897
541 1178
542 1265
543 1894
544 451
545 760
546 1982
547 1334
548 50
549 1414
550 27
551 326
552 1045
553 511
554 1536
555 1598
556 539
557 893
558 1232
559 163
560 873
561 1446
562 494
563 1619
564 760
565 1162
566 1240
567 1333
568 1277
569 2017
570 1493
571 813
572 2013
573 900
574 950
575 679
576 2043
577 568
578 258
579 1474
580 554
581 2013
582 1787
583 218
584 1814
585 81
586 687
587 1468
588 780
589 1034
590 1304
591 1272
592 1057
593 1975
594 253
595 1609
596 1019
597 1659
598 1333
599 1345
600 869
601 1297
602 450
603 517
604 1630
605 82
606 1843
607 1195
608 1636
609 1870
610 1508
611 1684
612 1496
613 82
614 113
615 677
616 1381
617 1902
618 1934
619 1205
620 514
621 1990
622 91
623 1050
624 205
625 1979
626 1904
627 91
628 1894
629 370
630 79
631 383
632 531
633 1309
634 1709
635 677
636 164
637 706
638 241
639 1314
640 91
641 558
642 75
643 875
644 1345
645 979
646 1792
647 1025
648 1740
649 370
650 1120
651 1205
652 1933
653 1803
654 1466
655 893
656 39
657 505
658 891
659 168
660 1820
661 1302
662 1089
663 1579
664 721
665 967
666 533
667 1858
668 1304
669 1037
670 142
671 725
672 687
673 291
674 109
675 749
676 719
677 1983
678 199
679 969
680 1353
681 1345
682 212
683 208
684 1304
685 1309
686 1672
687 644
688 1103
689 168
690 2004
691 1728
692 1728
693 1205
694 1354
695 679
696 822
697 1416
698 241
699 1934
700 205
701 1034
702 627
703 1791
704 172
705 2046
706 163
707 1596
708 1162
709 2042
710 533
711 1301
712 1738
713 1138
714 1934
715 1416
716 912
717 1579
718 1416
719 1434
720 1963
721 1663
722 1787
723 788
724 312
725 860
726 158
727 1819
728 218
729 1301
730 262
731 113
732 1903
733 208
734 372
735 1296
736 1670
737 1062
738 906
739 941
740 687
741 242
742 1934
743 1569
744 1471
745 1493
746 450
747 563
748 893
749 450
750 882
751 1843
752 66
753 299
754 312
755 91
756 335
757 989
758 830
759 1781
760 1819
761 113
762 66
763 91
764 1446
765 533
766 2038
767 1506
768 971
769 1728
770 661
771 1737
772 1189
773 370
774 1062
775 1536
776 1774
777 1720
778 1120
779 1885
780 164
781 1544
782 995
783 1374
784 494
785 109
786 1304
787 2013
788 1973
789 253
790 113
791 1440
792 79
793 238
794 1747
795 1214
796 1236
797 77
798 109
799 1230
800 1684
801 677
802 608
803 93
804 932
805 1526
806 1093
807 416
808 1420
809 1595
810 253
811 1155
812 559
813 312
814 1301
815 893
816 12
817 891
818 416
819 893
820 797
821 950
822 809
823 259
824 569
825 1912
826 492
827 980
828 1567
829 1023
830 1219
831 109
832 995
833 66
834 1232
835 1873
836 907
837 1148
838 1735
839 567
840 489
841 304
842 479
843 1304
844 1501
845 1665
846 1820
847 1434
848 1720
849 265
850 687
851 488
852 1988
853 1446
854 370
855 234
856 1093
857 284
858 1353
859 1526
860 109
861 159
862 1446
863 4
864 709
865 893
866 1619
867 492
868 1591
869 1038
870 1710
871 1275
872 1530
873 1301
874 558
875 1710
876 450
877 1876
878 228
879 208
880 967
881 1934
882 1097
883 1013
884 133
885 295
886 79
887 458
888 372
889 1189
890 1851
891 314
892 1331
893 1300
894 615
895 422
896 903
897 1065
898 677
899 195
900 311
901 773
902 1007
903 1757
904 109
905 933
906 2039
907 183
908 1732
909 218
910 459
911 1446
912 492
913 1083
914 4
915 907
916 971
917 1895
918 416
919 2000
920 1334
921 1058
922 626
923 514
924 165
925 81
926 753
927 1180
928 1811
929 1491
930 1301
931 233
932 137
933 723
934 113
935 248
936 1866
937 1485
938 1670
939 1935
940 782
941 335
942 1379
943 1864
944 946
945 902
946 1596
947 614
948 670
949 374
950 1433
951 159
952 1998
953 1958
954 1297
955 312
956 1217
957 1120
958 276
959 1691
960 1961
961 356
962 1239
963 760
964 1843
965 679
966 1512
967 1205
968 1278
969 322
970 1304
971 1354
972 1774
973 1176
974 1703
975 320
976 1709
977 1554
978 888
979 900
980 434
981 1018
982 1683
983 1820
984 1493
985 1144
986 861
987 1371
988 980
989 81
990 1199
991 1843
992 1289
993 1411
994 56
995 1774
996 1146
997 1066
998 1902
999 1210
1000 1931
1001 1148
1002 1515
1003 248
1004 1669
1005 523
1006 1266
1007 1674
1008 253
1009 1399
1010 1619
1011 1050
1012 1607
1013 893
1014 370
1015 198
1016 1491
1017 1619
1018 164
1019 242
1020 1554
1021 242
1022 1809
1023 1855
1024 620
1025 319
1026 866
1027 1085
1028 1416
1029 1538
1030 1189
1031 1894
1032 101
1033 1579
1034 432
1035 906
1036 1334
1037 411
1038 1304
1039 1224
1040 971
1041 1424
1042 605
1043 1832
1044 75
1045 679
1046 1501
1047 208
1048 200
1049 1066
1050 1787
1051 1537
1052 1923
1053 1831
1054 1372
1055 89
1056 1911
1057 411
1058 965
1059 1579
1060 576
1061 1923
1062 622
1063 998
1064 28
1065 1819
1066 1831
1067 514
1068 0
1069 1588
1070 167
1071 317
1072 422
1073 370
1074 1354
1075 1725
1076 158
1077 313
1078 1569
1079 915
1080 1843
1081 1927
1082 372
1083 1297
1084 473
1085 1988
1086 1579
1087 314
1088 1301
1089 1467
1090 794
1091 666
1092 907
1093 1909
1094 558
1095 1162
1096 1039
1097 238
1098 1446
1099 1526
1100 259
1101 725
1102 438
1103 1626
1104 373
1105 1728
1106 1934
1107 1286
1108 1097
1109 372
1110 1097
1111 1240
1112 1544
1113 104
1114 569
1115 848
1116 82
1117 1100
1118 1420
1119 1737
1120 828
1121 197
1122 2000
1123 1148
1124 1670
1125 911
1126 445
1127 1251
1128 1093
1129 467
1130 976
1131 875
1132 1555
1133 547
1134 384
1135 1124
1136 1219
1137 1555
1138 1304
1139 1858
1140 631
1141 424
1142 195
1143 1737
1144 1441
1145 1195
1146 1239
1147 595
1148 1301
1149 909
1150 1399
1151 167
1152 51
1153 810
1154 1086
1155 208
1156 253
1157 713
1158 1713
1159 1446
1160 1819
1161 1636
1162 679
1163 1501
1164 1813
1165 1674
1166 1212
1167 1370
1168 464
1169 1963
1170 66
1171 1353
1172 1416
1173 75
1174 383
1175 1008
1176 1870
1177 2013
1178 1744
1179 88
1180 631
1181 416
1182 1472
1183 1483
1184 370
1185 679
1186 1058
1187 1058
1188 756
1189 1034
1190 567
1191 1066
1192 1568
1193 1182
1194 1301
1195 1630
1196 127
1197 869
1198 940
1199 249
1200 1670
1201 1800
1202 533
1203 1898
1204 723
1205 719
1206 1156
1207 1740
1208 248
1209 1581
1210 1820
1211 74
1212 1205
1213 1162
1214 454
1215 94
1216 113
1217 1732
1218 295
1219 590
1220 1851
1221 1333
1222 295
1223 1934
1224 1934
1225 1100
1226 1300
1227 208
1228 764
1229 80
1230 1533
1231 1579
1232 814
1233 868
1234 1493
1235 1297
1236 239
1237 66
1238 517
1239 626
1240 893
1241 91
1242 971
1243 233
1244 322
1245 208
1246 4
1247 320
1248 1819
1249 810
1250 496
1251 317
1252 1911
1253 1381
1254 1303
1255 773
1256 687
1257 1684
1258 320
1259 1093
1260 82
1261 1260
1262 286
1263 927
1264 1597
1265 1350
1266 1093
1267 987
1268 669
1269 1986
1270 533
1271 319
1272 564
1273 1455
1274 1040
1275 1963
1276 258
1277 386
1278 546
1279 677
1280 903
1281 690
1282 903
1283 1271
1284 37
1285 1115
1286 521
1287 1718
1288 940
1289 206
1290 462
1291 66
1292 1446
1293 1474
1294 1195
1295 635
1296 906
1297 1268
1298 965
1299 1537
1300 281
1301 208
1302 1064
1303 1949
1304 66
1305 370
1306 1572
1307 1750
1308 716
1309 1139
1310 2013
1311 524
1312 1990
1313 1887
1314 172
1315 767
1316 1374
1317 880
1318 1378
1319 486
1320 424
1321 1670
1322 1416
1323 295
1324 79
1325 319
1326 911
1327 1792
1328 679
1329 1304
1330 94
1331 253
1332 89
1333 50
1334 1909
1335 710
1336 81
1337 89
1338 81
1339 1948
1340 208
1341 195
1342 1427
1343 1417
1344 1446
1345 91
1346 1567
1347 1934
1348 919
1349 679
1350 614
1351 242
1352 1469
1353 1446
1354 706
1355 677
1356 242
1357 94
1358 496
1359 36
1360 284
1361 422
1362 711
1363 496
1364 1395
1365 241
1366 1302
1367 91
1368 1720
1369 1765
1370 805
1371 1506
1372 1963
1373 248
1374 159
1375 307
1376 1392
1377 242
1378 1481
1379 310
1380 932
1381 1093
1382 687
1383 43
1384 1587
1385 1524
1386 242
1387 1813
1388 1034
1389 1188
1390 1585
1391 1975
1392 419
1393 1334
1394 1737
1395 1882
1396 1289
1397 242
1398 422
1399 211
1400 765
1401 10
1402 1205
1403 617
1404 1501
1405 773
1406 723
1407 644
1408 1120
1409 1512
1410 1694
1411 1881
1412 1948
1413 1301
1414 256
1415 1847
1416 533
1417 1732
1418 1781
1419 611
1420 258
1421 109
1422 1544
1423 1596
1424 1709
1425 1934
1426 1908
1427 1439
1428 242
1429 174
1430 1514
1431 1858
1432 1439
1433 201
1434 319
1435 1345
1436 1180
1437 953
1438 66
1439 137
1440 1851
1441 1508
1442 113
1443 1471
1444 441
1445 1833
1446 359
1447 253
1448 696
1449 495
1450 741
1451 411
1452 627
1453 1978
1454 479
1455 259
1456 109
1457 119
1458 1416
1459 1348
1460 1583
1461 1602
1462 1275
1463 1813
1464 1831
1465 372
1466 620
1467 1524
1468 635
1469 1501
1470 1085
1471 679
1472 2044
1473 1998
1474 487
1475 312
1476 570
1477 1222
1478 1120
1479 1587
1480 1433
1481 242
1482 1686
1483 225
1484 1350
1485 577
1486 906
1487 1163
1488 81
1489 814
1490 2013
1491 370
1492 902
1493 1784
1494 1075
1495 91
1496 967
1497 995
1498 1626
1499 125
1500 56
1501 1199
1502 363
1503 1691
1504 1524
1505 677
1506 68
1507 1212
1508 771
1509 223
1510 91
1511 1661
1512 253
1513 1964
1514 1275
1515 1058
1516 472
1517 1694
1518 491
1519 94
1520 950
1521 693
1522 1699
1523 711
1524 1197
1525 1097
1526 899
1527 967
1528 1967
1529 1038
1530 1304
1531 1034
1532 1684
1533 748
1534 1008
1535 531
1536 1045
1537 971
1538 1489
1539 1669
1540 1934
1541 1163
1542 72
1543 240
1544 1583
1545 1670
1546 133
1547 1975
1548 893
1549 909
1550 1684
1551 94
1552 725
1553 1813
1554 1322
1555 1649
1556 383
1557 1197
1558 1233
1559 487
1560 2044
1561 1155
1562 1334
1563 1501
1564 208
1565 81
1566 1596
1567 1296
1568 2042
1569 119
1570 484
1571 220
1572 565
1573 66
1574 733
1575 295
1576 1301
1577 1050
1578 1083
1579 1097
1580 1428
1581 505
1582 1637
1583 1690
1584 1302
1585 1028
1586 1481
1587 240
1588 1097
1589 467
1590 115
1591 576
1592 1732
1593 595
1594 856
1595 1166
1596 419
1597 773
1598 1672
1599 1583
1600 1841
1601 2007
1602 443
1603 1350
1604 1728
1605 1597
1606 1843
1607 1255
1608 679
1609 197
1610 234
1611 91
1612 1531
1613 1709
1614 461
1615 1345
1616 595
1617 242
1618 1232
1619 276
1620 893
1621 280
1622 907
1623 1530
1624 1120
1625 1496
1626 1732
1627 1533
1628 320
1629 1050
1630 253
1631 1748
1632 1813
1633 1626
1634 311
1635 1421
1636 472
1637 208
1638 1684
1639 81
1640 1541
1641 1876
1642 1275
1643 967
1644 1493
1645 1983
1646 2040
1647 1493
1648 1017
1649 677
1650 144
1651 1205
1652 158
1653 1732
1654 1669
1655 1416
1656 553
1657 1176
1658 597
1659 148
1660 935
1661 1820
1662 370
1663 1070
1664 1304
1665 690
1666 443
1667 949
1668 443
1669 1718
1670 1232
1671 1416
1672 965
1673 679
1674 756
1675 966
1676 295
1677 667
1678 1894
1679 183
1680 340
1681 1876
1682 1450
1683 1739
1684 725
1685 1670
1686 304
1687 1148
1688 242
1689 94
1690 1514
1691 782
1692 580
1693 1467
1694 253
1695 1179
1696 899
1697 1870
1698 1844
1699 855
1700 1370
1701 1902
1702 1120
1703 1416
1704 1744
1705 1524
1706 875
1707 773
1708 220
1709 4
1710 1728
1711 1848
1712 1933
1713 560
1714 370
1715 1173
1716 255
1717 127
1718 576
1719 1978
1720 2000
1721 1493
1722 1234
1723 476
1724 198
1725 169
1726 779
1727 595
1728 2039
1729 549
1730 1296
1731 569
1732 1567
1733 1894
1734 1385
1735 1732
1736 1909
1737 80
1738 1008
1739 971
1740 762
1741 491
1742 1331
1743 320
1744 709
1745 1024
1746 1934
1747 1493
1748 558
1749 670
1750 762
1751 1663
1752 1097
1753 416
1754 1724
1755 474
1756 1501
1757 1480
1758 1304
1759 1050
1760 1533
1761 1416
1762 201
1763 1572
1764 1597
1765 1019
1766 1876
1767 860
1768 241
1769 1720
1770 91
1771 1668
1772 1084
1773 1093
1774 690
1775 137
1776 135
1777 687
1778 161
1779 1
1780 1967
1781 163
1782 1882
1783 1462
1784 1326
1785 1439
1786 137
1787 1850
1788 1630
1789 322
1790 1420
1791 1049
1792 170
1793 204
1794 1894
1795 298
1796 1694
1797 955
1798 1146
1799 1957
1800 195
1801 1512
1802 893
1803 677
1804 2044
1805 1849
1806 1093
1807 850
1808 1416
1809 1894
1810 1165
1811 898
1812 1370
1813 1669
1814 1034
1815 1670
1816 295
1817 1224
1818 1831
1819 202
1820 1095
1821 183
1822 169
1823 533
1824 134
1825 1353
1826 195
1827 593
1828 208
1829 1710
1830 699
1831 208
1832 1353
1833 2000
1834 679
1835 109
1836 693
1837 1384
1838 79
1839 1944
1840 1481
1841 1368
1842 1304
1843 225
1844 113
1845 1792
1846 1574
1847 1240
1848 180
1849 971
1850 1304
1851 900
1852 1195
1853 1979
1854 242
1855 1787
1856 1914
1857 884
1858 113
1859 201
1860 1260
1861 1205
1862 1385
1863 873
1864 620
1865 1050
1866 1619
1867 1924
1868 242
1869 1058
1870 81
1871 142
1872 1824
1873 1501
1874 284
1875 1493
1876 415
1877 953
1878 339
1879 1195
1880 2044
1881 917
1882 860
1883 295
1884 1813
1885 1197
1886 679
1887 1450
1888 1684
1889 248
1890 77
1891 1935
1892 1026
1893 1138
1894 113
1895 295
1896 1978
1897 66
1898 253
1899 138
1900 1813
1901 7
1902 880
1903 723
1904 2044
1905 798
1906 479
1907 483
1908 127
1909 1228
1910 68
1911 1535
1912 1573
1913 81
1914 1050
1915 175
1916 4
1917 109
1918 140
1919 66
1920 83
1921 1089
1922 674
1923 1121
1924 830
1925 1297
1926 577
1927 159
1928 1179
1929 1696
1930 1988
1931 902
1932 1205
1933 577
1934 1666
1935 276
1936 1058
1937 1548
1938 1255
1939 1738
1940 1066
1941 1481
1942 669
1943 1058
1944 1616
1945 514
1946 971
1947 253
1948 1120
1949 1245
1950 969
1951 1345
1952 1464
1953 1353
1954 42
1955 2011
1956 1541
1957 81
1958 1728
1959 679
1960 941
1961 109
1962 1226
1963 81
1964 1544
1965 1003
1966 1351
1967 1934
1968 1102
1969 253
1970 773
1971 1176
1972 1148
1973 1370
1974 231
1975 208
1976 94
1977 1978
1978 1533
1979 1616
1980 1909
1981 1353
1982 370
1983 1870
1984 858
1985 280
1986 1880
1987 1345
1988 1593
1989 1251
1990 805
1991 1541
1992 1636
1993 1374
1994 696
1995 231
1996 593
1997 687
1998 1620
1999 370
2000 51
2001 1983
2002 1272
2003 787
2004 208
2005 185
2006 109
2007 1524
2008 908
2009 709
2010 1189
2011 1478
2012 1670
2013 1814
2014 1954
2015 1674
2016 1120
2017 1876
2018 91
2019 1301
2020 1726
2021 1026
2022 1376
2023 533
2024 1902
2025 835
2026 932
2027 159
2028 950
2029 1138
2030 1100
2031 331
2032 777
2033 1381
2034 1478
2035 1477
2036 1968
2037 1414
2038 276
2039 1189
2040 1908
2041 1302
2042 679
2043 1434
2044 295
2045 1538
2046 1093
2047 86
