{
    "name": "Request Log",
    "namespace": "Botble\\RequestLog\\",
    "provider": "Botble\\RequestLog\\Providers\\RequestLogServiceProvider",
    "author": "Sang Nguyen",
    "url": "https://sangnguyen.info",
    "version": "5.3",
    "description": "Log error requests"
}
