{
    "name": "Contact Form",
    "namespace": "Botble\\Contact\\",
    "provider": "Botble\\Contact\\Providers\\ContactServiceProvider",
    "author": "Sang Nguyen",
    "url": "https://sangnguyen.info",
    "version": "5.3",
    "description": "Contact Form"
}
