{
  "name": "Simple Slider",
  "namespace": "Botble\\SimpleSlider\\",
  "provider": "Botble\\SimpleSlider\\Providers\\SimpleSliderServiceProvider",
  "author": "Sang Nguyen",
  "url": "https://sangnguyen.info",
  "version": "5.2",
  "description": "A plugin to create sliders"
}
