[
    {
        "model": "animeflix_app.categoria",
        "pk": 1,
        "fields": {
            "descrizione": "Film"
        }
    },
    {
        "model": "animeflix_app.categoria",
        "pk": 1,
        "fields": {
            "descrizione": "Serie TV"
        }
    },
    {
        "model": "animeflix_app.categoria",
        "pk": 1,
        "fields": {
            "descrizione": "Serie OAV"
        }
    }
]