[
    {
        "model": "forum.post",
        "pk": 1,
        "fields": {
            "message": "Primissimo post del thread1 prova - EDIT",
            "creation_date": "2021-07-19 18:34:16.811697+00",
            "mod_date": "2021-08-16 09:26:41.637949+00",
            "author": 32,
            "id_thread": 5,
            "is_thread_post": true,
            "quote": null
        }
    },
    {
        "model": "forum.post",
        "pk": 2,
        "fields": {
            "message": "Primissimo post thread2 prova",
            "creation_date": "2021-07-19 18:36:34.202853+00",
            "mod_date": "2021-07-19 18:36:34.202875+00",
            "author": 32,
            "id_thread": 6,
            "is_thread_post": true,
            "quote": null
        }
    },
    {
        "model": "forum.post",
        "pk": 3,
        "fields": {
            "message": "Primissimo post del thread3 prova",
            "creation_date": "2021-07-19 18:42:21.193573+00",
            "mod_date": "2021-07-19 18:42:21.193638+00",
            "author": 32,
            "id_thread": 7,
            "is_thread_post": true,
            "quote": null
        }
    },
    {
        "model": "forum.post",
        "pk": 4,
        "fields": {
            "message": "Primissimo post del thread4 prova",
            "creation_date": "2021-07-19 18:45:03.888178+00",
            "mod_date": "2021-07-19 18:45:03.888197+00",
            "author": 32,
            "id_thread": 8,
            "is_thread_post": true,
            "quote": null
        }
    },
    {
        "model": "forum.post",
        "pk": 5,
        "fields": {
            "message": "Primissimo post del thread5 prova",
            "creation_date": "2021-07-19 18:49:51.602565+00",
            "mod_date": "2021-07-19 18:49:51.602598+00",
            "author": 32,
            "id_thread": 9,
            "is_thread_post": true,
            "quote": null
        }
    },
    {
        "model": "forum.post",
        "pk": 6,
        "fields": {
            "message": "QUE BELLISSIMO THREAD!!!!!!!!!!!!!!!!!!",
            "creation_date": "2021-07-20 20:48:17.483578+00",
            "mod_date": "2021-07-20 20:48:17.483596+00",
            "author": 36,
            "id_thread": 11,
            "is_thread_post": true,
            "quote": null
        }
    },
    {
        "model": "forum.post",
        "pk": 7,
        "fields": {
            "message": "QUE BELLISSIMO THREAD!!!!!!!!!!!!!!!!!!",
            "creation_date": "2021-07-20 20:49:09.158927+00",
            "mod_date": "2021-07-20 20:49:09.158942+00",
            "author": 36,
            "id_thread": 12,
            "is_thread_post": false,
            "quote": null
        }
    },
    {
        "model": "forum.post",
        "pk": 8,
        "fields": {
            "message": "Thread interessante!",
            "creation_date": "2021-07-23 11:10:43.207552+00",
            "mod_date": "2021-07-23 11:10:43.207616+00",
            "author": 34,
            "id_thread": 5,
            "is_thread_post": false,
            "quote": null
        }
    },
    {
        "model": "forum.post",
        "pk": 9,
        "fields": {
            "message": "'Grazie mille!!!",
            "creation_date": "2021-07-31 14:05:50.827782+00",
            "mod_date": "2021-08-13 13:26:35.827946+00",
            "author": 32,
            "id_thread": 5,
            "is_thread_post": false,
            "quote": null
        }
    },
    {
        "model": "forum.post",
        "pk": 19,
        "fields": {
            "message": "Ciao ragazzi!\nHo aperto questa discussione per parlare della fiera Rimini Comix di quest''anno.\nSono curioso di sapere se molti di voi ci sono andati e che differenze avete notato rispetto agli anni pre-covid?",
            "creation_date": "2021-08-02 10:17:30.637052+00",
            "mod_date": "2021-08-02 10:17:30.637096+00",
            "author": 32,
            "id_thread": 13,
            "is_thread_post": true,
            "quote": null
        }
    },
    {
        "model": "forum.post",
        "pk": 22,
        "fields": {
            "message": "Ciao a tutti !! :D\n\nIo quest''anno sono riuscito ad andare alla fiera, anche se un po'' titubante inizialmente.\nSinceramente, sono rimasto un po'' deluso dagli stand presenti, però mi è piaciuto molto vedere la gara di cosplay!",
            "creation_date": "2021-08-02 21:56:36.824403+00",
            "mod_date": "2021-08-02 21:56:36.824438+00",
            "author": 32,
            "id_thread": 13,
            "is_thread_post": false,
            "quote": 19
        }
    },
    {
        "model": "forum.post",
        "pk": 23,
        "fields": {
            "message": "Purtroppo da quando è sorta la pandemia io sono barricata in casa :''(",
            "creation_date": "2021-08-02 22:12:06.347508+00",
            "mod_date": "2021-08-02 22:12:06.34757+00",
            "author": 32,
            "id_thread": 13,
            "is_thread_post": false,
            "quote": null
        }
    },
    {
        "model": "forum.post",
        "pk": 101,
        "fields": {
            "message": "Novit&agrave; su attack on titan 4 seconda parte??",
            "creation_date": "2021-08-12 16:58:34.817809+00",
            "mod_date": "2021-08-12 16:58:34.817935+00",
            "author": 32,
            "id_thread": 58,
            "is_thread_post": true,
            "quote": null
        }
    },
    {
        "model": "forum.post",
        "pk": 109,
        "fields": {
            "message": "risposta con quote - <strong><em>EDIT</em></strong>",
            "creation_date": "2021-08-13 14:16:56.845101+00",
            "mod_date": "2021-08-13 15:57:49.854482+00",
            "author": 32,
            "id_thread": 5,
            "is_thread_post": false,
            "quote": 9
        }
    },
    {
        "model": "forum.post",
        "pk": 118,
        "fields": {
            "message": "<em>prova</em> <strong>TEXT EDITOR</strong>",
            "creation_date": "2021-08-21 09:13:24.176857+00",
            "mod_date": "2021-08-21 09:13:24.17694+00",
            "author": 32,
            "id_thread": 5,
            "is_thread_post": false,
            "quote": null
        }
    },
    {
        "model": "forum.post",
        "pk": 119,
        "fields": {
            "message": "check post counters",
            "creation_date": "2021-08-21 09:31:59.135459+00",
            "mod_date": "2021-08-21 09:31:59.135524+00",
            "author": 32,
            "id_thread": 5,
            "is_thread_post": false,
            "quote": 118
        }
    },
    {
        "model": "forum.post",
        "pk": 154,
        "fields": {
            "message": "risposta di prova",
            "creation_date": "2021-08-22 19:59:22.988539+00",
            "mod_date": "2021-08-22 19:59:22.988671+00",
            "author": 32,
            "id_thread": 5,
            "is_thread_post": false,
            "quote": null
        }
    },
    {
        "model": "forum.post",
        "pk": 155,
        "fields": {
            "message": "post di prova",
            "creation_date": "2021-08-25 16:12:01.118726+00",
            "mod_date": "2021-08-25 16:12:01.118745+00",
            "author": 32,
            "id_thread": 5,
            "is_thread_post": false,
            "quote": 1
        }
    },
    {
        "model": "forum.post",
        "pk": 156,
        "fields": {
            "message": "Ragaziiiii, tutti pronti per la new season di JOJO ???? *_* *_*",
            "creation_date": "2021-08-28 10:12:01.118726+00",
            "mod_date": "2021-08-28 10:12:01.118745+00",
            "author": 32,
            "id_thread": 59,
            "is_thread_post": true,
            "quote": null
        }
    },
    {
        "model": "forum.post",
        "pk": 157,
        "fields": {
            "message": "non è possibile che DBS (Dragon Ball Super, per i non conoscenti) stia per finire!!!!",
            "creation_date": "2021-09-15 11:23:01.118726+00",
            "mod_date": "2021-09-15 11:23:01.118745+00",
            "author": 36,
            "id_thread": 60,
            "is_thread_post": true,
            "quote": null
        }
    },
    {
        "model": "forum.post",
        "pk": 158,
        "fields": {
            "message": "eehhhh, che ci vuoi fare? purtroppo, il suo studio d'animazione non lavora per la tua ultima soddisfazione\n\\¯\\_(ツ)_/¯",
            "creation_date": "2021-09-15 11:25:01.118726+00",
            "mod_date": "2021-09-15 11:25:01.118745+00",
            "author": 43,
            "id_thread": 60,
            "is_thread_post": false,
            "quote": 157
        }
    },
    {
        "model": "forum.post",
        "pk": 159,
        "fields": {
            "message": "shut\n<img src='https://br.ifunny.co/picture/Spj7H0FB9?s=cl' />",
            "creation_date": "2021-09-15 11:41:01.118726+00",
            "mod_date": "2021-09-15 11:41:01.118745+00",
            "author": 36,
            "id_thread": 60,
            "is_thread_post": false,
            "quote": 158
        }
    },
    {
        "model": "forum.post",
        "pk": 160,
        "fields": {
            "message": "Ehi, fottuti anime-addicted!\n\nÈ giunto il momento di fare chiarezza qui. Ho visto cosa è questo forum, e sono stufo di vedere un mucchio di dilettanti che pensano di avere la situazione sotto controllo. Bene, ora tocca a me. Io DOMINERO questo forum, e non ci sarà nulla che possiate fare per fermarmi.\n\nNon ho bisogno del vostro benvenuto o della vostra accettazione. So che sono il migliore e questo posto presto capirà perché. Preparatevi a essere sconvolti e sorpresi, perché cambierò le regole del gioco e non ci sarà più spazio per i deboli.\n\nPreparatevi a essere dominati, anime-addicted. È arrivato il mio momento e non c'è nulla che possiate fare per fermarmi.",
            "creation_date": "2021-09-16 11:41:01.118726+00",
            "mod_date": "2021-09-16 11:41:01.118745+00",
            "author": 43,
            "id_thread": 61,
            "is_thread_post": true,
            "quote": null
        }
    },
    {
        "model": "forum.post",
        "pk": 161,
        "fields": {
            "message": "Oh, guarda chi abbiamo qui, un piccolo tiranno che pensa di poter controllare tutto. Non sei il primo e non sarai l'ultimo a provare a dominare questo forum. Ma ti avverto, il nostro amore per gli anime è più forte di qualsiasi vanità umana. Vedremo quanto durerà il tuo \"dominio.\"",
            "creation_date": "2021-09-16 16:41:01.118726+00",
            "mod_date": "2021-09-16 16:41:01.118745+00",
            "author": 44,
            "id_thread": 61,
            "is_thread_post": false,
            "quote": null
        }
    },
    {
        "model": "forum.post",
        "pk": 162,
        "fields": {
            "message": "Interessante. Vedremo se riesci a mantenere la tua promessa. Sono stato qui abbastanza a lungo da vedere molte persone venire e andare, tutte con grandi pretese di grandezza. Ma finora nessuno ha dimostrato di essere all'altezza. Dimostra di avere il carattere per sopravvivere in questo gioco, altrimenti verrai schiacciato come tutti gli altri.",
            "creation_date": "2021-09-16 19:01:01.118726+00",
            "mod_date": "2021-09-16 19:01:01.118745+00",
            "author": 45,
            "id_thread": 61,
            "is_thread_post": false,
            "quote": 160
        }
    },
    {
        "model": "forum.post",
        "pk": 163,
        "fields": {
            "message": "Ciao a tutti gli appassionati di anime!\n\nBenvenuti a una nuova settimana piena di emozionanti episodi! Questa settimana voglio concentrarmi su una serie di anime che ci ha fatto riflettere e ci ha portato ad affrontare tematiche profonde e significative.\nVorrei iniziare la discussione su \"Neon Genesis Evangelion\", una serie che ha affrontato argomenti complessi come l'identità, la solitudine e il significato della vita. Quali sono i vostri pensieri su questa serie? Cosa ne pensate dei suoi messaggi filosofici e psicologici?\n\nInoltre, vorrei parlare di \"Serial Experiments Lain\", un'altra serie che ha esplorato il confine tra la realtà e la tecnologia, portando gli spettatori a riflettere sulle conseguenze della connessione digitale e della perdita dell'identità personale.\n\nInfine, vorrei dedicare un momento a \"Steins;Gate\", una serie che mescola viaggi nel tempo con dilemmi morali e conseguenze impreviste. Come ha influenzato il vostro modo di pensare e cosa vi ha lasciato la sua trama complessa?\n\nUnisciti alla discussione e condividi le tue opinioni su questi anime e altri che ritieni abbiano stimolato il tuo pensiero critico e ti hanno fatto riflettere sulla vita e sulle sue sfide.\nAttendiamo con ansia le vostre opinioni e i vostri pensieri!",
            "creation_date": "2021-09-16 22:01:01.118726+00",
            "mod_date": "2021-09-16 22:01:01.118745+00",
            "author": 36,
            "id_thread": 62,
            "is_thread_post": true,
            "quote": null
        }
    }
]