{
    "$schema": "https://json-schema.org/draft/2020-12/schema",
    "title": "ClearChargingProfileResponse",
    "type": "object",
    "properties": {
        "status": {
            "type": "string",
            "enum": [
                "Accepted",
                "Unknown"
            ],
            "title": "ClearChargingProfileStatus"
        }
    },
    "additionalProperties": false,
    "required": [
        "status"
    ]
}
