{
    "$schema": "https://json-schema.org/draft/2020-12/schema",
    "title": "ClearChargingProfileRequest",
    "type": "object",
    "properties": {
        "id": {
            "type": "integer"
        },
        "connectorId": {
            "type": "integer"
        },
        "chargingProfilePurpose": {
            "type": "string",
            "enum": [
                "ChargePointMaxProfile",
                "TxDefaultProfile",
                "TxProfile"
            ],
            "title": "ChargingProfilePurpose"
        },
        "stackLevel": {
            "type": "integer"
        }
    },
    "additionalProperties": false
}
