{
	"info": {
		"_postman_id": "327d2242-6e41-4301-bbeb-0db3d403829e",
		"name": "S37-S41",
		"schema": "https://schema.getpostman.com/json/collection/v2.1.0/collection.json"
	},
	"item": [
		{
			"name": "CHECK EMAIL",
			"request": {
				"method": "POST",
				"header": [],
				"body": {
					"mode": "raw",
					"raw": "{\r\n    \"email\" : \"\"\r\n}",
					"options": {
						"raw": {
							"language": "json"
						}
					}
				},
				"url": {
					"raw": "localhost:4000/checkEmail",
					"host": [
						"localhost"
					],
					"port": "4000",
					"path": [
						"checkEmail"
					]
				}
			},
			"response": []
		},
		{
			"name": "REGISTER USER",
			"request": {
				"method": "POST",
				"header": [],
				"body": {
					"mode": "raw",
					"raw": "{\r\n    \"firstName\" : \"John\",\r\n    \"lastName\" : \"Smith\",\r\n    \"email\" : \"john@mail.com\",\r\n    \"mobileNo\" : \"09123456789\",\r\n    \"password\" : \"john1234\"\r\n}",
					"options": {
						"raw": {
							"language": "json"
						}
					}
				},
				"url": {
					"raw": "localhost:4000/users/register",
					"host": [
						"localhost"
					],
					"port": "4000",
					"path": [
						"users",
						"register"
					]
				}
			},
			"response": []
		},
		{
			"name": "USER AUTH",
			"request": {
				"method": "POST",
				"header": []
			},
			"response": []
		},
		{
			"name": "USER DETAILS",
			"request": {
				"method": "POST",
				"header": [],
				"body": {
					"mode": "raw",
					"raw": "{\r\n    \"id\" : \"63c89273631cd4895f2da418\"\r\n}",
					"options": {
						"raw": {
							"language": "json"
						}
					}
				},
				"url": {
					"raw": "localhost:4000/users/details",
					"host": [
						"localhost"
					],
					"port": "4000",
					"path": [
						"users",
						"details"
					]
				}
			},
			"response": []
		},
		{
			"name": "LOGIN USER",
			"request": {
				"method": "GET",
				"header": []
			},
			"response": []
		},
		{
			"name": "CREATE COURSE",
			"request": {
				"auth": {
					"type": "bearer",
					"bearer": [
						{
							"key": "token",
							"value": "eyJhbGciOiJIUzI1NiIsInR5cCI6IkpXVCJ9.eyJpZCI6IjYzYzg5MjczNjMxY2Q0ODk1ZjJkYTQxOCIsImVtYWlsIjoiZGVMZW9uQG1haWwuY29tIiwiaXNBZG1pbiI6dHJ1ZSwiaWF0IjoxNjc0MTA5OTAyfQ.6lMuqvCKpNJVW0yK1OSWHDMlg2K9aE1XvJdlWXpPP9g",
							"type": "string"
						}
					]
				},
				"method": "POST",
				"header": [],
				"body": {
					"mode": "raw",
					"raw": "{\r\n    \"name\" : \"SKILL\",\r\n    \"description\" : \"Balance a bottle in your forehead\",\r\n    \"price\" : 250\r\n}",
					"options": {
						"raw": {
							"language": "json"
						}
					}
				},
				"url": {
					"raw": "localhost:4000/courses",
					"host": [
						"localhost"
					],
					"port": "4000",
					"path": [
						"courses"
					]
				}
			},
			"response": []
		},
		{
			"name": "RETRIEVE ALL COURSES",
			"request": {
				"method": "GET",
				"header": []
			},
			"response": []
		},
		{
			"name": "ACTIVE COURSES",
			"protocolProfileBehavior": {
				"disableBodyPruning": true
			},
			"request": {
				"method": "GET",
				"header": [],
				"body": {
					"mode": "raw",
					"raw": ""
				},
				"url": {
					"raw": "localhost:4000/courses/active",
					"host": [
						"localhost"
					],
					"port": "4000",
					"path": [
						"courses",
						"active"
					]
				}
			},
			"response": []
		},
		{
			"name": "RETRIEVE SPECIFIC COURSE",
			"request": {
				"method": "GET",
				"header": []
			},
			"response": []
		},
		{
			"name": "UPDATE COURSE",
			"request": {
				"method": "PUT",
				"header": [],
				"url": {
					"raw": "localhost:4000/courses/63c8b7d1b13daa34e31e2de2",
					"host": [
						"localhost"
					],
					"port": "4000",
					"path": [
						"courses",
						"63c8b7d1b13daa34e31e2de2"
					]
				}
			},
			"response": []
		},
		{
			"name": "ARCHIVE COURSE",
			"request": {
				"method": "GET",
				"header": []
			},
			"response": []
		}
	]
}