{
	"info": {
		"_postman_id": "4806580c-917c-4990-8700-2571149e1520",
		"name": "S33 Activity",
		"schema": "https://schema.getpostman.com/json/collection/v2.1.0/collection.json"
	},
	"item": [
		{
			"name": "GET TODO",
			"request": {
				"method": "GET",
				"header": []
			},
			"response": []
		},
		{
			"name": "POST HTTP",
			"request": {
				"method": "POST",
				"header": [],
				"body": {
					"mode": "raw",
					"raw": "{\r\n\t\t\"title\": \"Created to Do List Item\",\r\n\t\t\"userId\": 1,\r\n\t\t\"Completed\": false\r\n\t}",
					"options": {
						"raw": {
							"language": "json"
						}
					}
				},
				"url": {
					"raw": "https://jsonplaceholder.typicode.com/todos",
					"protocol": "https",
					"host": [
						"jsonplaceholder",
						"typicode",
						"com"
					],
					"path": [
						"todos"
					]
				}
			},
			"response": []
		},
		{
			"name": "PUT HTTP",
			"request": {
				"method": "PUT",
				"header": []
			},
			"response": []
		},
		{
			"name": "PATCH HTTP",
			"request": {
				"method": "PATCH",
				"header": []
			},
			"response": []
		},
		{
			"name": "DELETE HTTP",
			"request": {
				"method": "DELETE",
				"header": [],
				"url": {
					"raw": "https://jsonplaceholder.typicode.com/todos",
					"protocol": "https",
					"host": [
						"jsonplaceholder",
						"typicode",
						"com"
					],
					"path": [
						"todos"
					]
				}
			},
			"response": []
		}
	]
}